<mxfile host="app.diagrams.net" modified="2023-03-28T07:58:50.564Z" agent="Mozilla/5.0 (X11; Linux x86_64) AppleWebKit/537.36 (KHTML, like Gecko) Chrome/111.0.0.0 Safari/537.36" etag="W7Zp7DlcHSLzlDBrkrkm" version="21.1.1" type="device">
  <diagram id="2X9C2N0nHa1GCPFgrfg9" name="Page-1">
    <mxGraphModel dx="1259" dy="658" grid="1" gridSize="10" guides="1" tooltips="1" connect="1" arrows="1" fold="1" page="1" pageScale="1" pageWidth="827" pageHeight="1169" math="0" shadow="0">
      <root>
        <mxCell id="0" />
        <mxCell id="1" parent="0" />
        <mxCell id="X70fVD4fyHUCH9c_VhUw-7" value="Utilisateurs" style="swimlane;fontStyle=1;align=center;verticalAlign=top;childLayout=stackLayout;horizontal=1;startSize=26;horizontalStack=0;resizeParent=1;resizeParentMax=0;resizeLast=0;collapsible=1;marginBottom=0;whiteSpace=wrap;html=1;" parent="1" vertex="1">
          <mxGeometry x="350" y="40" width="160" height="170" as="geometry" />
        </mxCell>
        <mxCell id="X70fVD4fyHUCH9c_VhUw-8" value="email" style="text;strokeColor=none;fillColor=none;align=left;verticalAlign=top;spacingLeft=4;spacingRight=4;overflow=hidden;rotatable=0;points=[[0,0.5],[1,0.5]];portConstraint=eastwest;whiteSpace=wrap;html=1;" parent="X70fVD4fyHUCH9c_VhUw-7" vertex="1">
          <mxGeometry y="26" width="160" height="26" as="geometry" />
        </mxCell>
        <mxCell id="X70fVD4fyHUCH9c_VhUw-9" value="" style="line;strokeWidth=1;fillColor=none;align=left;verticalAlign=middle;spacingTop=-1;spacingLeft=3;spacingRight=3;rotatable=0;labelPosition=right;points=[];portConstraint=eastwest;strokeColor=inherit;" parent="X70fVD4fyHUCH9c_VhUw-7" vertex="1">
          <mxGeometry y="52" width="160" height="8" as="geometry" />
        </mxCell>
        <mxCell id="X70fVD4fyHUCH9c_VhUw-10" value="creerRetro( )&lt;br&gt;supprimerRetro( )&lt;br&gt;creerFeedback( )&amp;nbsp;&lt;br&gt;seConnecter( )&lt;br&gt;Inscription( )&lt;br&gt;seDeconnecter( )" style="text;strokeColor=none;fillColor=none;align=left;verticalAlign=top;spacingLeft=4;spacingRight=4;overflow=hidden;rotatable=0;points=[[0,0.5],[1,0.5]];portConstraint=eastwest;whiteSpace=wrap;html=1;" parent="X70fVD4fyHUCH9c_VhUw-7" vertex="1">
          <mxGeometry y="60" width="160" height="110" as="geometry" />
        </mxCell>
        <mxCell id="X70fVD4fyHUCH9c_VhUw-21" style="rounded=0;orthogonalLoop=1;jettySize=auto;html=1;entryX=0;entryY=0.5;entryDx=0;entryDy=0;endArrow=diamondThin;endFill=1;endSize=21;" parent="1" source="X70fVD4fyHUCH9c_VhUw-11" edge="1">
          <mxGeometry relative="1" as="geometry">
            <mxPoint x="570" y="439" as="targetPoint" />
          </mxGeometry>
        </mxCell>
        <mxCell id="X70fVD4fyHUCH9c_VhUw-11" value="Feedback" style="swimlane;fontStyle=1;align=center;verticalAlign=top;childLayout=stackLayout;horizontal=1;startSize=26;horizontalStack=0;resizeParent=1;resizeParentMax=0;resizeLast=0;collapsible=1;marginBottom=0;whiteSpace=wrap;html=1;" parent="1" vertex="1">
          <mxGeometry x="90" y="413" width="160" height="60" as="geometry" />
        </mxCell>
        <mxCell id="X70fVD4fyHUCH9c_VhUw-13" value="" style="line;strokeWidth=1;fillColor=none;align=left;verticalAlign=middle;spacingTop=-1;spacingLeft=3;spacingRight=3;rotatable=0;labelPosition=right;points=[];portConstraint=eastwest;strokeColor=inherit;" parent="X70fVD4fyHUCH9c_VhUw-11" vertex="1">
          <mxGeometry y="26" width="160" height="34" as="geometry" />
        </mxCell>
        <mxCell id="X70fVD4fyHUCH9c_VhUw-15" value="Retrospective" style="swimlane;fontStyle=1;align=center;verticalAlign=top;childLayout=stackLayout;horizontal=1;startSize=26;horizontalStack=0;resizeParent=1;resizeParentMax=0;resizeLast=0;collapsible=1;marginBottom=0;whiteSpace=wrap;html=1;" parent="1" vertex="1">
          <mxGeometry x="570" y="400" width="160" height="60" as="geometry" />
        </mxCell>
        <mxCell id="X70fVD4fyHUCH9c_VhUw-19" style="rounded=0;orthogonalLoop=1;jettySize=auto;html=1;endArrow=none;endFill=0;" parent="1" source="X70fVD4fyHUCH9c_VhUw-10" target="X70fVD4fyHUCH9c_VhUw-15" edge="1">
          <mxGeometry relative="1" as="geometry" />
        </mxCell>
        <mxCell id="X70fVD4fyHUCH9c_VhUw-20" style="rounded=0;orthogonalLoop=1;jettySize=auto;html=1;entryX=0.5;entryY=0;entryDx=0;entryDy=0;endArrow=none;endFill=0;" parent="1" source="X70fVD4fyHUCH9c_VhUw-10" target="X70fVD4fyHUCH9c_VhUw-11" edge="1">
          <mxGeometry relative="1" as="geometry" />
        </mxCell>
        <mxCell id="X70fVD4fyHUCH9c_VhUw-17" value="" style="line;strokeWidth=1;fillColor=none;align=left;verticalAlign=middle;spacingTop=-1;spacingLeft=3;spacingRight=3;rotatable=0;labelPosition=right;points=[];portConstraint=eastwest;strokeColor=inherit;" parent="1" vertex="1">
          <mxGeometry x="570" y="439" width="160" height="8" as="geometry" />
        </mxCell>
      </root>
    </mxGraphModel>
  </diagram>
</mxfile>
