{
  "CalcObjectConfig": [
    {
      "Number": 1,
      "SQLServer": "DESKTOP\\SRV",
      "DataBaseName": "ManualLoger",
      "TableName": "PIData",
      "PIServerName": "DESKTOP",
      "Mode": "F",
      "TagArray": []
    },
    {
      "Number": 2,
      "SQLServer": "DESKTOP\\SRV",
      "DataBaseName": "ManualLoger",
      "TableName": "PIData",
      "PIServerName": "DESKTOP",
      "Mode": "S",
      "TagArray": []
    },
    {
      "Number": 3,
      "SQLServer": "DESKTOP\\SRV",
      "DataBaseName": "ManualLoger",
      "TableName": "PIData",
      "PIServerName": "DESKTOP",
      "Mode": "RW",
      "TagArray": [
        "BA:CONC.1",
        "BA:LEVEL.1",
        "BA:TEMP.1",
        "ATVB:FI615-2.F",
        "24-2000:FI0558.WC",
        "24-2000:FI0558.F",
        "TSB:415.L",
        "TSB:415.T",
        "TSB:507.L",
        "LIMS:TSB.507.D15",
        "TSB:TIA507.T",
        "AVT6:FQIR9947.WC",
        "AVT6:FQI0039.F",
        "AVT6:FQI0025.F",
        "AVT6:FI0707.WC",
        "AVT6:FQI0041.F",
        "AVT6:FI0991.WC",
        "AVT6:FI9970.WC",
        "AVT6:FI9956.F",
        "AVT6:FI9957.F",
        "AVT6:FI9958.F",
        "AVT6:FQIR9946.WC",
        "ATVB:FQI129.F",
        "AVT6:FIR0021.WC",
        "24-2000:FI151.WC",
        "24-2000:FI152.WC",
        "24-2000:FI435.F",
        "ATVB:FI607.F",
        "ATVB:FI609.F",
        "ATVB:FIR127.F",
        "24-2000:BE-1.WC",
        "24-2000:BE-2.WC",
        "24-2000:BE-3.WC",
        "24-2000:BE-4.WC",
        "ATVB:FI615-1.F",
        "MTBE:FI521.F",
        "sy.st.SERVER1.rmp_sk1.sc1",
        "sy.st.SERVER1.rmp_sk1.sc2",
        "sy.st.SERVER1.rmp_sk1.sc3",
        "AVT6:FQIR0977-1.F",
        "KUPN:U610.FI6103B.PV",
        "24_5:LIRA1362.P"
      ]
    }
  ]
}