{
  "CalcObjectConfig": [
    {
      "Number": 1,
      "SQLServer": "DESKTOP\\SRV",
      "DataBaseName": "ManualLoger",
      "TableName": "PIData",
      "PIServerName": "DESKTOP",
      "Mode": "Full",
      "TagArray": [ "ATVB:FI615-1.F", "AVT6:FI9956.F", "AVT6:FQI0025.F" ]
    },
    {
      "Number": 2,
      "SQLServer": "DESKTOP\\SRV",
      "DataBaseName": "ManualLoger",
      "TableName": "PIData",
      "PIServerName": "DESKTOP",
      "Mode": "Snapshot",
      "TagArray": [ "AVT6:FI9957.F", "24_5:LIRA1362.P" ]
    },
    {
      "Number": 3,
      "SQLServer": "DESKTOP\\SRV",
      "DataBaseName": "ManualLoger",
      "TableName": "PIData",
      "PIServerName": "DESKTOP",
      "Mode": "ReplaceSnapshot",
      "TagArray": [ "AVT6:FQIR0977-1.F", "AVT6:FQI0041.F" ]
      //},
      //{
      //  "Number": 4,
      //  "SQLServer": "sql1",
      //  "DataBaseName": "db4",
      //  "TableName": "Table4",
      //  "PIServerName": "srv1",
      //  "TagArray": [ "tag31", "tag25", "tag38" ]
      //},
      //{
      //  "Number": 5,
      //  "SQLServer": "sql1",
      //  "DataBaseName": "db5",
      //  "TableName": "Table5",
      //  "PIServerName": "srv1",
      //  "TagArray": [ "tag41", "tag24", "tag37" ]
    }
  ]
}