{
    "development": {
      "username": "postgres",
      "password": 20863638,
      "database": "HuntersHub",
      "host": "127.0.0.1",
      "dialect": "postgresql"
    },
    "test": {
      "username": "postgres",
      "password": 20863638,
      "database": "HuntersHub",
      "host": "127.0.0.1",
      "dialect": "postgresql"
    },
    "production": {
      "username": "postgres",
      "password": 20863638,
      "database": "HuntersHub",
      "host": "127.0.0.1",
      "dialect": "postgresql"
    }
  }