-2.000000,32.000000
-1.996000,31.983410
-1.992000,31.966777
-1.988000,31.950109
-1.984000,31.933415
-1.980000,31.916701
-1.976000,31.899975
-1.972000,31.883246
-1.968000,31.866522
-1.964000,31.849809
-1.960000,31.833118
-1.956000,31.816454
-1.952000,31.799827
-1.948000,31.783245
-1.944000,31.766715
-1.940000,31.750245
-1.936000,31.733844
-1.932000,31.717520
-1.928000,31.701280
-1.924000,31.685133
-1.920000,31.669087
-1.916000,31.653149
-1.912000,31.637327
-1.908000,31.621630
-1.904000,31.606065
-1.900000,31.590639
-1.896000,31.575362
-1.892000,31.560239
-1.888000,31.545280
-1.884000,31.530491
-1.880000,31.515879
-1.876000,31.501453
-1.872000,31.487220
-1.868000,31.473186
-1.864000,31.459359
-1.860000,31.445746
-1.856000,31.432353
-1.852000,31.419189
-1.848000,31.406258
-1.844000,31.393568
-1.840000,31.381126
-1.836000,31.368938
-1.832000,31.357009
-1.828000,31.345346
-1.824000,31.333955
-1.820000,31.322842
-1.816000,31.312013
-1.812000,31.301472
-1.808000,31.291225
-1.804000,31.281278
-1.800000,31.271635
-1.796000,31.262302
-1.792000,31.253283
-1.788000,31.244582
-1.784000,31.236204
-1.780000,31.228153
-1.776000,31.220434
-1.772000,31.213049
-1.768000,31.206003
-1.764000,31.199298
-1.760000,31.192939
-1.756000,31.186929
-1.752000,31.181269
-1.748000,31.175963
-1.744000,31.171013
-1.740000,31.166421
-1.736000,31.162190
-1.732000,31.158321
-1.728000,31.154816
-1.724000,31.151676
-1.720000,31.148903
-1.716000,31.146496
-1.712000,31.144458
-1.708000,31.142788
-1.704000,31.141487
-1.700000,31.140555
-1.696000,31.139991
-1.692000,31.139796
-1.688000,31.139968
-1.684000,31.140508
-1.680000,31.141412
-1.676000,31.142682
-1.672000,31.144314
-1.668000,31.146307
-1.664000,31.148659
-1.660000,31.151369
-1.656000,31.154432
-1.652000,31.157848
-1.648000,31.161612
-1.644000,31.165722
-1.640000,31.170175
-1.636000,31.174966
-1.632000,31.180092
-1.628000,31.185550
-1.624000,31.191334
-1.620000,31.197440
-1.616000,31.203864
-1.612000,31.210600
-1.608000,31.217645
-1.604000,31.224991
-1.600000,31.232634
-1.596000,31.240568
-1.592000,31.248787
-1.588000,31.257285
-1.584000,31.266056
-1.580000,31.275093
-1.576000,31.284388
-1.572000,31.293936
-1.568000,31.303730
-1.564000,31.313761
-1.560000,31.324023
-1.556000,31.334507
-1.552000,31.345206
-1.548000,31.356113
-1.544000,31.367218
-1.540000,31.378513
-1.536000,31.389990
-1.532000,31.401641
-1.528000,31.413456
-1.524000,31.425427
-1.520000,31.437544
-1.516000,31.449798
-1.512000,31.462181
-1.508000,31.474681
-1.504000,31.487291
-1.500000,31.500000
-1.496000,31.512798
-1.492000,31.525676
-1.488000,31.538623
-1.484000,31.551629
-1.480000,31.564685
-1.476000,31.577779
-1.472000,31.590901
-1.468000,31.604042
-1.464000,31.617190
-1.460000,31.630335
-1.456000,31.643467
-1.452000,31.656574
-1.448000,31.669646
-1.444000,31.682672
-1.440000,31.695642
-1.436000,31.708544
-1.432000,31.721368
-1.428000,31.734103
-1.424000,31.746739
-1.420000,31.759263
-1.416000,31.771666
-1.412000,31.783937
-1.408000,31.796064
-1.404000,31.808038
-1.400000,31.819847
-1.396000,31.831480
-1.392000,31.842928
-1.388000,31.854179
-1.384000,31.865222
-1.380000,31.876049
-1.376000,31.886647
-1.372000,31.897007
-1.368000,31.907118
-1.364000,31.916970
-1.360000,31.926554
-1.356000,31.935859
-1.352000,31.944875
-1.348000,31.953593
-1.344000,31.962003
-1.340000,31.970095
-1.336000,31.977861
-1.332000,31.985291
-1.328000,31.992376
-1.324000,31.999107
-1.320000,32.005475
-1.316000,32.011472
-1.312000,32.017089
-1.308000,32.022319
-1.304000,32.027152
-1.300000,32.031582
-1.296000,32.035600
-1.292000,32.039199
-1.288000,32.042372
-1.284000,32.045112
-1.280000,32.047412
-1.276000,32.049265
-1.272000,32.050665
-1.268000,32.051605
-1.264000,32.052080
-1.260000,32.052085
-1.256000,32.051613
-1.252000,32.050659
-1.248000,32.049219
-1.244000,32.047287
-1.240000,32.044860
-1.236000,32.041933
-1.232000,32.038503
-1.228000,32.034565
-1.224000,32.030116
-1.220000,32.025153
-1.216000,32.019674
-1.212000,32.013676
-1.208000,32.007157
-1.204000,32.000114
-1.200000,31.992547
-1.196000,31.984454
-1.192000,31.975833
-1.188000,31.966684
-1.184000,31.957008
-1.180000,31.946803
-1.176000,31.936069
-1.172000,31.924808
-1.168000,31.913020
-1.164000,31.900707
-1.160000,31.887869
-1.156000,31.874509
-1.152000,31.860628
-1.148000,31.846229
-1.144000,31.831315
-1.140000,31.815889
-1.136000,31.799954
-1.132000,31.783513
-1.128000,31.766572
-1.124000,31.749133
-1.120000,31.731203
-1.116000,31.712785
-1.112000,31.693885
-1.108000,31.674508
-1.104000,31.654661
-1.100000,31.634350
-1.096000,31.613581
-1.092000,31.592361
-1.088000,31.570697
-1.084000,31.548597
-1.080000,31.526068
-1.076000,31.503119
-1.072000,31.479757
-1.068000,31.455992
-1.064000,31.431832
-1.060000,31.407287
-1.056000,31.382366
-1.052000,31.357079
-1.048000,31.331436
-1.044000,31.305448
-1.040000,31.279125
-1.036000,31.252477
-1.032000,31.225517
-1.028000,31.198256
-1.024000,31.170705
-1.020000,31.142876
-1.016000,31.114781
-1.012000,31.086433
-1.008000,31.057845
-1.004000,31.029030
-1.000000,31.000000
-0.996000,30.970769
-0.992000,30.941350
-0.988000,30.911758
-0.984000,30.882006
-0.980000,30.852109
-0.976000,30.822080
-0.972000,30.791935
-0.968000,30.761688
-0.964000,30.731354
-0.960000,30.700948
-0.956000,30.670485
-0.952000,30.639981
-0.948000,30.609452
-0.944000,30.578912
-0.940000,30.548378
-0.936000,30.517866
-0.932000,30.487391
-0.928000,30.456970
-0.924000,30.426619
-0.920000,30.396354
-0.916000,30.366193
-0.912000,30.336150
-0.908000,30.306244
-0.904000,30.276490
-0.900000,30.246905
-0.896000,30.217506
-0.892000,30.188310
-0.888000,30.159333
-0.884000,30.130593
-0.880000,30.102105
-0.876000,30.073888
-0.872000,30.045957
-0.868000,30.018330
-0.864000,29.991024
-0.860000,29.964054
-0.856000,29.937438
-0.852000,29.911193
-0.848000,29.885336
-0.844000,29.859881
-0.840000,29.834847
-0.836000,29.810250
-0.832000,29.786106
-0.828000,29.762431
-0.824000,29.739241
-0.820000,29.716552
-0.816000,29.694381
-0.812000,29.672742
-0.808000,29.651652
-0.804000,29.631126
-0.800000,29.611179
-0.796000,29.591827
-0.792000,29.573084
-0.788000,29.554965
-0.784000,29.537484
-0.780000,29.520657
-0.776000,29.504497
-0.772000,29.489019
-0.768000,29.474235
-0.764000,29.460160
-0.760000,29.446807
-0.756000,29.434188
-0.752000,29.422318
-0.748000,29.411207
-0.744000,29.400869
-0.740000,29.391315
-0.736000,29.382557
-0.732000,29.374607
-0.728000,29.367476
-0.724000,29.361174
-0.720000,29.355712
-0.716000,29.351100
-0.712000,29.347349
-0.708000,29.344467
-0.704000,29.342463
-0.700000,29.341348
-0.696000,29.341128
-0.692000,29.341814
-0.688000,29.343411
-0.684000,29.345928
-0.680000,29.349372
-0.676000,29.353749
-0.672000,29.359067
-0.668000,29.365330
-0.664000,29.372544
-0.660000,29.380715
-0.656000,29.389848
-0.652000,29.399946
-0.648000,29.411014
-0.644000,29.423055
-0.640000,29.436073
-0.636000,29.450070
-0.632000,29.465049
-0.628000,29.481011
-0.624000,29.497959
-0.620000,29.515892
-0.616000,29.534812
-0.612000,29.554719
-0.608000,29.575613
-0.604000,29.597493
-0.600000,29.620358
-0.596000,29.644207
-0.592000,29.669037
-0.588000,29.694846
-0.584000,29.721632
-0.580000,29.749391
-0.576000,29.778119
-0.572000,29.807812
-0.568000,29.838466
-0.564000,29.870075
-0.560000,29.902635
-0.556000,29.936139
-0.552000,29.970581
-0.548000,30.005954
-0.544000,30.042251
-0.540000,30.079464
-0.536000,30.117585
-0.532000,30.156606
-0.528000,30.196517
-0.524000,30.237310
-0.520000,30.278975
-0.516000,30.321501
-0.512000,30.364878
-0.508000,30.409094
-0.504000,30.454139
-0.500000,30.500001
-0.496000,30.546666
-0.492000,30.594123
-0.488000,30.642359
-0.484000,30.691360
-0.480000,30.741112
-0.476000,30.791601
-0.472000,30.842812
-0.468000,30.894732
-0.464000,30.947343
-0.460000,31.000631
-0.456000,31.054580
-0.452000,31.109172
-0.448000,31.164393
-0.444000,31.220224
-0.440000,31.276648
-0.436000,31.333647
-0.432000,31.391204
-0.428000,31.449299
-0.424000,31.507916
-0.420000,31.567034
-0.416000,31.626634
-0.412000,31.686697
-0.408000,31.747203
-0.404000,31.808132
-0.400000,31.869464
-0.396000,31.931179
-0.392000,31.993255
-0.388000,32.055671
-0.384000,32.118407
-0.380000,32.181441
-0.376000,32.244751
-0.372000,32.308316
-0.368000,32.372113
-0.364000,32.436120
-0.360000,32.500316
-0.356000,32.564677
-0.352000,32.629180
-0.348000,32.693804
-0.344000,32.758524
-0.340000,32.823319
-0.336000,32.888164
-0.332000,32.953037
-0.328000,33.017913
-0.324000,33.082771
-0.320000,33.147586
-0.316000,33.212334
-0.312000,33.276992
-0.308000,33.341537
-0.304000,33.405944
-0.300000,33.470190
-0.296000,33.534251
-0.292000,33.598103
-0.288000,33.661723
-0.284000,33.725086
-0.280000,33.788170
-0.276000,33.850950
-0.272000,33.913404
-0.268000,33.975506
-0.264000,34.037235
-0.260000,34.098566
-0.256000,34.159476
-0.252000,34.219942
-0.248000,34.279941
-0.244000,34.339450
-0.240000,34.398446
-0.236000,34.456906
-0.232000,34.514809
-0.228000,34.572130
-0.224000,34.628849
-0.220000,34.684943
-0.216000,34.740391
-0.212000,34.795170
-0.208000,34.849259
-0.204000,34.902637
-0.200000,34.955284
-0.196000,35.007177
-0.192000,35.058298
-0.188000,35.108625
-0.184000,35.158138
-0.180000,35.206818
-0.176000,35.254646
-0.172000,35.301601
-0.168000,35.347666
-0.164000,35.392822
-0.160000,35.437051
-0.156000,35.480334
-0.152000,35.522654
-0.148000,35.563994
-0.144000,35.604337
-0.140000,35.643667
-0.136000,35.681967
-0.132000,35.719222
-0.128000,35.755415
-0.124000,35.790533
-0.120000,35.824560
-0.116000,35.857482
-0.112000,35.889286
-0.108000,35.919958
-0.104000,35.949484
-0.100000,35.977853
-0.096000,36.005052
-0.092000,36.031070
-0.088000,36.055894
-0.084000,36.079515
-0.080000,36.101922
-0.076000,36.123104
-0.072000,36.143053
-0.068000,36.161759
-0.064000,36.179214
-0.060000,36.195410
-0.056000,36.210338
-0.052000,36.223993
-0.048000,36.236367
-0.044000,36.247453
-0.040000,36.257248
-0.036000,36.265744
-0.032000,36.272937
-0.028000,36.278824
-0.024000,36.283400
-0.020000,36.286662
-0.016000,36.288607
-0.012000,36.289234
-0.008000,36.288540
-0.004000,36.286524
0.000000,36.283185
0.004000,36.278524
0.008000,36.272540
0.012000,36.265234
0.016000,36.256607
0.020000,36.246662
0.024000,36.235399
0.028000,36.222823
0.032000,36.208937
0.036000,36.193743
0.040000,36.177247
0.044000,36.159453
0.048000,36.140366
0.052000,36.119992
0.056000,36.098338
0.060000,36.075409
0.064000,36.051213
0.068000,36.025758
0.072000,35.999052
0.076000,35.971103
0.080000,35.941920
0.084000,35.911514
0.088000,35.879893
0.092000,35.847068
0.096000,35.813051
0.100000,35.777852
0.104000,35.741483
0.108000,35.703956
0.112000,35.665285
0.116000,35.625481
0.120000,35.584558
0.124000,35.542531
0.128000,35.499413
0.132000,35.455220
0.136000,35.409965
0.140000,35.363665
0.144000,35.316335
0.148000,35.267992
0.152000,35.218652
0.156000,35.168331
0.160000,35.117048
0.164000,35.064820
0.168000,35.011664
0.172000,34.957599
0.176000,34.902643
0.180000,34.846816
0.184000,34.790135
0.188000,34.732622
0.192000,34.674295
0.196000,34.615175
0.200000,34.555281
0.204000,34.494635
0.208000,34.433256
0.212000,34.371167
0.216000,34.308388
0.220000,34.244940
0.224000,34.180846
0.228000,34.116127
0.232000,34.050806
0.236000,33.984903
0.240000,33.918443
0.244000,33.851447
0.248000,33.783938
0.252000,33.715939
0.256000,33.647473
0.260000,33.578562
0.264000,33.509231
0.268000,33.439503
0.272000,33.369400
0.276000,33.298947
0.280000,33.228167
0.284000,33.157083
0.288000,33.085719
0.292000,33.014100
0.296000,32.942247
0.300000,32.870186
0.304000,32.797941
0.308000,32.725533
0.312000,32.652989
0.316000,32.580331
0.320000,32.507582
0.324000,32.434768
0.328000,32.361910
0.332000,32.289033
0.336000,32.216161
0.340000,32.143315
0.344000,32.070521
0.348000,31.997800
0.352000,31.925177
0.356000,31.852673
0.360000,31.780312
0.364000,31.708117
0.368000,31.636110
0.372000,31.564312
0.376000,31.492748
0.380000,31.421438
0.384000,31.350404
0.388000,31.279668
0.392000,31.209251
0.396000,31.139175
0.400000,31.069461
0.404000,31.000129
0.408000,30.931200
0.412000,30.862694
0.416000,30.794631
0.420000,30.727030
0.424000,30.659913
0.428000,30.593296
0.432000,30.527201
0.436000,30.461644
0.440000,30.396645
0.444000,30.332221
0.448000,30.268390
0.452000,30.205170
0.456000,30.142577
0.460000,30.080628
0.464000,30.019340
0.468000,29.958729
0.472000,29.898810
0.476000,29.839598
0.480000,29.781109
0.484000,29.723357
0.488000,29.666356
0.492000,29.610121
0.496000,29.554664
0.500000,29.499998
0.504000,29.446137
0.508000,29.393092
0.512000,29.340876
0.516000,29.289499
0.520000,29.238973
0.524000,29.189308
0.528000,29.140515
0.532000,29.092604
0.536000,29.045583
0.540000,28.999462
0.544000,28.954249
0.548000,28.909952
0.552000,28.866579
0.556000,28.824137
0.560000,28.782633
0.564000,28.742074
0.568000,28.702464
0.572000,28.663810
0.576000,28.626117
0.580000,28.589389
0.584000,28.553630
0.588000,28.518845
0.592000,28.485035
0.596000,28.452205
0.600000,28.420357
0.604000,28.389492
0.608000,28.359612
0.612000,28.330718
0.616000,28.302811
0.620000,28.275891
0.624000,28.249957
0.628000,28.225010
0.632000,28.201048
0.636000,28.178069
0.640000,28.156072
0.644000,28.135054
0.648000,28.115013
0.652000,28.095945
0.656000,28.077847
0.660000,28.060715
0.664000,28.044544
0.668000,28.029329
0.672000,28.015066
0.676000,28.001749
0.680000,27.989372
0.684000,27.977928
0.688000,27.967411
0.692000,27.957813
0.696000,27.949128
0.700000,27.941348
0.704000,27.934463
0.708000,27.928466
0.712000,27.923348
0.716000,27.919100
0.720000,27.915712
0.724000,27.913174
0.728000,27.911476
0.732000,27.910607
0.736000,27.910558
0.740000,27.911315
0.744000,27.912869
0.748000,27.915207
0.752000,27.918318
0.756000,27.922189
0.760000,27.926807
0.764000,27.932160
0.768000,27.938236
0.772000,27.945019
0.776000,27.952498
0.780000,27.960658
0.784000,27.969485
0.788000,27.978965
0.792000,27.989084
0.796000,27.999827
0.800000,28.011180
0.804000,28.023127
0.808000,28.035653
0.812000,28.048743
0.816000,28.062381
0.820000,28.076553
0.824000,28.091242
0.828000,28.106431
0.832000,28.122107
0.836000,28.138251
0.840000,28.154848
0.844000,28.171882
0.848000,28.189336
0.852000,28.207194
0.856000,28.225439
0.860000,28.244055
0.864000,28.263025
0.868000,28.282331
0.872000,28.301958
0.876000,28.321889
0.880000,28.342106
0.884000,28.362594
0.888000,28.383334
0.892000,28.404311
0.896000,28.425507
0.900000,28.446906
0.904000,28.468491
0.908000,28.490245
0.912000,28.512152
0.916000,28.534194
0.920000,28.556356
0.924000,28.578620
0.928000,28.600971
0.932000,28.623392
0.936000,28.645867
0.940000,28.668379
0.944000,28.690913
0.948000,28.713453
0.952000,28.735982
0.956000,28.758486
0.960000,28.780949
0.964000,28.803355
0.968000,28.825689
0.972000,28.847936
0.976000,28.870081
0.980000,28.892110
0.984000,28.914007
0.988000,28.935759
0.992000,28.957351
0.996000,28.978770
1.000000,29.000001
1.004000,29.021031
1.008000,29.041846
1.012000,29.062435
1.016000,29.082782
1.020000,29.102877
1.024000,29.122706
1.028000,29.142257
1.032000,29.161518
1.036000,29.180478
1.040000,29.199126
1.044000,29.217449
1.048000,29.235437
1.052000,29.253080
1.056000,29.270367
1.060000,29.287288
1.064000,29.303833
1.068000,29.319993
1.072000,29.335758
1.076000,29.351120
1.080000,29.366069
1.084000,29.380598
1.088000,29.394698
1.092000,29.408362
1.096000,29.421582
1.100000,29.434351
1.104000,29.446662
1.108000,29.458509
1.112000,29.469885
1.116000,29.480785
1.120000,29.491203
1.124000,29.501134
1.128000,29.510572
1.132000,29.519514
1.136000,29.527954
1.140000,29.535889
1.144000,29.543315
1.148000,29.550229
1.152000,29.556628
1.156000,29.562509
1.160000,29.567869
1.164000,29.572707
1.168000,29.577021
1.172000,29.580808
1.176000,29.584069
1.180000,29.586803
1.184000,29.589008
1.188000,29.590685
1.192000,29.591833
1.196000,29.592454
1.200000,29.592547
1.204000,29.592114
1.208000,29.591157
1.212000,29.589676
1.216000,29.587674
1.220000,29.585153
1.224000,29.582116
1.228000,29.578565
1.232000,29.574503
1.236000,29.569933
1.240000,29.564860
1.244000,29.559287
1.248000,29.553219
1.252000,29.546659
1.256000,29.539612
1.260000,29.532084
1.264000,29.524080
1.268000,29.515605
1.272000,29.506664
1.276000,29.497264
1.280000,29.487411
1.284000,29.477112
1.288000,29.466372
1.292000,29.455199
1.296000,29.443600
1.300000,29.431581
1.304000,29.419152
1.308000,29.406318
1.312000,29.393089
1.316000,29.379471
1.320000,29.365474
1.324000,29.351106
1.328000,29.336375
1.332000,29.321290
1.336000,29.305861
1.340000,29.290095
1.344000,29.274002
1.348000,29.257592
1.352000,29.240874
1.356000,29.223858
1.360000,29.206553
1.364000,29.188969
1.368000,29.171117
1.372000,29.153006
1.376000,29.134646
1.380000,29.116048
1.384000,29.097222
1.388000,29.078178
1.392000,29.058927
1.396000,29.039479
1.400000,29.019846
1.404000,29.000037
1.408000,28.980063
1.412000,28.959936
1.416000,28.939665
1.420000,28.919262
1.424000,28.898738
1.428000,28.878102
1.432000,28.857367
1.436000,28.836543
1.440000,28.815641
1.444000,28.794671
1.448000,28.773645
1.452000,28.752573
1.456000,28.731466
1.460000,28.710335
1.464000,28.689189
1.468000,28.668041
1.472000,28.646900
1.476000,28.625778
1.480000,28.604684
1.484000,28.583628
1.488000,28.562622
1.492000,28.541675
1.496000,28.520797
1.500000,28.499999
1.504000,28.479290
1.508000,28.458680
1.512000,28.438180
1.516000,28.417797
1.520000,28.397543
1.524000,28.377426
1.528000,28.357455
1.532000,28.337640
1.536000,28.317989
1.540000,28.298512
1.544000,28.279217
1.548000,28.260112
1.552000,28.241205
1.556000,28.222506
1.560000,28.204022
1.564000,28.185760
1.568000,28.167729
1.572000,28.149936
1.576000,28.132388
1.580000,28.115092
1.584000,28.098055
1.588000,28.081285
1.592000,28.064787
1.596000,28.048567
1.600000,28.032633
1.604000,28.016990
1.608000,28.001644
1.612000,27.986600
1.616000,27.971863
1.620000,27.957439
1.624000,27.943333
1.628000,27.929549
1.632000,27.916092
1.636000,27.902965
1.640000,27.890174
1.644000,27.877722
1.648000,27.865612
1.652000,27.853847
1.656000,27.842432
1.660000,27.831368
1.664000,27.820659
1.668000,27.810307
1.672000,27.800313
1.676000,27.790681
1.680000,27.781412
1.684000,27.772507
1.688000,27.763968
1.692000,27.755796
1.696000,27.747991
1.700000,27.740555
1.704000,27.733487
1.708000,27.726788
1.712000,27.720458
1.716000,27.714496
1.720000,27.708902
1.724000,27.703676
1.728000,27.698816
1.732000,27.694321
1.736000,27.690190
1.740000,27.686421
1.744000,27.683013
1.748000,27.679963
1.752000,27.677269
1.756000,27.674928
1.760000,27.672939
1.764000,27.671298
1.768000,27.670003
1.772000,27.669049
1.776000,27.668434
1.780000,27.668153
1.784000,27.668204
1.788000,27.668582
1.792000,27.669283
1.796000,27.670302
1.800000,27.671635
1.804000,27.673278
1.808000,27.675225
1.812000,27.677472
1.816000,27.680013
1.820000,27.682842
1.824000,27.685956
1.828000,27.689346
1.832000,27.693009
1.836000,27.696938
1.840000,27.701126
1.844000,27.705569
1.848000,27.710258
1.852000,27.715189
1.856000,27.720354
1.860000,27.725746
1.864000,27.731359
1.868000,27.737186
1.872000,27.743220
1.876000,27.749454
1.880000,27.755880
1.884000,27.762491
1.888000,27.769280
1.892000,27.776240
1.896000,27.783362
1.900000,27.790640
1.904000,27.798065
1.908000,27.805630
1.912000,27.813328
1.916000,27.821149
1.920000,27.829087
1.924000,27.837134
1.928000,27.845281
1.932000,27.853520
1.936000,27.861845
1.940000,27.870246
1.944000,27.878715
1.948000,27.887245
1.952000,27.895828
1.956000,27.904455
1.960000,27.913118
1.964000,27.921810
1.968000,27.930522
1.972000,27.939246
1.976000,27.947975
1.980000,27.956701
1.984000,27.965415
1.988000,27.974110
1.992000,27.982778
1.996000,27.991410

