# This file uses centimeters as units for non-parametric coordinates.

mtllib Building9_Unity.mtl
g default
v 2.598449 1.238133 -2.009052
v 2.685432 1.238133 -1.838903
v 2.727886 1.072171 -1.755859
v 2.685432 0.906209 -1.838903
v 2.598449 0.906209 -2.009052
v 2.555995 1.072171 -2.092096
v 2.760813 1.185288 -2.092057
v 2.847797 1.185288 -1.921908
v 2.833929 1.041265 -1.810070
v 2.735153 0.897242 -1.864321
v 2.648168 0.897242 -2.034470
v 2.662036 1.041265 -2.146307
v 2.687418 0.733334 -2.054536
v 2.774403 0.733334 -1.884387
v 2.964630 0.733334 -1.876887
v 3.069947 0.733334 -2.035475
v 2.982962 0.733334 -2.205624
v 2.792737 0.733334 -2.213125
v 2.687418 0.816779 -2.054536
v 2.774403 0.816779 -1.884387
v 2.956503 0.845870 -1.872733
v 3.059533 0.874964 -2.030152
v 2.972550 0.874964 -2.200301
v 2.784611 0.845870 -2.208971
v 2.978906 1.050492 -1.988934
v 2.919161 0.964642 -1.853642
v 2.757017 0.865980 -1.875499
v 2.670033 0.865980 -2.045648
v 2.747269 0.964642 -2.189881
v 2.891922 1.050492 -2.159083
v 1.921473 1.238133 -1.680297
v 2.008457 1.238133 -1.510148
v 2.050911 1.072171 -1.427104
v 2.008457 0.906209 -1.510148
v 1.921473 0.906209 -1.680297
v 1.879019 1.072171 -1.763342
v 2.687418 0.324736 -2.054536
v 2.774403 0.324736 -1.884387
v 2.964630 0.324736 -1.876887
v 3.069947 0.324736 -2.035475
v 2.982962 0.324736 -2.205624
v 2.792737 0.324736 -2.213125
v 1.059897 1.242354 -1.248276
v 1.146880 1.233912 -1.078127
v 1.185984 1.072171 -1.001804
v 1.146880 0.910429 -1.078127
v 1.059897 0.901988 -1.248276
v 1.014092 1.072171 -1.338041
v 2.687418 -0.044783 -2.054536
v 2.774403 -0.044783 -1.884387
v 2.964630 -0.044783 -1.876887
v 3.069947 -0.044783 -2.035475
v 2.982962 -0.044783 -2.205624
v 2.792737 -0.044783 -2.213125
vt 0.578125 0.979066
vt 0.421875 0.979066
vt 0.343750 0.843750
vt 0.421875 0.708434
vt 0.578125 0.708434
vt 0.656250 0.843750
vt 0.578125 0.979066
vt 0.421875 0.979066
vt 0.343750 0.843750
vt 0.421875 0.708434
vt 0.578125 0.708434
vt 0.656250 0.843750
vt 0.578125 0.979066
vt 0.421875 0.979066
vt 0.343750 0.843750
vt 0.421875 0.708434
vt 0.578125 0.708434
vt 0.656250 0.843750
vt 0.421875 0.979066
vt 0.578125 0.979066
vt 0.343750 0.843750
vt 0.421875 0.708434
vt 0.578125 0.708434
vt 0.656250 0.843750
vt 0.421875 0.843750
vt 0.343750 0.843750
vt 0.421875 0.843750
vt 0.578125 0.843750
vt 0.656250 0.843750
vt 0.578125 0.843750
vt 0.604212 0.608107
vt 0.465081 0.608107
vt 0.418976 0.608107
vt 0.407518 0.548097
vt 0.465353 0.488087
vt 0.557835 0.488087
vt 0.615670 0.548097
vt 0.596245 0.721393
vt 0.499603 0.721393
vt 0.419862 0.721393
vt 0.388044 0.638385
vt 0.452076 0.555378
vt 0.564031 0.555378
vt 0.628063 0.638385
vt 0.000000 0.000000
vt 1.000000 0.000000
vt 1.000000 1.000000
vt 0.000000 1.000000
vt 0.000000 0.000000
vt 1.000000 0.000000
vt 1.000000 1.000000
vt 0.000000 1.000000
vt 0.000000 0.000000
vt 1.000000 0.000000
vt 1.000000 1.000000
vt 0.000000 1.000000
vt 0.000000 0.000000
vt 1.000000 0.000000
vt 1.000000 1.000000
vt 0.000000 1.000000
vt 0.000000 0.000000
vt 1.000000 0.000000
vt 1.000000 1.000000
vt 0.000000 1.000000
vt 0.000000 0.000000
vt 1.000000 0.000000
vt 1.000000 1.000000
vt 0.000000 1.000000
vt 0.000000 0.000000
vt 1.000000 0.000000
vt 1.000000 1.000000
vt 0.000000 1.000000
vt 0.000000 0.000000
vt 1.000000 0.000000
vt 1.000000 1.000000
vt 0.000000 1.000000
vt 0.000000 0.000000
vt 1.000000 0.000000
vt 1.000000 1.000000
vt 0.000000 1.000000
vt 0.000000 0.000000
vt 1.000000 0.000000
vt 1.000000 1.000000
vt 0.000000 1.000000
vt 0.000000 0.000000
vt 1.000000 0.000000
vt 1.000000 1.000000
vt 0.000000 1.000000
vt 0.000000 0.000000
vt 1.000000 0.000000
vt 1.000000 1.000000
vt 0.000000 1.000000
vn -0.220304 0.865987 -0.448925
vn 0.223965 0.861291 0.456089
vn 0.256129 0.870021 0.421262
vn -0.172613 0.873913 -0.454402
vn 0.440642 0.000000 0.897683
vn 0.448067 0.031256 0.893454
vn 0.223965 -0.861291 0.456089
vn 0.215728 -0.854220 0.473043
vn -0.220304 -0.865987 -0.448925
vn -0.236302 -0.859812 -0.452641
vn -0.440688 0.000000 -0.897660
vn -0.430368 0.030903 -0.902124
vn 0.578355 0.802095 0.148829
vn 0.218048 0.802095 -0.555967
vn 0.548958 0.200935 0.811339
vn 0.004828 -0.661654 0.749793
vn -0.604952 -0.661657 -0.442993
vn -0.336197 0.200933 -0.920107
vn -0.998448 0.000000 -0.055685
vn -0.539557 0.000000 0.841949
vn -0.534046 -0.002592 0.845451
vn -0.998060 -0.002592 -0.062203
vn 0.455188 0.000000 0.890395
vn 0.473915 0.003519 0.880563
vn 0.998449 0.000000 0.055681
vn 0.998846 0.017776 0.044607
vn 0.539562 0.000000 -0.841946
vn 0.548771 0.017775 -0.835784
vn -0.455189 0.000000 -0.890395
vn -0.436253 0.003518 -0.899817
vn -0.433632 -0.132431 0.891305
vn -0.976427 -0.132430 -0.170451
vn 0.582846 0.061007 0.810289
vn 0.963487 0.266864 -0.021813
vn 0.581905 0.266863 -0.768225
vn -0.315499 0.061006 -0.946963
vn 0.830780 0.556385 0.015518
vn 0.620454 0.160261 0.767693
vn -0.289323 -0.387845 0.875139
vn -0.878813 -0.387845 -0.277965
vn -0.258948 0.160261 -0.952503
vn 0.473929 0.556385 -0.682515
vn -0.219821 0.868522 -0.444239
vn 0.227505 0.858607 0.459386
vn 0.443680 0.000000 0.896186
vn 0.227504 -0.858607 0.459386
vn -0.219821 -0.868522 -0.444239
vn -0.443619 0.000000 -0.896216
vn -0.998448 0.000000 -0.055685
vn -0.539557 0.000000 0.841949
vn 0.455189 0.000000 0.890395
vn 0.998449 0.000000 0.055681
vn 0.539561 0.000000 -0.841946
vn -0.455189 0.000000 -0.890395
s 1
g pasted__Pipe group1 Building
usemtl initialShadingGroup
f 31/32/1 32/33/2 2/2/3 1/1/4
f 32/33/2 33/34/5 3/3/6 2/2/3
f 33/34/5 34/35/7 4/4/8 3/3/6
f 34/35/7 35/36/9 5/5/10 4/4/8
f 35/36/9 36/37/11 6/6/12 5/5/10
f 36/37/11 31/31/1 1/1/4 6/6/12
f 1/1/4 2/2/3 8/8/13 7/7/14
f 2/2/3 3/3/6 9/9/15 8/8/13
f 3/3/6 4/4/8 10/10/16 9/9/15
f 4/4/8 5/5/10 11/11/17 10/10/16
f 5/5/10 6/6/12 12/12/18 11/11/17
f 6/6/12 1/1/4 7/7/14 12/12/18
f 37/39/19 38/40/20 14/19/21 13/20/22
f 38/40/20 39/41/23 15/21/24 14/19/21
f 39/41/23 40/42/25 16/22/26 15/21/24
f 40/42/25 41/43/27 17/23/28 16/22/26
f 41/43/27 42/44/29 18/24/30 17/23/28
f 42/44/29 37/38/19 13/20/22 18/24/30
f 13/20/22 14/19/21 20/14/31 19/13/32
f 14/19/21 15/21/24 21/15/33 20/14/31
f 15/21/24 16/22/26 22/16/34 21/15/33
f 16/22/26 17/23/28 23/17/35 22/16/34
f 17/23/28 18/24/30 24/18/36 23/17/35
f 18/24/30 13/20/22 19/13/32 24/18/36
f 25/25/37 26/26/38 21/15/33 22/16/34
f 26/26/38 27/27/39 20/14/31 21/15/33
f 27/27/39 28/28/40 19/13/32 20/14/31
f 28/28/40 29/29/41 24/18/36 19/13/32
f 29/29/41 30/30/42 23/17/35 24/18/36
f 30/30/42 25/25/37 22/16/34 23/17/35
f 8/8/13 9/9/15 26/26/38 25/25/37
f 9/9/15 10/10/16 27/27/39 26/26/38
f 10/10/16 11/11/17 28/28/40 27/27/39
f 11/11/17 12/12/18 29/29/41 28/28/40
f 12/12/18 7/7/14 30/30/42 29/29/41
f 7/7/14 8/8/13 25/25/37 30/30/42
f 32/45/2 31/46/1 43/47/43 44/48/44
f 33/49/5 32/50/2 44/51/44 45/52/45
f 34/53/7 33/54/5 45/55/45 46/56/46
f 35/57/9 34/58/7 46/59/46 47/60/47
f 36/61/11 35/62/9 47/63/47 48/64/48
f 31/65/1 36/66/11 48/67/48 43/68/43
f 38/69/20 37/70/19 49/71/49 50/72/50
f 39/73/23 38/74/20 50/75/50 51/76/51
f 40/77/25 39/78/23 51/79/51 52/80/52
f 41/81/27 40/82/25 52/83/52 53/84/53
f 42/85/29 41/86/27 53/87/53 54/88/54
f 37/89/19 42/90/29 54/91/54 49/92/49
g default
v 0.684888 3.281109 -0.657676
v 0.654925 3.279055 -0.531355
v 0.809674 3.288261 -0.627920
v 0.779575 3.287392 -0.501628
v 0.777038 3.794659 -0.597584
v 0.748010 3.784933 -0.471420
v 0.652044 3.788261 -0.626823
v 0.623016 3.778536 -0.500660
v 0.681587 2.935722 -0.583192
v 0.648235 2.989012 -0.469844
v 0.772186 2.997936 -0.437477
v 0.805539 2.943563 -0.550288
v 0.742922 2.633135 -0.305674
v 0.711964 2.742632 -0.229904
v 0.808557 2.801058 -0.268238
v 0.841273 2.701443 -0.356205
v 0.939520 2.620667 -0.193006
v 0.911909 2.730412 -0.131363
v 0.945600 2.787498 -0.205194
v 0.975611 2.688257 -0.282040
v 1.164793 2.640478 -0.126892
v 1.137509 2.751337 -0.067159
v 1.158312 2.805910 -0.145577
v 1.188085 2.705391 -0.220794
v 0.667992 2.745895 -0.470096
v 0.631786 2.839302 -0.364489
v 0.756911 2.866564 -0.345642
v 0.793357 2.775942 -0.453619
v 0.801549 3.414331 -0.620372
v 0.771716 3.411264 -0.494107
v 0.646980 3.403419 -0.523717
v 0.676712 3.407375 -0.649996
v 0.550263 3.410545 -0.549248
v 0.579540 3.413622 -0.673193
v 0.556659 3.313782 -0.556091
v 0.586120 3.315380 -0.680077
v 0.495260 3.444340 -0.569231
v 0.522709 3.447056 -0.681803
v 0.475877 3.360777 -0.581328
v 0.503102 3.362185 -0.694029
v 0.450708 3.478586 -0.568491
v 0.473789 3.489414 -0.659181
v 0.394778 3.445284 -0.591263
v 0.417026 3.455544 -0.682266
v 0.411036 3.547249 -0.556637
v 0.429094 3.563629 -0.629161
v 0.367017 3.521585 -0.577156
v 0.384421 3.537521 -0.649974
v 0.309525 3.779261 -0.485342
v 0.328788 3.779335 -0.559421
v 0.263222 3.776840 -0.501267
v 0.281789 3.776880 -0.575561
vt 0.375000 0.000000
vt 0.625000 0.000000
vt 0.375000 0.250000
vt 0.625000 0.250000
vt 0.375000 0.500000
vt 0.625000 0.500000
vt 0.375000 0.750000
vt 0.625000 0.750000
vt 0.375000 1.000000
vt 0.625000 1.000000
vt 0.875000 0.000000
vt 0.875000 0.250000
vt 0.125000 0.000000
vt 0.125000 0.250000
vt 0.375000 0.000000
vt 0.625000 0.000000
vt 0.625000 0.250000
vt 0.375000 0.250000
vt 0.375000 0.000000
vt 0.625000 0.000000
vt 0.625000 0.250000
vt 0.375000 0.250000
vt 0.375000 0.000000
vt 0.625000 0.000000
vt 0.625000 0.250000
vt 0.375000 0.250000
vt 0.375000 0.000000
vt 0.625000 0.000000
vt 0.625000 0.250000
vt 0.375000 0.250000
vt 0.375000 0.000000
vt 0.625000 0.000000
vt 0.625000 0.250000
vt 0.375000 0.250000
vt 0.312758 0.250000
vt 0.375000 0.312242
vt 0.625000 0.312242
vt 0.687242 0.250000
vt 0.625000 0.937758
vt 0.687242 0.000000
vt 0.312758 0.000000
vt 0.375000 0.937758
vt 0.375000 0.937758
vt 0.625000 0.937758
vt 0.625000 1.000000
vt 0.375000 1.000000
vt 0.375000 0.937758
vt 0.625000 0.937758
vt 0.625000 1.000000
vt 0.375000 1.000000
vt 0.375000 0.937758
vt 0.625000 0.937758
vt 0.625000 1.000000
vt 0.375000 1.000000
vt 0.375000 0.937758
vt 0.625000 0.937758
vt 0.625000 1.000000
vt 0.375000 1.000000
vt 0.375000 0.937758
vt 0.625000 0.937758
vt 0.625000 1.000000
vt 0.375000 1.000000
vn 0.302992 -0.879830 0.366191
vn 0.584645 -0.072504 -0.808043
vn 0.342735 0.926972 -0.152497
vn 0.063333 0.103041 0.992659
vn 0.842186 0.086106 -0.532268
vn 0.808009 0.316696 -0.496815
vn 0.505819 0.217899 0.834666
vn 0.539723 -0.016726 0.841676
vn -0.529690 0.249356 -0.810710
vn -0.842721 0.150161 0.516985
vn -0.308208 0.178135 -0.934492
vn -0.725055 0.049253 0.686927
vn -0.254774 -0.266466 -0.929563
vn -0.443812 -0.278969 -0.851591
vn -0.925764 0.168277 0.338591
vn -0.804852 -0.102015 0.584643
vn 0.591347 0.259237 0.763613
vn 0.589998 0.111330 0.799693
vn 0.805279 -0.218516 -0.551159
vn 0.810448 -0.078255 -0.580560
vn -0.599403 -0.603970 -0.525296
vn -0.462775 -0.881541 0.093402
vn -0.710416 -0.145374 0.688604
vn -0.942943 0.081057 0.322937
vn 0.247002 0.947118 0.204835
vn 0.463853 0.638318 0.614321
vn 0.569572 -0.335384 -0.750404
vn 0.730100 -0.378244 -0.569110
vn -0.110412 -0.942072 0.316717
vn -0.367589 -0.026948 0.929598
vn 0.046714 0.985374 -0.163878
vn 0.362577 -0.170316 -0.916259
vn 0.790263 0.562211 -0.243726
vn -0.777108 0.011060 -0.629270
vn -0.901367 -0.272568 0.336518
vn 0.439809 0.111766 0.891109
vn 0.310200 0.731608 -0.607063
vn -0.058396 0.668303 0.741594
vn -0.461248 -0.759677 0.458412
vn -0.178275 -0.714974 -0.676040
vn 0.415047 0.671462 -0.613901
vn 0.254316 0.557271 0.790426
vn -0.653940 -0.717870 0.238800
vn -0.461954 -0.634389 -0.619797
vn 0.564715 0.659072 -0.496710
vn 0.422872 0.270521 0.864869
vn -0.813498 -0.553137 0.179612
vn -0.664215 -0.332530 -0.669509
vn 0.792760 0.507917 -0.336975
vn 0.599736 0.072689 0.796890
vn -0.880202 -0.414608 0.230965
vn -0.669895 -0.018710 -0.742220
s 1
g group1 Building pasted__Trunk group2
usemtl initialShadingGroup
f 75/119/55 78/122/56 77/121/57 76/120/58
f 83/128/59 59/97/60 60/98/61 84/129/62
f 59/97/60 61/99/63 62/100/64 60/98/61
f 61/99/63 86/134/65 85/131/66 62/100/64
f 84/130/62 60/104/61 62/103/64 85/132/66
f 61/105/63 59/106/60 83/127/59 86/133/65
f 55/93/67 63/107/68 64/108/69 56/94/70
f 56/94/70 64/108/69 65/109/71 58/96/72
f 58/96/72 65/109/71 66/110/73 57/95/74
f 57/95/74 66/110/73 63/107/68 55/93/67
f 79/123/75 67/111/76 68/112/77 80/124/78
f 80/124/78 68/112/77 69/113/79 81/125/80
f 81/125/80 69/113/79 70/114/81 82/126/82
f 82/126/82 70/114/81 67/111/76 79/123/75
f 67/111/76 71/115/83 72/116/84 68/112/77
f 68/112/77 72/116/84 73/117/85 69/113/79
f 69/113/79 73/117/85 74/118/86 70/114/81
f 70/114/81 74/118/86 71/115/83 67/111/76
f 71/115/83 75/119/55 76/120/58 72/116/84
f 72/116/84 76/120/58 77/121/57 73/117/85
f 73/117/85 77/121/57 78/122/56 74/118/86
f 74/118/86 78/122/56 75/119/55 71/115/83
f 63/107/68 79/123/75 80/124/78 64/108/69
f 64/108/69 80/124/78 81/125/80 65/109/71
f 65/109/71 81/125/80 82/126/82 66/110/73
f 66/110/73 82/126/82 79/123/75 63/107/68
f 57/95/74 83/128/59 84/129/62 58/96/72
f 56/94/70 58/96/72 84/130/62 85/132/66
f 104/151/87 106/154/88 105/153/89 103/152/90
f 83/127/59 57/95/74 55/93/67 86/133/65
f 86/134/65 88/135/91 87/136/92 85/131/66
f 85/131/66 87/136/92 89/137/93 56/102/70
f 56/102/70 89/137/93 90/138/94 55/101/67
f 55/101/67 90/138/94 88/135/91 86/134/65
f 88/135/91 92/139/95 91/140/96 87/136/92
f 87/136/92 91/140/96 93/141/97 89/137/93
f 89/137/93 93/141/97 94/142/98 90/138/94
f 90/138/94 94/142/98 92/139/95 88/135/91
f 92/139/95 96/143/99 95/144/100 91/140/96
f 91/140/96 95/144/100 97/145/101 93/141/97
f 93/141/97 97/145/101 98/146/102 94/142/98
f 94/142/98 98/146/102 96/143/99 92/139/95
f 96/143/99 100/147/103 99/148/104 95/144/100
f 95/144/100 99/148/104 101/149/105 97/145/101
f 97/145/101 101/149/105 102/150/106 98/146/102
f 98/146/102 102/150/106 100/147/103 96/143/99
f 100/147/103 104/151/87 103/152/90 99/148/104
f 99/148/104 103/152/90 105/153/89 101/149/105
f 101/149/105 105/153/89 106/154/88 102/150/106
f 102/150/106 106/154/88 104/151/87 100/147/103
g default
v 0.360863 4.147399 -0.406158
v 0.183539 4.092569 -0.280680
v 0.258148 4.030505 -0.078747
v 0.481583 4.046978 -0.079424
v 0.545065 4.119222 -0.281776
v 0.350620 4.284806 -0.443441
v 0.099845 4.207265 -0.265987
v 0.205358 4.119493 0.019589
v 0.521344 4.142789 0.018631
v 0.611121 4.244958 -0.267537
v 0.344499 4.372454 -0.330942
v 0.167175 4.317624 -0.205463
v 0.241784 4.255561 -0.003531
v 0.465219 4.272033 -0.004208
v 0.528701 4.344277 -0.206559
v 0.369229 4.040724 -0.240935
v 0.346087 4.359000 -0.134563
vt 0.000000 0.250000
vt 0.200000 0.250000
vt 0.400000 0.250000
vt 0.600000 0.250000
vt 0.800000 0.250000
vt 1.000000 0.250000
vt 0.000000 0.500000
vt 0.200000 0.500000
vt 0.400000 0.500000
vt 0.600000 0.500000
vt 0.800000 0.500000
vt 1.000000 0.500000
vt 0.000000 0.750000
vt 0.200000 0.750000
vt 0.400000 0.750000
vt 0.600000 0.750000
vt 0.800000 0.750000
vt 1.000000 0.750000
vt 0.100000 0.000000
vt 0.300000 0.000000
vt 0.500000 0.000000
vt 0.700000 0.000000
vt 0.900000 0.000000
vt 0.100000 1.000000
vt 0.300000 1.000000
vt 0.500000 1.000000
vt 0.700000 1.000000
vt 0.900000 1.000000
vn -0.502499 -0.261090 -0.824213
vn -0.502499 -0.261090 -0.824213
vn -0.502499 -0.261090 -0.824213
vn -0.502499 -0.261090 -0.824213
vn -0.795957 -0.595053 0.111199
vn -0.795957 -0.595053 0.111199
vn -0.795957 -0.595053 0.111199
vn -0.795957 -0.595053 0.111199
vn 0.055553 -0.725306 0.686182
vn 0.055553 -0.725306 0.686182
vn 0.055553 -0.725306 0.686182
vn 0.055553 -0.725306 0.686182
vn 0.875271 -0.471844 0.106130
vn 0.875271 -0.471844 0.106130
vn 0.875271 -0.471844 0.106130
vn 0.875271 -0.471844 0.106130
vn 0.530375 -0.184943 -0.827344
vn 0.530375 -0.184943 -0.827344
vn 0.530375 -0.184943 -0.827344
vn 0.530375 -0.184943 -0.827344
vn -0.567596 0.634206 -0.524993
vn -0.567596 0.634206 -0.524993
vn -0.567596 0.634206 -0.524993
vn -0.567596 0.634206 -0.524993
vn -0.861054 0.300241 0.410417
vn -0.861054 0.300241 0.410417
vn -0.861054 0.300241 0.410417
vn -0.861054 0.300241 0.410417
vn -0.009545 0.169988 0.985400
vn -0.009545 0.169988 0.985400
vn -0.009545 0.169988 0.985400
vn -0.009545 0.169988 0.985400
vn 0.810174 0.423450 0.405350
vn 0.810174 0.423450 0.405350
vn 0.810174 0.423450 0.405350
vn 0.810174 0.423450 0.405350
vn 0.465278 0.710352 -0.528125
vn 0.465278 0.710352 -0.528125
vn 0.465278 0.710352 -0.528125
vn 0.465278 0.710352 -0.528125
vn -0.119296 -0.836858 -0.534264
vn -0.119296 -0.836857 -0.534264
vn -0.119296 -0.836857 -0.534264
vn -0.220670 -0.952223 -0.211132
vn -0.220670 -0.952223 -0.211132
vn -0.220670 -0.952223 -0.211132
vn 0.073482 -0.997218 -0.012505
vn 0.073482 -0.997218 -0.012505
vn 0.073482 -0.997218 -0.012505
vn 0.356651 -0.909660 -0.212882
vn 0.356651 -0.909660 -0.212882
vn 0.356651 -0.909660 -0.212882
vn 0.237508 -0.810551 -0.535348
vn 0.237508 -0.810551 -0.535348
vn 0.237508 -0.810551 -0.535348
vn -0.250366 0.965747 0.068187
vn -0.250366 0.965747 0.068187
vn -0.250366 0.965747 0.068187
vn -0.351739 0.850381 0.391321
vn -0.351739 0.850381 0.391321
vn -0.351739 0.850381 0.391321
vn -0.057587 0.805384 0.589949
vn -0.057587 0.805384 0.589949
vn -0.057587 0.805385 0.589949
vn 0.225581 0.892943 0.389572
vn 0.225581 0.892943 0.389572
vn 0.225581 0.892943 0.389572
vn 0.106438 0.992052 0.067106
vn 0.106438 0.992052 0.067106
vn 0.106438 0.992052 0.067106
s off
g group1 Building group2 pasted__pSphere6
usemtl initialShadingGroup
f 107/155/107 108/156/108 113/162/109 112/161/110
f 108/156/111 109/157/112 114/163/113 113/162/114
f 109/157/115 110/158/116 115/164/117 114/163/118
f 110/158/119 111/159/120 116/165/121 115/164/122
f 111/159/123 107/160/124 112/166/125 116/165/126
f 112/161/127 113/162/128 118/168/129 117/167/130
f 113/162/131 114/163/132 119/169/133 118/168/134
f 114/163/135 115/164/136 120/170/137 119/169/138
f 115/164/139 116/165/140 121/171/141 120/170/142
f 116/165/143 112/166/144 117/172/145 121/171/146
f 108/156/147 107/155/148 122/173/149
f 109/157/150 108/156/151 122/174/152
f 110/158/153 109/157/154 122/175/155
f 111/159/156 110/158/157 122/176/158
f 107/160/159 111/159/160 122/177/161
f 117/167/162 118/168/163 123/178/164
f 118/168/165 119/169/166 123/179/167
f 119/169/168 120/170/169 123/180/170
f 120/170/171 121/171/172 123/181/173
f 121/171/174 117/172/175 123/182/176
g default
v 0.083873 3.741608 -0.680890
v 0.067161 3.968882 -0.345173
v 0.320982 4.000171 -0.290795
v 0.494565 3.792236 -0.592905
v 0.348023 3.632435 -0.833997
v 0.012357 3.829215 -0.818763
v -0.011278 4.150628 -0.343987
v 0.347680 4.194878 -0.267085
v 0.593163 3.900812 -0.694333
v 0.385923 3.674820 -1.035289
v 0.089170 3.987617 -0.847169
v 0.072457 4.214890 -0.511451
v 0.326279 4.246179 -0.457073
v 0.499862 4.038244 -0.759183
v 0.353320 3.878443 -1.000275
v 0.261824 3.776117 -0.514314
v 0.269315 4.124024 -0.749468
vt 0.000000 0.250000
vt 0.200000 0.250000
vt 0.400000 0.250000
vt 0.600000 0.250000
vt 0.800000 0.250000
vt 1.000000 0.250000
vt 0.000000 0.500000
vt 0.200000 0.500000
vt 0.400000 0.500000
vt 0.600000 0.500000
vt 0.800000 0.500000
vt 1.000000 0.500000
vt 0.000000 0.750000
vt 0.200000 0.750000
vt 0.400000 0.750000
vt 0.600000 0.750000
vt 0.800000 0.750000
vt 1.000000 0.750000
vt 0.100000 0.000000
vt 0.300000 0.000000
vt 0.500000 0.000000
vt 0.700000 0.000000
vt 0.900000 0.000000
vt 0.100000 1.000000
vt 0.300000 1.000000
vt 0.500000 1.000000
vt 0.700000 1.000000
vt 0.900000 1.000000
vn -0.895534 -0.387918 0.218032
vn -0.895534 -0.387918 0.218032
vn -0.895534 -0.387918 0.218032
vn -0.895534 -0.387918 0.218032
vn -0.197776 -0.091725 0.975946
vn -0.197776 -0.091725 0.975946
vn -0.197776 -0.091725 0.975946
vn -0.197776 -0.091725 0.975946
vn 0.794504 -0.179583 0.580098
vn 0.794504 -0.179583 0.580098
vn 0.794504 -0.179583 0.580098
vn 0.794504 -0.179583 0.580098
vn 0.739046 -0.673650 -0.002700
vn 0.739046 -0.673650 -0.002700
vn 0.739046 -0.673650 -0.002700
vn 0.739046 -0.673650 -0.002700
vn -0.496329 -0.825938 -0.267363
vn -0.496329 -0.825938 -0.267363
vn -0.496329 -0.825938 -0.267363
vn -0.496329 -0.825938 -0.267363
vn -0.879147 0.373166 -0.296391
vn -0.879147 0.373166 -0.296391
vn -0.879147 0.373166 -0.296391
vn -0.879147 0.373166 -0.296391
vn -0.175447 0.945296 0.275016
vn -0.175447 0.945296 0.275016
vn -0.175447 0.945296 0.275016
vn -0.175447 0.945296 0.275016
vn 0.810889 0.581502 0.065677
vn 0.810889 0.581502 0.065677
vn 0.810889 0.581502 0.065677
vn 0.810889 0.581502 0.065677
vn 0.758426 0.226517 -0.611130
vn 0.758426 0.226517 -0.611130
vn 0.758426 0.226517 -0.611130
vn 0.758426 0.226517 -0.611130
vn -0.476948 0.074229 -0.875791
vn -0.476948 0.074229 -0.875791
vn -0.476948 0.074229 -0.875791
vn -0.476948 0.074229 -0.875791
vn -0.331475 -0.788849 0.517534
vn -0.331475 -0.788849 0.517534
vn -0.331475 -0.788849 0.517534
vn -0.067463 -0.695669 0.715188
vn -0.067463 -0.695669 0.715188
vn -0.067463 -0.695669 0.715188
vn 0.267615 -0.714998 0.645880
vn 0.267615 -0.714998 0.645880
vn 0.267615 -0.714998 0.645880
vn 0.211299 -0.868950 0.447526
vn 0.211299 -0.868950 0.447526
vn 0.211299 -0.868950 0.447526
vn -0.165777 -0.915434 0.366742
vn -0.165777 -0.915433 0.366742
vn -0.165777 -0.915433 0.366742
vn -0.297620 0.783619 -0.545310
vn -0.297620 0.783619 -0.545310
vn -0.297620 0.783619 -0.545310
vn -0.032579 0.924467 -0.379869
vn -0.032579 0.924467 -0.379869
vn -0.032579 0.924467 -0.379869
vn 0.301471 0.857471 -0.416963
vn 0.301471 0.857471 -0.416963
vn 0.301471 0.857471 -0.416963
vn 0.245778 0.732471 -0.634885
vn 0.245778 0.732471 -0.634885
vn 0.245778 0.732471 -0.634885
vn -0.131297 0.685986 -0.715670
vn -0.131297 0.685986 -0.715670
vn -0.131297 0.685986 -0.715670
s off
g group1 Building group2 pasted__pSphere4
usemtl initialShadingGroup
f 124/183/177 125/184/178 130/190/179 129/189/180
f 125/184/181 126/185/182 131/191/183 130/190/184
f 126/185/185 127/186/186 132/192/187 131/191/188
f 127/186/189 128/187/190 133/193/191 132/192/192
f 128/187/193 124/188/194 129/194/195 133/193/196
f 129/189/197 130/190/198 135/196/199 134/195/200
f 130/190/201 131/191/202 136/197/203 135/196/204
f 131/191/205 132/192/206 137/198/207 136/197/208
f 132/192/209 133/193/210 138/199/211 137/198/212
f 133/193/213 129/194/214 134/200/215 138/199/216
f 125/184/217 124/183/218 139/201/219
f 126/185/220 125/184/221 139/202/222
f 127/186/223 126/185/224 139/203/225
f 128/187/226 127/186/227 139/204/228
f 124/188/229 128/187/230 139/205/231
f 134/195/232 135/196/233 140/206/234
f 135/196/235 136/197/236 140/207/237
f 136/197/238 137/198/239 140/208/240
f 137/198/241 138/199/242 140/209/243
f 138/199/244 134/200/245 140/210/246
g default
v 0.659500 2.236896 0.272586
v 0.705829 2.161523 0.499176
v 0.934566 2.223710 0.553789
v 1.029604 2.337515 0.360952
v 0.859605 2.345665 0.187159
v 0.533965 2.366798 0.287381
v 0.599484 2.260206 0.607827
v 0.922966 2.348150 0.685062
v 1.057372 2.509096 0.412349
v 0.816956 2.520621 0.166569
v 0.556156 2.516720 0.386796
v 0.602484 2.441348 0.613386
v 0.831221 2.503535 0.667999
v 0.926260 2.617340 0.475162
v 0.756260 2.625489 0.301369
v 0.859224 2.203108 0.351079
v 0.713073 2.598840 0.512596
vt 0.000000 0.250000
vt 0.200000 0.250000
vt 0.400000 0.250000
vt 0.600000 0.250000
vt 0.800000 0.250000
vt 1.000000 0.250000
vt 0.000000 0.500000
vt 0.200000 0.500000
vt 0.400000 0.500000
vt 0.600000 0.500000
vt 0.800000 0.500000
vt 1.000000 0.500000
vt 0.000000 0.750000
vt 0.200000 0.750000
vt 0.400000 0.750000
vt 0.600000 0.750000
vt 0.800000 0.750000
vt 1.000000 0.750000
vt 0.100000 0.000000
vt 0.300000 0.000000
vt 0.500000 0.000000
vt 0.700000 0.000000
vt 0.900000 0.000000
vt 0.100000 1.000000
vt 0.300000 1.000000
vt 0.500000 1.000000
vt 0.700000 1.000000
vt 0.900000 1.000000
vn -0.721322 -0.687810 -0.081310
vn -0.721322 -0.687810 -0.081310
vn -0.721322 -0.687810 -0.081310
vn -0.721322 -0.687810 -0.081310
vn 0.032284 -0.723936 0.689112
vn 0.032284 -0.723936 0.689112
vn 0.032284 -0.723936 0.689112
vn 0.032284 -0.723936 0.689112
vn 0.919344 -0.241763 0.310414
vn 0.919344 -0.241763 0.310414
vn 0.919344 -0.241763 0.310414
vn 0.919344 -0.241763 0.310414
vn 0.713971 0.092362 -0.694057
vn 0.713971 0.092362 -0.694057
vn 0.713971 0.092362 -0.694057
vn 0.713971 0.092362 -0.694057
vn -0.300017 -0.183311 -0.936155
vn -0.300017 -0.183311 -0.936155
vn -0.300017 -0.183311 -0.936156
vn -0.300017 -0.183311 -0.936155
vn -0.979026 0.009973 0.203489
vn -0.979027 0.009973 0.203489
vn -0.979026 0.009973 0.203489
vn -0.979027 0.009973 0.203489
vn -0.225419 -0.026152 0.973911
vn -0.225419 -0.026152 0.973911
vn -0.225419 -0.026152 0.973911
vn -0.225419 -0.026152 0.973911
vn 0.661640 0.456020 0.595212
vn 0.661640 0.456020 0.595212
vn 0.661640 0.456020 0.595212
vn 0.661640 0.456020 0.595212
vn 0.456267 0.790145 -0.409258
vn 0.456267 0.790145 -0.409258
vn 0.456267 0.790145 -0.409258
vn 0.456267 0.790145 -0.409258
vn -0.557721 0.514472 -0.651357
vn -0.557721 0.514472 -0.651357
vn -0.557721 0.514472 -0.651357
vn -0.557721 0.514472 -0.651357
vn -0.039733 -0.950537 -0.308060
vn -0.039733 -0.950537 -0.308060
vn -0.039733 -0.950537 -0.308060
vn 0.262208 -0.965011 0.000619
vn 0.262208 -0.965011 0.000619
vn 0.262208 -0.965011 0.000619
vn 0.617620 -0.771823 -0.151113
vn 0.617620 -0.771823 -0.151113
vn 0.617620 -0.771823 -0.151113
vn 0.535335 -0.637952 -0.553564
vn 0.535335 -0.637952 -0.553564
vn 0.535335 -0.637952 -0.553564
vn 0.129068 -0.748403 -0.650565
vn 0.129068 -0.748403 -0.650565
vn 0.129068 -0.748403 -0.650565
vn -0.641534 0.678953 0.357012
vn -0.641534 0.678953 0.357012
vn -0.641534 0.678953 0.357012
vn -0.339590 0.664477 0.665694
vn -0.339590 0.664477 0.665694
vn -0.339590 0.664477 0.665694
vn 0.015822 0.857668 0.513961
vn 0.015822 0.857668 0.513961
vn 0.015822 0.857668 0.513961
vn -0.066463 0.991539 0.111508
vn -0.066463 0.991539 0.111508
vn -0.066463 0.991539 0.111508
vn -0.472732 0.881087 0.014508
vn -0.472732 0.881087 0.014508
vn -0.472732 0.881087 0.014508
s off
g group1 Building group2 pasted__pSphere5
usemtl initialShadingGroup
f 141/211/247 142/212/248 147/218/249 146/217/250
f 142/212/251 143/213/252 148/219/253 147/218/254
f 143/213/255 144/214/256 149/220/257 148/219/258
f 144/214/259 145/215/260 150/221/261 149/220/262
f 145/215/263 141/216/264 146/222/265 150/221/266
f 146/217/267 147/218/268 152/224/269 151/223/270
f 147/218/271 148/219/272 153/225/273 152/224/274
f 148/219/275 149/220/276 154/226/277 153/225/278
f 149/220/279 150/221/280 155/227/281 154/226/282
f 150/221/283 146/222/284 151/228/285 155/227/286
f 142/212/287 141/211/288 156/229/289
f 143/213/290 142/212/291 156/230/292
f 144/214/293 143/213/294 156/231/295
f 145/215/296 144/214/297 156/232/298
f 141/216/299 145/215/300 156/233/301
f 151/223/302 152/224/303 157/234/304
f 152/224/305 153/225/306 157/235/307
f 153/225/308 154/226/309 157/236/310
f 154/226/311 155/227/312 157/237/313
f 155/227/314 151/228/315 157/238/316
g default
v 0.541263 3.978864 -0.982144
v 0.360037 3.889052 -0.664013
v 0.653337 3.636296 -0.277745
v 1.015832 3.569897 -0.357150
v 0.946566 3.781615 -0.792493
v 0.537168 4.290187 -1.034814
v 0.280876 4.163174 -0.584909
v 0.695665 3.805723 -0.038644
v 1.208310 3.711821 -0.150939
v 1.110353 4.011236 -0.766606
v 0.667397 4.429431 -0.783091
v 0.486172 4.339619 -0.464959
v 0.779472 4.086863 -0.078692
v 1.141966 4.020463 -0.158096
v 1.072701 4.232182 -0.593439
v 0.677284 3.677829 -0.655935
v 0.855665 4.315027 -0.374430
vt 0.000000 0.250000
vt 0.200000 0.250000
vt 0.400000 0.250000
vt 0.600000 0.250000
vt 0.800000 0.250000
vt 1.000000 0.250000
vt 0.000000 0.500000
vt 0.200000 0.500000
vt 0.400000 0.500000
vt 0.600000 0.500000
vt 0.800000 0.500000
vt 1.000000 0.500000
vt 0.000000 0.750000
vt 0.200000 0.750000
vt 0.400000 0.750000
vt 0.600000 0.750000
vt 0.800000 0.750000
vt 1.000000 0.750000
vt 0.100000 0.000000
vt 0.300000 0.000000
vt 0.500000 0.000000
vt 0.700000 0.000000
vt 0.900000 0.000000
vt 0.100000 1.000000
vt 0.300000 1.000000
vt 0.500000 1.000000
vt 0.700000 1.000000
vt 0.900000 1.000000
vn -0.852558 -0.098063 -0.513350
vn -0.852558 -0.098063 -0.513350
vn -0.852558 -0.098063 -0.513350
vn -0.852558 -0.098063 -0.513350
vn -0.841349 -0.359446 0.403646
vn -0.841349 -0.359447 0.403646
vn -0.841349 -0.359446 0.403646
vn -0.841349 -0.359446 0.403646
vn -0.021903 -0.813894 0.580601
vn -0.021903 -0.813894 0.580601
vn -0.021903 -0.813894 0.580601
vn -0.021903 -0.813894 0.580601
vn 0.775060 -0.510931 -0.371796
vn 0.775059 -0.510931 -0.371796
vn 0.775059 -0.510931 -0.371796
vn 0.775059 -0.510931 -0.371796
vn 0.357627 -0.151203 -0.921542
vn 0.357627 -0.151203 -0.921543
vn 0.357627 -0.151203 -0.921542
vn 0.357627 -0.151203 -0.921543
vn -0.604814 0.786907 -0.122383
vn -0.604814 0.786907 -0.122383
vn -0.604814 0.786907 -0.122383
vn -0.604814 0.786907 -0.122383
vn -0.658174 0.294877 0.692715
vn -0.658174 0.294877 0.692715
vn -0.658174 0.294877 0.692715
vn -0.658174 0.294877 0.692715
vn 0.225842 0.071076 0.971568
vn 0.225842 0.071076 0.971568
vn 0.225842 0.071076 0.971568
vn 0.225842 0.071076 0.971568
vn 0.976504 0.208651 -0.053896
vn 0.976504 0.208651 -0.053896
vn 0.976504 0.208651 -0.053896
vn 0.976504 0.208651 -0.053896
vn 0.559072 0.568379 -0.603642
vn 0.559072 0.568379 -0.603642
vn 0.559072 0.568379 -0.603642
vn 0.559072 0.568379 -0.603642
vn -0.477720 -0.735866 -0.479880
vn -0.477720 -0.735866 -0.479880
vn -0.477720 -0.735866 -0.479880
vn -0.547601 -0.827271 -0.125525
vn -0.547601 -0.827271 -0.125525
vn -0.547601 -0.827271 -0.125525
vn -0.204176 -0.971597 -0.119631
vn -0.204176 -0.971597 -0.119631
vn -0.204176 -0.971597 -0.119631
vn 0.113815 -0.886206 -0.449093
vn 0.113815 -0.886206 -0.449093
vn 0.113815 -0.886206 -0.449093
vn -0.050733 -0.744403 -0.665800
vn -0.050733 -0.744403 -0.665800
vn -0.050733 -0.744403 -0.665800
vn -0.002209 0.962710 0.270526
vn -0.002209 0.962710 0.270526
vn -0.002209 0.962710 0.270526
vn -0.092128 0.799723 0.593258
vn -0.092128 0.799723 0.593258
vn -0.092128 0.799723 0.593258
vn 0.271335 0.726979 0.630776
vn 0.271335 0.726979 0.630776
vn 0.271335 0.726979 0.630776
vn 0.576639 0.767050 0.281288
vn 0.576639 0.767049 0.281288
vn 0.576639 0.767049 0.281288
vn 0.412090 0.908851 0.064586
vn 0.412090 0.908851 0.064586
vn 0.412090 0.908851 0.064586
s off
g group1 Building group2 pasted__pSphere3
usemtl initialShadingGroup
f 158/239/317 159/240/318 164/246/319 163/245/320
f 159/240/321 160/241/322 165/247/323 164/246/324
f 160/241/325 161/242/326 166/248/327 165/247/328
f 161/242/329 162/243/330 167/249/331 166/248/332
f 162/243/333 158/244/334 163/250/335 167/249/336
f 163/245/337 164/246/338 169/252/339 168/251/340
f 164/246/341 165/247/342 170/253/343 169/252/344
f 165/247/345 166/248/346 171/254/347 170/253/348
f 166/248/349 167/249/350 172/255/351 171/254/352
f 167/249/353 163/250/354 168/256/355 172/255/356
f 159/240/357 158/239/358 173/257/359
f 160/241/360 159/240/361 173/258/362
f 161/242/363 160/241/364 173/259/365
f 162/243/366 161/242/367 173/260/368
f 158/244/369 162/243/370 173/261/371
f 168/251/372 169/252/373 174/262/374
f 169/252/375 170/253/376 174/263/377
f 170/253/378 171/254/379 174/264/380
f 171/254/381 172/255/382 174/265/383
f 172/255/384 168/256/385 174/266/386
g default
v 0.669028 2.193008 0.623528
v 0.526677 2.112320 0.759831
v 0.613095 2.080058 0.886857
v 0.808855 2.140807 0.829060
v 0.843424 2.210614 0.666314
v 0.644443 2.288357 0.599456
v 0.443128 2.174247 0.792218
v 0.565341 2.128622 0.971860
v 0.842188 2.214534 0.890122
v 0.891076 2.313255 0.659964
v 0.639067 2.345891 0.682740
v 0.496716 2.265203 0.819043
v 0.583133 2.232941 0.946069
v 0.778894 2.293690 0.888272
v 0.813463 2.363497 0.725525
v 0.698421 2.115698 0.740855
v 0.656050 2.331907 0.824593
vt 0.000000 0.250000
vt 0.200000 0.250000
vt 0.400000 0.250000
vt 0.600000 0.250000
vt 0.800000 0.250000
vt 1.000000 0.250000
vt 0.000000 0.500000
vt 0.200000 0.500000
vt 0.400000 0.500000
vt 0.600000 0.500000
vt 0.800000 0.500000
vt 1.000000 0.500000
vt 0.000000 0.750000
vt 0.200000 0.750000
vt 0.400000 0.750000
vt 0.600000 0.750000
vt 0.800000 0.750000
vt 1.000000 0.750000
vt 0.100000 0.000000
vt 0.300000 0.000000
vt 0.500000 0.000000
vt 0.700000 0.000000
vt 0.900000 0.000000
vt 0.100000 1.000000
vt 0.300000 1.000000
vt 0.500000 1.000000
vt 0.700000 1.000000
vt 0.900000 1.000000
vn -0.545825 -0.334672 -0.768160
vn -0.545825 -0.334672 -0.768160
vn -0.545825 -0.334672 -0.768160
vn -0.545825 -0.334672 -0.768160
vn -0.546033 -0.821803 0.162753
vn -0.546033 -0.821803 0.162753
vn -0.546033 -0.821803 0.162753
vn -0.546033 -0.821803 0.162753
vn 0.393574 -0.685370 0.612673
vn 0.393574 -0.685370 0.612673
vn 0.393574 -0.685370 0.612673
vn 0.393574 -0.685370 0.612673
vn 0.907242 -0.420426 0.012374
vn 0.907242 -0.420426 0.012374
vn 0.907242 -0.420426 0.012374
vn 0.907242 -0.420426 0.012374
vn 0.251250 -0.175530 -0.951873
vn 0.251250 -0.175530 -0.951873
vn 0.251250 -0.175530 -0.951873
vn 0.251250 -0.175530 -0.951873
vn -0.719046 0.549222 -0.425827
vn -0.719046 0.549222 -0.425827
vn -0.719046 0.549222 -0.425827
vn -0.719046 0.549222 -0.425827
vn -0.760989 0.275058 0.587570
vn -0.760989 0.275058 0.587570
vn -0.760989 0.275058 0.587570
vn -0.760989 0.275058 0.587570
vn 0.220354 0.198522 0.955004
vn 0.220354 0.198522 0.955004
vn 0.220354 0.198522 0.955004
vn 0.220354 0.198522 0.955004
vn 0.711521 0.578272 0.399173
vn 0.711521 0.578272 0.399173
vn 0.711521 0.578272 0.399173
vn 0.711521 0.578272 0.399173
vn 0.055531 0.823170 -0.565073
vn 0.055531 0.823170 -0.565073
vn 0.055531 0.823170 -0.565073
vn 0.055531 0.823170 -0.565073
vn -0.043389 -0.839197 -0.542095
vn -0.043389 -0.839197 -0.542095
vn -0.043389 -0.839197 -0.542095
vn -0.007574 -0.970418 -0.241313
vn -0.007574 -0.970418 -0.241313
vn -0.007574 -0.970418 -0.241313
vn 0.275961 -0.958417 -0.072680
vn 0.275961 -0.958417 -0.072680
vn 0.275961 -0.958417 -0.072680
vn 0.420426 -0.862792 -0.280772
vn 0.420426 -0.862791 -0.280772
vn 0.420426 -0.862792 -0.280772
vn 0.220537 -0.788168 -0.574592
vn 0.220537 -0.788167 -0.574592
vn 0.220537 -0.788167 -0.574592
vn -0.386606 0.912133 0.136198
vn -0.386606 0.912133 0.136198
vn -0.386606 0.912133 0.136198
vn -0.357963 0.817509 0.451155
vn -0.357963 0.817509 0.451155
vn -0.357963 0.817509 0.451155
vn -0.067256 0.792913 0.605612
vn -0.067256 0.792913 0.605612
vn -0.067256 0.792913 0.605612
vn 0.072829 0.910888 0.406177
vn 0.072829 0.910888 0.406177
vn 0.072829 0.910888 0.406177
vn -0.127058 0.985511 0.112357
vn -0.127058 0.985511 0.112357
vn -0.127058 0.985511 0.112357
s off
g group1 Building group2 pasted__pSphere2
usemtl initialShadingGroup
f 175/267/387 176/268/388 181/274/389 180/273/390
f 176/268/391 177/269/392 182/275/393 181/274/394
f 177/269/395 178/270/396 183/276/397 182/275/398
f 178/270/399 179/271/400 184/277/401 183/276/402
f 179/271/403 175/272/404 180/278/405 184/277/406
f 180/273/407 181/274/408 186/280/409 185/279/410
f 181/274/411 182/275/412 187/281/413 186/280/414
f 182/275/415 183/276/416 188/282/417 187/281/418
f 183/276/419 184/277/420 189/283/421 188/282/422
f 184/277/423 180/278/424 185/284/425 189/283/426
f 176/268/427 175/267/428 190/285/429
f 177/269/430 176/268/431 190/286/432
f 178/270/433 177/269/434 190/287/435
f 179/271/436 178/270/437 190/288/438
f 175/272/439 179/271/440 190/289/441
f 185/279/442 186/280/443 191/290/444
f 186/280/445 187/281/446 191/291/447
f 187/281/448 188/282/449 191/292/450
f 188/282/451 189/283/452 191/293/453
f 189/283/454 185/284/455 191/294/456
g default
v 0.299626 2.199873 0.570317
v 0.164522 2.169124 0.581347
v 0.133538 2.108300 0.722715
v 0.249494 2.101458 0.799055
v 0.352142 2.158053 0.704868
v 0.309400 2.298065 0.556288
v 0.118333 2.254580 0.571887
v 0.074516 2.168561 0.771811
v 0.238502 2.158885 0.879773
v 0.383668 2.238923 0.746572
v 0.269665 2.352756 0.629529
v 0.134561 2.322006 0.640559
v 0.103577 2.261183 0.781927
v 0.219533 2.254340 0.858267
v 0.322181 2.310935 0.764080
v 0.246070 2.115698 0.663397
v 0.203698 2.331907 0.747135
vt 0.000000 0.250000
vt 0.200000 0.250000
vt 0.400000 0.250000
vt 0.600000 0.250000
vt 0.800000 0.250000
vt 1.000000 0.250000
vt 0.000000 0.500000
vt 0.200000 0.500000
vt 0.400000 0.500000
vt 0.600000 0.500000
vt 0.800000 0.500000
vt 1.000000 0.500000
vt 0.000000 0.750000
vt 0.200000 0.750000
vt 0.400000 0.750000
vt 0.600000 0.750000
vt 0.800000 0.750000
vt 1.000000 0.750000
vt 0.100000 0.000000
vt 0.300000 0.000000
vt 0.500000 0.000000
vt 0.700000 0.000000
vt 0.900000 0.000000
vt 0.100000 1.000000
vt 0.300000 1.000000
vt 0.500000 1.000000
vt 0.700000 1.000000
vt 0.900000 1.000000
vn -0.049730 -0.136406 -0.989404
vn -0.049730 -0.136406 -0.989404
vn -0.049730 -0.136406 -0.989404
vn -0.049730 -0.136406 -0.989404
vn -0.796410 -0.472272 -0.377744
vn -0.796409 -0.472272 -0.377744
vn -0.796410 -0.472272 -0.377744
vn -0.796410 -0.472272 -0.377744
vn -0.376687 -0.778263 0.502408
vn -0.376687 -0.778263 0.502408
vn -0.376687 -0.778263 0.502408
vn -0.376687 -0.778263 0.502408
vn 0.715251 -0.519759 0.467190
vn 0.715251 -0.519759 0.467190
vn 0.715251 -0.519759 0.467190
vn 0.715251 -0.519759 0.467190
vn 0.905087 -0.147089 -0.398977
vn 0.905087 -0.147089 -0.398977
vn 0.905087 -0.147089 -0.398977
vn 0.905087 -0.147089 -0.398977
vn -0.217887 0.721647 -0.657078
vn -0.217887 0.721647 -0.657078
vn -0.217887 0.721647 -0.657078
vn -0.217887 0.721647 -0.657078
vn -0.948946 0.306075 -0.076288
vn -0.948946 0.306075 -0.076288
vn -0.948946 0.306075 -0.076288
vn -0.948946 0.306075 -0.076288
vn -0.544843 0.079790 0.834733
vn -0.544843 0.079790 0.834733
vn -0.544843 0.079790 0.834733
vn -0.544843 0.079790 0.834733
vn 0.557276 0.286341 0.779392
vn 0.557276 0.286341 0.779392
vn 0.557276 0.286341 0.779392
vn 0.557276 0.286341 0.779392
vn 0.747111 0.659011 -0.086771
vn 0.747111 0.659011 -0.086771
vn 0.747111 0.659011 -0.086771
vn 0.747111 0.659011 -0.086771
vn 0.124313 -0.770475 -0.625231
vn 0.124313 -0.770475 -0.625231
vn 0.124313 -0.770475 -0.625231
vn -0.162587 -0.892927 -0.419819
vn -0.162587 -0.892927 -0.419819
vn -0.162587 -0.892927 -0.419818
vn 0.010219 -0.994457 -0.104650
vn 0.010219 -0.994457 -0.104650
vn 0.010219 -0.994457 -0.104650
vn 0.404086 -0.908608 -0.105581
vn 0.404086 -0.908608 -0.105581
vn 0.404086 -0.908607 -0.105581
vn 0.474035 -0.771287 -0.424744
vn 0.474035 -0.771287 -0.424744
vn 0.474035 -0.771287 -0.424744
vn -0.217699 0.974700 0.050674
vn -0.217699 0.974700 0.050674
vn -0.217699 0.974700 0.050674
vn -0.500203 0.829813 0.247402
vn -0.500203 0.829813 0.247402
vn -0.500203 0.829813 0.247402
vn -0.331793 0.750719 0.571257
vn -0.331793 0.750719 0.571257
vn -0.331793 0.750719 0.571257
vn 0.064811 0.822599 0.564917
vn 0.064811 0.822599 0.564917
vn 0.064811 0.822599 0.564917
vn 0.134760 0.959918 0.245757
vn 0.134760 0.959918 0.245757
vn 0.134760 0.959918 0.245757
s off
g group1 Building group2 pasted__pSphere7
usemtl initialShadingGroup
f 192/295/457 193/296/458 198/302/459 197/301/460
f 193/296/461 194/297/462 199/303/463 198/302/464
f 194/297/465 195/298/466 200/304/467 199/303/468
f 195/298/469 196/299/470 201/305/471 200/304/472
f 196/299/473 192/300/474 197/306/475 201/305/476
f 197/301/477 198/302/478 203/308/479 202/307/480
f 198/302/481 199/303/482 204/309/483 203/308/484
f 199/303/485 200/304/486 205/310/487 204/309/488
f 200/304/489 201/305/490 206/311/491 205/310/492
f 201/305/493 197/306/494 202/312/495 206/311/496
f 193/296/497 192/295/498 207/313/499
f 194/297/500 193/296/501 207/314/502
f 195/298/503 194/297/504 207/315/505
f 196/299/506 195/298/507 207/316/508
f 192/300/509 196/299/510 207/317/511
f 202/307/512 203/308/513 208/318/514
f 203/308/515 204/309/516 208/319/517
f 204/309/518 205/310/519 208/320/520
f 205/310/521 206/311/522 208/321/523
f 206/311/524 202/312/525 208/322/526
g default
v -1.471290 0.642342 2.240863
v -1.578818 0.642342 2.191342
v -1.631299 0.539528 2.167172
v -1.578818 0.436714 2.191342
v -1.471290 0.436714 2.240863
v -1.418810 0.539528 2.265033
v -1.518546 0.609604 2.343472
v -1.626073 0.609604 2.293951
v -1.662162 0.520382 2.234187
v -1.593288 0.431159 2.222764
v -1.485761 0.431159 2.272285
v -1.449673 0.520382 2.332048
v -1.497185 0.000002 2.297089
v -1.604712 0.000002 2.247568
v -1.700202 0.000002 2.316784
v -1.690729 0.000002 2.434340
v -1.583202 0.000002 2.483861
v -1.487713 0.000002 2.414645
v -1.593956 0.000002 2.365715
v -1.497185 0.329618 2.297089
v -1.604712 0.329618 2.247568
v -1.700202 0.329618 2.316784
v -1.690729 0.329618 2.434340
v -1.583202 0.329618 2.483861
v -1.487713 0.329618 2.414645
v -1.497185 0.381312 2.297089
v -1.604712 0.381312 2.247568
v -1.697837 0.399335 2.311649
v -1.687698 0.417358 2.427760
v -1.580171 0.417358 2.477281
v -1.485348 0.399335 2.409510
v -1.664232 0.526097 2.376807
v -1.686969 0.472914 2.288051
v -1.599652 0.411793 2.236581
v -1.492125 0.411793 2.286102
v -1.474479 0.472914 2.385912
v -1.556705 0.526097 2.426328
v -1.256796 0.642342 1.749229
v -1.364323 0.642342 1.699708
v -1.416804 0.539528 1.675538
v -1.364323 0.436714 1.699708
v -1.256796 0.436714 1.749229
v -1.204315 0.539528 1.773399
vt 0.578125 0.979066
vt 0.421875 0.979066
vt 0.343750 0.843750
vt 0.421875 0.708434
vt 0.578125 0.708434
vt 0.656250 0.843750
vt 0.578125 0.979066
vt 0.421875 0.979066
vt 0.343750 0.843750
vt 0.421875 0.708434
vt 0.578125 0.708434
vt 0.656250 0.843750
vt 0.416667 0.312500
vt 0.375000 0.312500
vt 0.458333 0.312500
vt 0.500000 0.312500
vt 0.541667 0.312500
vt 0.583333 0.312500
vt 0.625000 0.312500
vt 0.421875 0.020934
vt 0.578125 0.020934
vt 0.500000 0.150000
vt 0.343750 0.156250
vt 0.421875 0.291566
vt 0.578125 0.291566
vt 0.656250 0.156250
vt 0.578125 0.979066
vt 0.421875 0.979066
vt 0.343750 0.843750
vt 0.421875 0.708434
vt 0.578125 0.708434
vt 0.656250 0.843750
vt 0.421875 0.979066
vt 0.578125 0.979066
vt 0.343750 0.843750
vt 0.421875 0.708434
vt 0.578125 0.708434
vt 0.656250 0.843750
vt 0.421875 0.843750
vt 0.343750 0.843750
vt 0.421875 0.843750
vt 0.578125 0.843750
vt 0.656250 0.843750
vt 0.578125 0.843750
vt 0.611552 0.503727
vt 0.433273 0.503727
vt 0.418161 0.503727
vt 0.425461 0.464907
vt 0.477587 0.426087
vt 0.552126 0.426087
vt 0.604252 0.464907
vn 0.457649 0.866424 0.199667
vn -0.466520 0.860774 -0.203538
vn -0.460767 0.873150 -0.159068
vn 0.435254 0.869133 0.234867
vn -0.916564 -0.000000 -0.399887
vn -0.918679 0.027361 -0.394056
vn -0.466520 -0.860774 -0.203537
vn -0.461440 -0.860590 -0.215539
vn 0.457649 -0.866424 0.199667
vn 0.479589 -0.855061 0.197142
vn 0.916564 0.000000 0.399887
vn 0.911653 0.027673 0.410028
vn -0.546563 0.802095 0.240652
vn 0.172409 0.802094 0.571770
vn -0.933114 0.200936 -0.298200
vn -0.467417 -0.661658 -0.586285
vn 0.749363 -0.661653 -0.025903
vn 0.833157 0.200934 0.515243
vn -0.095880 -0.118471 -0.988318
vn 0.813358 -0.118470 -0.569574
vn 0.000000 -1.000000 0.000000
vn -0.901875 -0.118755 -0.415353
vn -0.813356 -0.118471 0.569575
vn 0.095879 -0.118470 0.988318
vn 0.901875 -0.118753 0.415355
vn -0.101768 -0.002077 -0.994806
vn 0.822116 -0.002077 -0.569317
vn -0.915318 0.002844 -0.402721
vn -0.813833 0.014469 0.580919
vn 0.087569 0.014468 0.996053
vn 0.901014 0.002843 0.433781
vn -0.210328 -0.132430 -0.968620
vn 0.872784 -0.132429 -0.469799
vn -0.959099 0.061007 -0.276420
vn -0.743730 0.266862 0.612903
vn 0.017695 0.266861 0.963573
vn 0.833495 0.061005 0.549148
vn -0.662516 0.556387 0.501504
vn -0.962316 0.160263 -0.219691
vn -0.313749 -0.387846 -0.866682
vn 0.862548 -0.387844 -0.324943
vn 0.792479 0.160262 0.588467
vn 0.049557 0.556387 0.829444
s 1
g group1 Building pasted__Pipe1
usemtl initialShadingGroup
f 246/368/527 247/369/528 210/324/529 209/323/530
f 247/369/528 248/370/531 211/325/532 210/324/529
f 248/370/531 249/371/533 212/326/534 211/325/532
f 249/371/533 250/372/535 213/327/536 212/326/534
f 250/372/535 251/373/537 214/328/538 213/327/536
f 251/373/537 246/367/527 209/323/530 214/328/538
f 209/323/530 210/324/529 216/330/539 215/329/540
f 210/324/529 211/325/532 217/331/541 216/330/539
f 211/325/532 212/326/534 218/332/542 217/331/541
f 212/326/534 213/327/536 219/333/543 218/332/542
f 213/327/536 214/328/538 220/334/544 219/333/543
f 214/328/538 209/323/530 215/329/540 220/334/544
f 222/342/545 221/343/546 227/344/547
f 223/345/548 222/342/545 227/344/547
f 224/346/549 223/345/548 227/344/547
f 225/347/550 224/346/549 227/344/547
f 226/348/551 225/347/550 227/344/547
f 221/343/546 226/348/551 227/344/547
f 222/335/545 229/355/552 228/356/553 221/336/546
f 223/337/548 230/357/554 229/355/552 222/335/545
f 224/338/549 231/358/555 230/357/554 223/337/548
f 225/339/550 232/359/556 231/358/555 224/338/549
f 226/340/551 233/360/557 232/359/556 225/339/550
f 221/341/546 228/356/553 233/360/557 226/340/551
f 228/356/553 229/355/552 235/350/558 234/349/559
f 229/355/552 230/357/554 236/351/560 235/350/558
f 230/357/554 231/358/555 237/352/561 236/351/560
f 231/358/555 232/359/556 238/353/562 237/352/561
f 232/359/556 233/360/557 239/354/563 238/353/562
f 233/360/557 228/356/553 234/349/559 239/354/563
f 240/361/564 241/362/565 236/351/560 237/352/561
f 241/362/565 242/363/566 235/350/558 236/351/560
f 242/363/566 243/364/567 234/349/559 235/350/558
f 243/364/567 244/365/568 239/354/563 234/349/559
f 244/365/568 245/366/569 238/353/562 239/354/563
f 245/366/569 240/361/564 237/352/561 238/353/562
f 216/330/539 217/331/541 241/362/565 240/361/564
f 217/331/541 218/332/542 242/363/566 241/362/565
f 218/332/542 219/333/543 243/364/567 242/363/566
f 219/333/543 220/334/544 244/365/568 243/364/567
f 220/334/544 215/329/540 245/366/569 244/365/568
f 215/329/540 216/330/539 240/361/564 245/366/569
g default
v 0.099518 0.000000 -0.613038
v -0.447900 0.000000 -0.839786
v -0.995317 0.000000 -0.613038
v -1.222064 0.000000 -0.065621
v -0.995317 0.000000 0.481796
v -0.447900 0.000000 0.708543
v 0.099518 0.000000 0.481796
v 0.326265 0.000000 -0.065621
v 0.646935 0.000000 -1.160456
v -0.447900 0.000000 -1.613951
v -1.542734 0.000000 -1.160456
v -1.996229 0.000000 -0.065621
v -1.542734 0.000000 1.029213
v -0.447900 0.000000 1.482708
v 0.646935 0.000000 1.029213
v 1.100430 0.000000 -0.065621
v 1.194352 0.000000 -1.707873
v -0.447900 0.000000 -2.388116
v -2.090151 0.000000 -1.707873
v -2.770394 0.000000 -0.065621
v -2.090151 0.000000 1.576630
v -0.447900 0.000000 2.256873
v 1.194352 0.000000 1.576630
v 1.874595 0.000000 -0.065621
v 1.048617 1.000000 -1.562138
v -0.447900 1.000000 -2.182015
v -1.944416 1.000000 -1.562138
v -2.564294 1.000000 -0.065621
v -1.944416 1.000000 1.430895
v -0.447900 1.000000 2.050773
v 1.048617 1.000000 1.430895
v 1.668495 1.000000 -0.065621
v 0.866101 2.000000 -1.379622
v -0.447900 2.000000 -1.923899
v -1.761900 2.000000 -1.379622
v -2.306177 2.000000 -0.065621
v -1.761900 2.000000 1.248379
v -0.447900 2.000000 1.792656
v 0.866101 2.000000 1.248379
v 1.410378 3.363723 -0.065621
v 0.428101 2.000000 -0.941622
v -0.447900 2.000000 -1.304473
v -1.323900 2.000000 -0.941622
v -1.686751 2.000000 -0.065621
v -1.323900 2.000000 0.810379
v -0.447900 2.000000 1.173231
v 0.428101 2.000000 0.810379
v 0.790952 2.471503 -0.065621
v -0.009899 2.000000 -0.503622
v -0.447900 2.000000 -0.685047
v -0.885900 2.000000 -0.503622
v -1.067325 2.000000 -0.065621
v -0.885900 2.000000 0.372379
v -0.447900 2.000000 0.553805
v -0.009899 2.000000 0.372379
v 0.171526 2.000000 -0.065621
v -0.447900 0.000000 -0.065621
v 0.258241 0.000000 0.098604
v 0.964381 0.000000 0.262829
v 1.670522 0.000000 0.427054
v 1.482531 1.000000 0.383334
v 1.247095 2.575265 0.391734
v 0.682097 2.200246 0.205697
v 0.117099 2.000000 0.065779
v 0.258241 0.000000 -0.229847
v 0.964381 0.000000 -0.394072
v 1.670522 0.000000 -0.558297
v 1.482531 1.000000 -0.514576
v 1.247095 2.575265 -0.522976
v 0.682097 2.200246 -0.336940
v 0.117099 2.000000 -0.197021
v -0.009899 1.418055 -0.503622
v -0.447900 1.418055 -0.685047
v -0.447900 1.418055 -0.065621
v -0.885900 1.418055 -0.503622
v -1.067325 1.418055 -0.065621
v -0.885900 1.418055 0.372379
v -0.447900 1.418055 0.553805
v -0.009899 1.418055 0.372379
v 0.117099 1.418055 0.065779
v 0.171526 1.418055 -0.065621
v 0.117099 1.418055 -0.197021
v 1.157095 0.315193 -1.670616
v -0.447900 0.315193 -2.335427
v -2.052895 0.315193 -1.670616
v -2.717705 0.315193 -0.065621
v -2.052895 0.315193 1.539374
v -0.447900 0.315193 2.204185
v 1.157095 0.315193 1.539374
v 1.622463 0.315193 0.415877
v 1.821906 0.315193 -0.065621
v 1.622463 0.315193 -0.547120
v 1.279145 0.000000 -1.792666
v -0.447900 0.000000 -2.508031
v -0.447900 0.315192 -2.468219
v 1.250993 0.315192 -1.764514
v -2.174944 0.000000 -1.792666
v -2.146792 0.315192 -1.764514
v -2.890309 0.000000 -0.065621
v -2.850497 0.315192 -0.065621
v -2.174944 0.000000 1.661423
v -2.146792 0.315192 1.633272
v -0.447900 0.000000 2.376789
v -0.447900 0.315192 2.336976
v 1.279145 0.000000 1.661423
v 1.250993 0.315192 1.633272
v 1.790437 0.000000 0.476725
v 1.754180 0.315192 0.468410
v 1.954698 0.315192 -0.065621
v 1.994510 0.000000 -0.065621
v 1.790437 0.000000 -0.607967
v 1.754180 0.315192 -0.599653
v -0.666867 0.000000 -0.749087
v -0.885833 0.000000 -1.432553
v -1.104800 0.000000 -2.116018
v -1.138717 0.000000 -2.221885
v -1.046506 1.000000 -1.934064
v -0.447900 0.000000 -0.530120
v -0.798247 0.000000 -0.694668
v -1.148594 0.000000 -1.323714
v -1.498941 0.000000 -1.952760
v -1.553208 0.000000 -2.050198
v -1.405670 1.000000 -1.785294
v -0.926472 1.270679 -1.586599
v -1.285955 1.270679 -1.438600
vt 0.536828 0.119422
vt 0.500000 0.104167
vt 0.463172 0.119422
vt 0.447917 0.156250
vt 0.463172 0.193078
vt 0.500000 0.208333
vt 0.536828 0.193078
vt 0.552083 0.156250
vt 0.573657 0.082593
vt 0.500000 0.052083
vt 0.426343 0.082593
vt 0.395833 0.156250
vt 0.426343 0.229907
vt 0.500000 0.260417
vt 0.573657 0.229907
vt 0.604167 0.156250
vt 0.610485 0.045765
vt 0.500000 0.000000
vt 0.389515 0.045765
vt 0.343750 0.156250
vt 0.389515 0.266735
vt 0.500000 0.312500
vt 0.610485 0.266735
vt 0.656250 0.156250
vt 0.375000 0.312500
vt 0.406250 0.312500
vt 0.437500 0.312500
vt 0.468750 0.312500
vt 0.500000 0.312500
vt 0.531250 0.312500
vt 0.562500 0.312500
vt 0.593750 0.312500
vt 0.625000 0.312500
vt 0.375000 0.500470
vt 0.406250 0.500470
vt 0.437500 0.500470
vt 0.468750 0.500470
vt 0.500000 0.500470
vt 0.531250 0.500470
vt 0.562500 0.500470
vt 0.593750 0.500470
vt 0.625000 0.500470
vt 0.375000 0.688440
vt 0.406250 0.688440
vt 0.437500 0.688440
vt 0.468750 0.688440
vt 0.500000 0.688440
vt 0.531250 0.688440
vt 0.562500 0.688440
vt 0.593750 0.688440
vt 0.625000 0.688440
vt 0.610485 0.733265
vt 0.500000 0.687500
vt 0.389515 0.733265
vt 0.343750 0.843750
vt 0.389515 0.954235
vt 0.500000 1.000000
vt 0.610485 0.954235
vt 0.656250 0.843750
vt 0.573657 0.770093
vt 0.500000 0.739583
vt 0.426343 0.770093
vt 0.395833 0.843750
vt 0.426343 0.917407
vt 0.500000 0.947917
vt 0.573657 0.917407
vt 0.604167 0.843750
vt 0.536828 0.806922
vt 0.500000 0.791667
vt 0.463172 0.806922
vt 0.447917 0.843750
vt 0.463172 0.880578
vt 0.500000 0.895833
vt 0.536828 0.880579
vt 0.552083 0.843750
vt 0.500000 0.150000
vt 0.500000 0.837500
vt 0.547507 0.167299
vt 0.595014 0.178347
vt 0.584375 0.312500
vt 0.642521 0.189396
vt 0.584375 0.500470
vt 0.642521 0.810604
vt 0.584375 0.688440
vt 0.595014 0.821653
vt 0.547507 0.832701
vt 0.547507 0.145201
vt 0.595014 0.134153
vt 0.603125 0.312500
vt 0.642521 0.123104
vt 0.603125 0.500470
vt 0.642521 0.876896
vt 0.603125 0.688440
vt 0.595014 0.865847
vt 0.547507 0.854799
vt 0.536828 0.880579
vt 0.500000 0.895833
vt 0.463172 0.880578
vt 0.447917 0.843750
vt 0.463172 0.806922
vt 0.500000 0.791667
vt 0.536828 0.806922
vt 0.547507 0.832701
vt 0.552083 0.843750
vt 0.547507 0.854799
vt 0.625000 0.360554
vt 0.375000 0.360554
vt 0.406250 0.360554
vt 0.437500 0.360554
vt 0.468750 0.360554
vt 0.500000 0.360554
vt 0.531250 0.360554
vt 0.562500 0.360554
vt 0.584375 0.360554
vt 0.593750 0.360554
vt 0.603125 0.360554
vt 0.375000 0.312500
vt 0.406250 0.312500
vt 0.406250 0.360554
vt 0.375000 0.360554
vt 0.437500 0.312500
vt 0.437500 0.360554
vt 0.468750 0.312500
vt 0.468750 0.360554
vt 0.500000 0.312500
vt 0.500000 0.360554
vt 0.531250 0.312500
vt 0.531250 0.360554
vt 0.562500 0.312500
vt 0.562500 0.360554
vt 0.584375 0.312500
vt 0.584375 0.360554
vt 0.593750 0.360554
vt 0.593750 0.312500
vt 0.603125 0.312500
vt 0.603125 0.360554
vt 0.625000 0.360554
vt 0.625000 0.312500
vt 0.485269 0.110269
vt 0.470537 0.064287
vt 0.418750 0.312500
vt 0.455806 0.018306
vt 0.418750 0.312500
vt 0.418750 0.500470
vt 0.500000 0.122500
vt 0.476430 0.113930
vt 0.452860 0.071610
vt 0.426250 0.312500
vt 0.429289 0.029289
vt 0.426250 0.312500
vt 0.426250 0.500470
vt 0.418750 0.500470
vt 0.426250 0.500470
vn 0.000000 -1.000000 0.000000
vn 0.000000 -1.000000 0.000000
vn 0.000000 -1.000000 0.000000
vn 0.000000 -1.000000 0.000000
vn 0.000000 -1.000000 0.000000
vn 0.000000 -1.000000 0.000000
vn 0.000000 -1.000000 0.000000
vn 0.000000 -1.000000 0.000000
vn 0.000000 -1.000000 0.000000
vn 0.000000 -1.000000 0.000000
vn 0.000000 -1.000000 0.000000
vn 0.000000 -1.000000 0.000000
vn 0.000000 -1.000000 0.000000
vn 0.000000 -1.000000 0.000000
vn 0.000000 -1.000000 0.000000
vn 0.000000 -1.000000 0.000000
vn 0.000000 -1.000000 0.000000
vn 0.000000 -1.000000 0.000000
vn 0.000000 -1.000000 0.000000
vn 0.000000 -1.000000 0.000000
vn 0.000000 -1.000000 0.000000
vn 0.000000 -1.000000 0.000000
vn -0.000000 -1.000000 0.000000
vn -0.000000 -1.000000 0.000000
vn 0.000000 -1.000000 0.000000
vn 0.000000 -1.000000 -0.000000
vn 0.000000 -1.000000 0.000000
vn 0.000000 -1.000000 -0.000000
vn 0.000000 -1.000000 -0.000000
vn -0.000000 -1.000000 -0.000000
vn -0.000000 -1.000000 -0.000000
vn -0.000000 -1.000000 0.000000
vn -0.000000 -1.000000 0.000000
vn 0.637947 0.218049 -0.738565
vn -0.017417 0.268130 -0.963225
vn -0.008208 0.258525 -0.965970
vn 0.645524 0.218093 -0.731939
vn -0.370620 0.248866 -0.894822
vn -0.366142 0.290143 -0.884170
vn -0.366142 0.290143 -0.884170
vn -0.370546 0.249615 -0.894644
vn -0.668720 0.268140 -0.693480
vn -0.677208 0.258529 -0.688877
vn -0.975814 0.218603 0.000000
vn -0.971839 0.235646 -0.000000
vn -0.690005 0.218603 0.690005
vn -0.687194 0.235646 0.687194
vn -0.000000 0.218604 0.975814
vn -0.000000 0.235646 0.971839
vn 0.637947 0.218049 0.738565
vn 0.645524 0.218093 0.731938
vn 0.904706 0.202673 0.374741
vn 0.894668 0.164701 0.415264
vn 0.975814 0.218603 0.000000
vn 0.904706 0.202673 -0.374741
vn 0.894667 0.164701 -0.415264
vn 0.988643 0.150282 0.000000
vn 0.000000 0.249925 -0.968265
vn 0.688777 0.213805 -0.692729
vn -0.684667 0.249925 -0.684667
vn -0.968265 0.249925 -0.000000
vn -0.684667 0.249925 0.684667
vn -0.000000 0.249925 0.968265
vn 0.688777 0.213805 0.692729
vn 0.889557 0.133727 0.436814
vn 0.889557 0.133727 -0.436814
vn 0.992370 0.123299 0.000000
vn -0.226800 0.966692 -0.118612
vn 0.000000 1.000000 -0.000000
vn 0.000000 1.000000 -0.000000
vn -0.188815 0.977335 -0.095731
vn 0.000000 1.000000 -0.000000
vn 0.000000 1.000000 -0.000000
vn 0.000000 1.000000 -0.000000
vn 0.000000 1.000000 -0.000000
vn 0.000000 1.000000 -0.000000
vn 0.000000 1.000000 0.000000
vn 0.000000 1.000000 0.000000
vn 0.000000 1.000000 0.000000
vn -0.226800 0.966692 0.118612
vn -0.188815 0.977335 0.095731
vn -0.591464 0.688170 0.420229
vn -0.490907 0.815072 0.307684
vn -0.775016 0.631941 -0.000000
vn -0.591464 0.688170 -0.420229
vn -0.490907 0.815072 -0.307684
vn -0.746651 0.665216 -0.000000
vn 0.000000 1.000000 0.000000
vn -0.107234 0.993224 -0.044789
vn 0.000000 1.000000 0.000000
vn 0.000000 1.000000 0.000000
vn 0.000000 1.000000 0.000000
vn 0.000000 1.000000 0.000000
vn -0.107234 0.993225 0.044789
vn -0.331699 0.926099 0.179768
vn -0.331699 0.926099 -0.179768
vn -0.525193 0.850983 0.000000
vn 0.000000 -1.000000 0.000000
vn 0.000000 -1.000000 0.000000
vn 0.000000 -1.000000 0.000000
vn 0.000000 1.000000 0.000000
vn 0.000000 1.000000 0.000000
vn 0.000000 1.000000 0.000000
vn 0.000000 1.000000 0.000000
vn 0.000000 1.000000 0.000000
vn 0.000000 1.000000 -0.000000
vn 0.000000 1.000000 0.000000
vn 0.000000 1.000000 0.000000
vn 0.000000 1.000000 0.000000
vn 0.000000 1.000000 0.000000
vn 0.000000 1.000000 0.000000
vn -0.653676 0.000000 0.756775
vn 0.000000 0.000000 1.000000
vn 0.000000 0.000000 1.000000
vn -0.653676 0.000000 0.756775
vn 0.707107 0.000000 0.707107
vn 0.707107 0.000000 0.707107
vn 1.000000 0.000000 0.000000
vn 1.000000 0.000000 0.000000
vn 0.707107 0.000000 -0.707107
vn 0.707107 0.000000 -0.707107
vn 0.000000 0.000000 -1.000000
vn 0.000000 0.000000 -1.000000
vn -0.653676 0.000000 -0.756775
vn -0.653676 0.000000 -0.756775
vn -0.923880 0.000000 -0.382683
vn -1.000000 0.000000 0.000000
vn -1.000000 0.000000 0.000000
vn -0.923880 0.000000 -0.382683
vn -0.923880 0.000000 0.382684
vn -0.923880 0.000000 0.382684
vn -0.000000 -1.000000 0.000001
vn -0.000001 -1.000000 0.000001
vn 0.000000 1.000000 -0.000001
vn 0.000001 1.000000 -0.000001
vn 0.000001 1.000000 -0.000001
vn 0.000000 1.000000 -0.000001
vn 0.000000 -1.000000 0.000001
vn -0.000001 1.000000 -0.000001
vn -0.000001 1.000000 -0.000001
vn 0.000001 -1.000000 -0.000000
vn 0.000001 -1.000000 0.000001
vn -0.000001 1.000000 0.000000
vn -0.000001 1.000000 0.000000
vn 0.000001 -1.000000 -0.000001
vn -0.000001 1.000000 0.000001
vn -0.000001 1.000000 0.000001
vn -0.000000 -1.000000 -0.000001
vn -0.000000 1.000000 0.000001
vn 0.000000 1.000000 0.000001
vn -0.000001 -1.000000 -0.000001
vn 0.000001 1.000000 0.000001
vn 0.000001 1.000000 0.000001
vn -0.000001 -1.000000 -0.000000
vn 0.000001 1.000000 0.000000
vn 0.000001 1.000000 0.000000
vn 0.000001 1.000000 -0.000000
vn 0.000001 1.000000 -0.000000
vn -0.000001 -1.000000 0.000000
vn -0.000001 -1.000000 0.000000
vn 0.000001 1.000000 -0.000000
vn 0.000001 1.000000 -0.000000
vn 0.000000 -1.000000 0.000000
vn 0.000000 -1.000000 0.000000
vn 0.000000 -1.000000 0.000001
vn 0.000000 1.000000 0.000000
vn 0.000000 1.000000 0.000000
vn 0.000000 1.000000 0.000000
vn 0.000000 1.000000 0.000000
vn 0.000000 1.000000 0.000000
vn 0.000000 1.000000 0.000000
vn 0.000000 1.000000 0.000000
vn 0.000000 1.000000 0.000000
vn 0.000000 1.000000 0.000000
vn 0.000000 1.000000 0.000000
vn 0.000000 1.000000 0.000000
vn 0.000000 1.000000 0.000000
vn 0.000000 1.000000 0.000000
vn 0.000000 1.000000 0.000000
vn 0.000000 1.000000 0.000000
vn 0.000000 1.000000 0.000000
vn 0.000000 1.000000 0.000000
vn 0.000000 1.000000 0.000000
vn 0.000000 1.000000 0.000000
vn 0.000000 1.000000 0.000000
vn 0.000000 1.000000 0.000000
vn 0.000000 1.000000 0.000000
vn 0.226735 -0.804444 0.549055
vn 0.226735 -0.804444 0.549055
vn 0.226735 -0.804444 0.549055
vn 0.226735 -0.804444 0.549055
s 1
g Building pCylinder1
usemtl initialShadingGroup
f 252/374/570 253/375/571 261/383/572 260/382/573
f 253/375/571 364/512/574 365/513/575 261/383/572
f 254/376/576 255/377/577 263/385/578 262/384/579
f 255/377/577 256/378/580 264/386/581 263/385/578
f 256/378/580 257/379/582 265/387/583 264/386/581
f 257/379/582 258/380/584 266/388/585 265/387/583
f 258/380/584 309/451/586 310/452/587 266/388/585
f 259/381/588 316/460/589 317/461/590 267/389/591
f 260/382/573 261/383/572 269/391/592 268/390/593
f 261/383/572 365/513/575 366/515/594 269/391/592
f 262/384/579 263/385/578 271/393/595 270/392/596
f 263/385/578 264/386/581 272/394/597 271/393/595
f 264/386/581 265/387/583 273/395/598 272/394/597
f 265/387/583 266/388/585 274/396/599 273/395/598
f 266/388/585 310/452/587 311/454/600 274/396/599
f 267/389/591 317/461/590 318/463/601 275/397/602
s 4
f 334/480/603 335/481/604 277/408/605 276/407/606
f 374/524/607 376/526/608 375/525/609 368/517/610 277/408/605 335/481/604 336/482/611 278/409/612
f 336/482/611 337/483/613 279/410/614 278/409/612
f 337/483/613 338/484/615 280/411/616 279/410/614
f 338/484/615 339/485/617 281/412/618 280/411/616
f 339/485/617 340/486/619 282/413/620 281/412/618
f 340/486/619 341/487/621 312/455/622 282/413/620
f 342/488/623 343/489/624 319/464/625 283/414/626
f 276/407/606 277/408/605 285/417/627 284/416/628
f 285/417/627 277/408/605 368/517/610 374/524/607 278/409/612 286/418/629
f 278/409/612 279/410/614 287/419/630 286/418/629
f 279/410/614 280/411/616 288/420/631 287/419/630
f 280/411/616 281/412/618 289/421/632 288/420/631
f 281/412/618 282/413/620 290/422/633 289/421/632
f 282/413/620 312/455/622 313/457/634 290/422/633
f 283/414/626 319/464/625 320/466/635 291/423/636
s 5
f 284/431/637 285/430/638 293/438/639 292/439/640
f 293/438/639 285/430/638 286/429/641 294/437/642
f 286/429/641 287/428/643 295/436/644 294/437/642
f 287/428/643 288/427/645 296/435/646 295/436/644
f 288/427/645 289/426/647 297/434/648 296/435/646
f 289/426/647 290/425/649 298/433/650 297/434/648
f 290/425/649 313/456/651 314/458/652 298/433/650
f 291/432/653 320/465/654 321/467/655 299/440/656
f 292/439/640 293/438/639 301/446/657 300/447/658
f 301/446/657 293/438/639 294/437/642 302/445/659
f 294/437/642 295/436/644 303/444/660 302/445/659
f 295/436/644 296/435/646 304/443/661 303/444/660
f 296/435/646 297/434/648 305/442/662 304/443/661
f 297/434/648 298/433/650 306/441/663 305/442/662
f 298/433/650 314/458/652 315/459/664 306/441/663
f 299/440/656 321/467/655 322/468/665 307/448/666
s 1
f 253/375/571 252/374/570 308/449/667 369/518/668
f 369/518/668 370/519/669 364/512/574 253/375/571
f 255/377/577 254/376/576 308/449/667
f 256/378/580 255/377/577 308/449/667
f 257/379/582 256/378/580 308/449/667
f 258/380/584 257/379/582 308/449/667
f 259/381/588 309/451/586 308/449/667
f 308/449/667 316/460/589 259/381/588
s 6
f 323/469/670 324/470/671 325/450/672
f 325/450/672 324/470/671 326/471/673
f 326/471/673 327/472/674 325/450/672
f 327/472/674 328/473/675 325/450/672
f 328/473/675 329/474/676 325/450/672
f 329/474/676 330/475/677 325/450/672
f 325/450/672 331/476/678 332/477/679
f 332/477/679 333/478/680 325/450/672
s 1
f 310/452/587 309/451/586 259/381/588 267/389/591
f 311/454/600 310/452/587 267/389/591 275/397/602
s 4
f 312/455/622 341/487/621 342/488/623 283/414/626
f 313/457/634 312/455/622 283/414/626 291/423/636
s 5
f 314/458/652 313/456/651 291/432/653 299/440/656
f 315/459/664 314/458/652 299/440/656 307/448/666
s 1
f 317/461/590 316/460/589 252/374/570 260/382/573
f 318/463/601 317/461/590 260/382/573 268/390/593
s 4
f 319/464/625 343/489/624 334/479/603 276/415/606
f 320/466/635 319/464/625 276/415/606 284/424/628
s 5
f 321/467/655 320/465/654 284/431/637 292/439/640
f 322/468/665 321/467/655 292/439/640 300/447/658
s 6
f 325/450/672 333/478/680 323/469/670
f 330/475/677 331/476/678 325/450/672
s 1
f 308/449/667 309/451/586 258/380/584
f 252/374/570 316/460/589 308/449/667
s 7
f 300/447/681 301/446/682 324/470/683 323/469/684
f 324/470/683 301/446/682 302/445/685 326/471/686
f 302/445/685 303/444/687 327/472/688 326/471/686
f 303/444/687 304/443/689 328/473/690 327/472/688
f 304/443/689 305/442/691 329/474/692 328/473/690
f 305/442/691 306/441/693 330/475/694 329/474/692
f 315/459/695 307/448/696 332/477/697 331/476/698
f 307/448/696 322/468/699 333/478/700 332/477/697
f 322/468/699 300/447/681 323/469/684 333/478/700
f 306/441/693 315/459/695 331/476/698 330/475/694
s 1
f 268/398/593 269/399/592 345/491/701 344/490/702
s 9
f 335/481/703 334/480/704 347/493/705 346/492/706
s 1
f 269/399/592 366/514/594 367/516/707 345/491/701
s 9
f 336/482/708 335/481/703 346/492/706 349/495/709
s 1
f 270/400/596 271/401/595 350/496/710 348/494/711
s 9
f 337/483/712 336/482/708 349/495/709 351/497/713
s 1
f 271/401/595 272/402/597 352/498/714 350/496/710
s 9
f 338/484/715 337/483/712 351/497/713 353/499/716
s 1
f 272/402/597 273/403/598 354/500/717 352/498/714
s 9
f 339/485/718 338/484/715 353/499/716 355/501/719
s 1
f 273/403/598 274/404/599 356/502/720 354/500/717
s 9
f 340/486/721 339/485/718 355/501/719 357/503/722
s 1
f 274/404/599 311/453/600 358/504/723 356/502/720
s 9
f 341/487/724 340/486/721 357/503/722 359/505/725
f 342/488/726 341/487/724 359/505/725 360/506/727
s 1
f 311/453/600 275/405/602 361/507/728 358/504/723
f 275/405/602 318/462/601 362/508/729 361/507/728
s 9
f 343/489/730 342/488/726 360/506/727 363/509/731
f 334/479/704 343/489/730 363/509/731 347/510/705
s 1
f 318/462/601 268/406/593 344/511/702 362/508/729
f 365/513/575 364/512/574 370/519/669 371/520/732
f 366/515/594 365/513/575 371/520/732 372/522/733
f 367/516/707 366/514/594 372/521/733 373/523/734
f 254/376/576 370/519/669 369/518/668 308/449/667
f 371/520/732 370/519/669 254/376/576 262/384/579
f 372/522/733 371/520/732 262/384/579 270/392/596
f 373/523/734 372/521/733 270/400/596 348/494/711
s off
f 373/523/735 348/494/736 350/496/737 352/498/738 354/500/739 356/502/740 358/504/741 361/507/742 362/508/743 344/490/744 345/491/745 367/516/746 346/492/747 347/510/748 363/509/749 360/506/750 359/505/751 357/503/752 355/501/753 353/499/754 351/497/755 349/495/756
f 374/524/757 368/517/758 375/525/759 376/526/760
