[
    {
        "method": "GET",
        "path": "product/{product_id}",
        "description": "View specific product",
        "permission": "view-product",
        "action": {
            "service": "Booking-Microservice",
            "method": "GET",
            "path": "product/{product_id}"
        }
    },
    {
        "method": "GET",
        "path": "products",
        "description": "View all products",
        "permission": "view-products",
        "action": {
            "service": "Booking-Microservice",
            "method": "GET",    
            "path": "products"
        }
    },
    {
        "method": "POST",
        "path": "product",
        "description": "Create product",
        "permission": "create-product",
        "action": {
            "service": "Booking-Microservice",
            "method": "POST",
            "path": "product"
        }
    },
    {
        "method": "PUT",
        "path": "product/{product_id}",
        "description": "Completely replace product",
        "permission": "replace-product",
        "action": {
            "service": "Booking-Microservice",
            "method": "PUT",
            "path": "product/{product_id}"
        }
    },
    {
        "method": "PATCH",
        "path": "product/{product_id}",
        "description": "Partially update product",
        "permission": "update-product",
        "action": {
            "service": "Booking-Microservice",
            "method": "PATCH",
            "path": "product/{product_id}"
        }
    },
    {
        "method": "DELETE",
        "path": "product/{product_id}",
        "description": "Delete product",
        "permission": "delete-product",
        "action": {
            "service": "Booking-Microservice",
            "method": "DELETE",
            "path": "product/{product_id}"
        }
    },
    {
        "method": "POST",
        "path": "order",
        "description": "Make (create) order",
        "permission": "create-order",
        "action": {
            "service": "Booking-Microservice",
            "method": "POST",
            "path": "order"
        }
    },
    {
        "method": "DELETE",
        "path": "order/{order_uuid}/product/{product_uuid}",
        "description": "Remove product from order",
        "permission": "remove-product",
        "action": {
            "service": "Booking-Microservice",
            "method": "DELETE",
            "path": "order/{order_uuid}/product/{product_uuid}"
        }
    },
    {
        "method": "DELETE",
        "path": "order/{order_uuid}",
        "description": "Delete order with its contents",
        "permission": "delete-order",
        "action": {
            "service": "Booking-Microservice",
            "method": "DELETE",
            "path": "order/{order_uuid}"
        }
    },
    {
        "method": "GET",
        "path": "orders",
        "description": "View all orders",
        "permission": "view-orders",
        "action": {
            "service": "Booking-Microservice",
            "method": "GET",
            "path": "orders"
        }
    },
    {
        "method": "GET",
        "path": "orders/status/{status}",
        "description": "View all orders by status",
        "permission": "view-status-orders",
        "action": {
            "service": "Booking-Microservice",
            "method": "GET",
            "path": "orders/status/{status}"
        }
    },
    {
        "method": "GET",
        "path": "orders/{uuid}",
        "description": "View specific order",
        "permission": "view-order",
        "action": {
            "service": "Booking-Microservice",
            "method": "GET",
            "path": "orders/{uuid}"
        }
    },
    {
        "method": "GET",
        "path": "user/{user_uuid}/orders",
        "description": "View user orders",
        "permission": "view-user-orders",
        "action": {
            "service": "Booking-Microservice",
            "method": "GET",
            "path": "orders/{uuid}"
        }
    },
    {
        "method": "GET",
        "path": "user/{user_uuid}/orders/status/{status}",
        "description": "View user orders by status",
        "permission": "view-user-status-orders",
        "action": {
            "service": "Booking-Microservice",
            "method": "GET",
            "path": "user/{user_uuid}/orders/status/{status}"
        }
    },
    {
        "method": "GET",
        "path": "order/{order_uuid}/products",
        "description": "View order products",
        "permission": "view-order-products",
        "action": {
            "service": "Booking-Microservice",
            "method": "GET",
            "path": "order/{order_uuid}/products"
        }
    },
    {
        "method": "PATCH",
        "path": "order/{order_uuid}",
        "description": "Partially update order",
        "permission": "update-order",
        "action": {
            "service": "Booking-Microservice",
            "method": "PATCH",
            "path": "order/{order_uuid}"
        }
    },
    {
        "method": "POST",
        "path": "order/{order_uuid}/pay",
        "description": "Pay an order",
        "permission": "pay-order",
        "action": {
            "service": "Booking-Microservice",
            "method": "POST",
            "path": "order/{order_uuid}/pay"
        }
    },
    {
        "method": "POST",
        "path": "complete-payment/{organization_id}",
        "description": "Complete payment",
        "action": {
            "service": "Payments-Microservice",
            "method": "POST",
            "path": "complete-payment/{organization_id}"
        }
    }
]
