[
    {
        "method": "GET",
        "path": "oauth-vk",
        "description": "OAuth (VK)",
        "action": {
            "service": "Auth-Microservice",
            "method": "GET",
            "path": "oauth-vk"
        }
    },
    {
        "method": "GET",
        "path": "oauth-google",
        "description": "OAuth (Google)",
        "action": {
            "service": "Auth-Microservice",
            "method": "GET",
            "path": "oauth-google"
        }
    },
    {
        "method": "GET",
        "path": "oauth-instagram",
        "description": "OAuth (Instagram)",
        "action": {
            "service": "Auth-Microservice",
            "method": "GET",
            "path": "oauth-instagram"
        }
    },
    {
        "method": "GET",
        "path": "oauth-facebook",
        "description": "OAuth (FaceBook)",
        "action": {
            "service": "Auth-Microservice",
            "method": "GET",
            "path": "oauth-facebook"
        }
    },
    {
        "method": "GET",
        "path": "oauth-twitter",
        "description": "OAuth (Twitter)",
        "action": {
            "service": "Auth-Microservice",
            "method": "GET",
            "path": "oauth-twitter"
        }
    },
    {
        "method": "GET",
        "path": "oauth-apple",
        "description": "OAuth (Apple)",
        "action": {
            "service": "Auth-Microservice",
            "method": "GET",
            "path": "oauth-apple"
        }
    }
]
