[
    {
        "method": "POST",
        "path": "file",
        "description": "Create (upload) file",
        "authentication": true,
        "action": {
            "service": "Files-Microservice",
            "method": "POST",
            "path": "file"
        }
    },
    {
        "method": "GET",
        "path": "file/{file_uuid}",
        "description": "View file data",
        "authentication": true,
        "action": {
            "service": "Files-Microservice",
            "method": "GET",
            "path": "file/{file_uuid}"
        }
    },
    {
        "method": "GET",
        "path": "file/{file_uuid}/download",
        "description": "Download file (get file source)",
        "action": {
            "service": "Files-Microservice",
            "method": "GET",
            "path": "file/{file_uuid}/download"
        }
    },
    {
        "method": "GET",
        "path": "files",
        "description": "View all files data",
        "authentication": true,
        "action": {
            "service": "Files-Microservice",
            "method": "GET",
            "path": "files"
        }
    },
    {
        "method": "DELETE",
        "path": "file/{file_uuid}",
        "description": "Delete file",
        "authentication": true,
        "action": {
            "service": "Files-Microservice",
            "method": "DELETE",
            "path": "file/{file_uuid}"
        }
    }
]
