main.c:108:5:main	8	static
main.c:184:6:SystemClock_Config	88	static
main.c:227:13:MX_GPIO_Init	48	static
main.c:262:6:btn_detection_state_task	24	static
main.c:284:6:Button_1_action	8	static
main.c:287:6:Button_2_action	8	static
main.c:290:6:Button_3_action	8	static
main.c:293:6:Button_4_action	8	static
main.c:313:6:StartDefaultTask	24	static
main.c:341:6:Error_Handler	4	static
