('C:\\Projects\\mobile_royale_spam_bot.dev\\build\\spam_bot\\PYZ-00.pyz',
 [('win32com',
   'c:\\projects\\mobile_royale_spam_bot.dev\\venv\\lib\\site-packages\\win32com\\__init__.py',
   'PYMODULE'),
  ('win32com.server.util',
   'c:\\projects\\mobile_royale_spam_bot.dev\\venv\\lib\\site-packages\\win32com\\server\\util.py',
   'PYMODULE'),
  ('win32com.server.dispatcher',
   'c:\\projects\\mobile_royale_spam_bot.dev\\venv\\lib\\site-packages\\win32com\\server\\dispatcher.py',
   'PYMODULE'),
  ('win32traceutil',
   'c:\\projects\\mobile_royale_spam_bot.dev\\venv\\lib\\site-packages\\win32\\lib\\win32traceutil.py',
   'PYMODULE'),
  ('win32com.util',
   'c:\\projects\\mobile_royale_spam_bot.dev\\venv\\lib\\site-packages\\win32com\\util.py',
   'PYMODULE'),
  ('win32con',
   'c:\\projects\\mobile_royale_spam_bot.dev\\venv\\lib\\site-packages\\win32\\lib\\win32con.py',
   'PYMODULE'),
  ('win32com.server.exception',
   'c:\\projects\\mobile_royale_spam_bot.dev\\venv\\lib\\site-packages\\win32com\\server\\exception.py',
   'PYMODULE'),
  ('winerror',
   'c:\\projects\\mobile_royale_spam_bot.dev\\venv\\lib\\site-packages\\win32\\lib\\winerror.py',
   'PYMODULE'),
  ('win32com.server.policy',
   'c:\\projects\\mobile_royale_spam_bot.dev\\venv\\lib\\site-packages\\win32com\\server\\policy.py',
   'PYMODULE'),
  ('win32com.client',
   'c:\\projects\\mobile_royale_spam_bot.dev\\venv\\lib\\site-packages\\win32com\\client\\__init__.py',
   'PYMODULE'),
  ('win32com.client.makepy',
   'c:\\projects\\mobile_royale_spam_bot.dev\\venv\\lib\\site-packages\\win32com\\client\\makepy.py',
   'PYMODULE'),
  ('getopt',
   'C:\\Program Files (x86)\\Python38-32\\lib\\getopt.py',
   'PYMODULE'),
  ('gettext',
   'C:\\Program Files (x86)\\Python38-32\\lib\\gettext.py',
   'PYMODULE'),
  ('copy', 'C:\\Program Files (x86)\\Python38-32\\lib\\copy.py', 'PYMODULE'),
  ('struct',
   'C:\\Program Files (x86)\\Python38-32\\lib\\struct.py',
   'PYMODULE'),
  ('pywin.dialogs.status',
   'c:\\projects\\mobile_royale_spam_bot.dev\\venv\\lib\\site-packages\\Pythonwin\\pywin\\dialogs\\status.py',
   'PYMODULE'),
  ('threading',
   'C:\\Program Files (x86)\\Python38-32\\lib\\threading.py',
   'PYMODULE'),
  ('_threading_local',
   'C:\\Program Files (x86)\\Python38-32\\lib\\_threading_local.py',
   'PYMODULE'),
  ('contextlib',
   'C:\\Program Files (x86)\\Python38-32\\lib\\contextlib.py',
   'PYMODULE'),
  ('pywin.mfc.thread',
   'c:\\projects\\mobile_royale_spam_bot.dev\\venv\\lib\\site-packages\\Pythonwin\\pywin\\mfc\\thread.py',
   'PYMODULE'),
  ('pywin.mfc.object',
   'c:\\projects\\mobile_royale_spam_bot.dev\\venv\\lib\\site-packages\\Pythonwin\\pywin\\mfc\\object.py',
   'PYMODULE'),
  ('pywin.mfc.dialog',
   'c:\\projects\\mobile_royale_spam_bot.dev\\venv\\lib\\site-packages\\Pythonwin\\pywin\\mfc\\dialog.py',
   'PYMODULE'),
  ('pywin.mfc.window',
   'c:\\projects\\mobile_royale_spam_bot.dev\\venv\\lib\\site-packages\\Pythonwin\\pywin\\mfc\\window.py',
   'PYMODULE'),
  ('pywin.mfc',
   'c:\\projects\\mobile_royale_spam_bot.dev\\venv\\lib\\site-packages\\Pythonwin\\pywin\\mfc\\__init__.py',
   'PYMODULE'),
  ('pywin.dialogs',
   'c:\\projects\\mobile_royale_spam_bot.dev\\venv\\lib\\site-packages\\Pythonwin\\pywin\\dialogs\\__init__.py',
   'PYMODULE'),
  ('pywin',
   'c:\\projects\\mobile_royale_spam_bot.dev\\venv\\lib\\site-packages\\Pythonwin\\pywin\\__init__.py',
   'PYMODULE'),
  ('win32com.client.gencache',
   'c:\\projects\\mobile_royale_spam_bot.dev\\venv\\lib\\site-packages\\win32com\\client\\gencache.py',
   'PYMODULE'),
  ('zipfile',
   'C:\\Program Files (x86)\\Python38-32\\lib\\zipfile.py',
   'PYMODULE'),
  ('argparse',
   'C:\\Program Files (x86)\\Python38-32\\lib\\argparse.py',
   'PYMODULE'),
  ('textwrap',
   'C:\\Program Files (x86)\\Python38-32\\lib\\textwrap.py',
   'PYMODULE'),
  ('py_compile',
   'C:\\Program Files (x86)\\Python38-32\\lib\\py_compile.py',
   'PYMODULE'),
  ('ntpath',
   'C:\\Program Files (x86)\\Python38-32\\lib\\ntpath.py',
   'PYMODULE'),
  ('string',
   'C:\\Program Files (x86)\\Python38-32\\lib\\string.py',
   'PYMODULE'),
  ('genericpath',
   'C:\\Program Files (x86)\\Python38-32\\lib\\genericpath.py',
   'PYMODULE'),
  ('importlib.machinery',
   'C:\\Program Files (x86)\\Python38-32\\lib\\importlib\\machinery.py',
   'PYMODULE'),
  ('importlib',
   'C:\\Program Files (x86)\\Python38-32\\lib\\importlib\\__init__.py',
   'PYMODULE'),
  ('importlib.abc',
   'C:\\Program Files (x86)\\Python38-32\\lib\\importlib\\abc.py',
   'PYMODULE'),
  ('importlib._bootstrap',
   'C:\\Program Files (x86)\\Python38-32\\lib\\importlib\\_bootstrap.py',
   'PYMODULE'),
  ('importlib._bootstrap_external',
   'C:\\Program Files '
   '(x86)\\Python38-32\\lib\\importlib\\_bootstrap_external.py',
   'PYMODULE'),
  ('importlib.metadata',
   'C:\\Program Files (x86)\\Python38-32\\lib\\importlib\\metadata.py',
   'PYMODULE'),
  ('configparser',
   'C:\\Program Files (x86)\\Python38-32\\lib\\configparser.py',
   'PYMODULE'),
  ('pathlib',
   'C:\\Program Files (x86)\\Python38-32\\lib\\pathlib.py',
   'PYMODULE'),
  ('urllib.parse',
   'C:\\Program Files (x86)\\Python38-32\\lib\\urllib\\parse.py',
   'PYMODULE'),
  ('urllib',
   'C:\\Program Files (x86)\\Python38-32\\lib\\urllib\\__init__.py',
   'PYMODULE'),
  ('fnmatch',
   'C:\\Program Files (x86)\\Python38-32\\lib\\fnmatch.py',
   'PYMODULE'),
  ('email',
   'C:\\Program Files (x86)\\Python38-32\\lib\\email\\__init__.py',
   'PYMODULE'),
  ('email.parser',
   'C:\\Program Files (x86)\\Python38-32\\lib\\email\\parser.py',
   'PYMODULE'),
  ('email._policybase',
   'C:\\Program Files (x86)\\Python38-32\\lib\\email\\_policybase.py',
   'PYMODULE'),
  ('email.utils',
   'C:\\Program Files (x86)\\Python38-32\\lib\\email\\utils.py',
   'PYMODULE'),
  ('email._parseaddr',
   'C:\\Program Files (x86)\\Python38-32\\lib\\email\\_parseaddr.py',
   'PYMODULE'),
  ('calendar',
   'C:\\Program Files (x86)\\Python38-32\\lib\\calendar.py',
   'PYMODULE'),
  ('datetime',
   'C:\\Program Files (x86)\\Python38-32\\lib\\datetime.py',
   'PYMODULE'),
  ('_strptime',
   'C:\\Program Files (x86)\\Python38-32\\lib\\_strptime.py',
   'PYMODULE'),
  ('socket',
   'C:\\Program Files (x86)\\Python38-32\\lib\\socket.py',
   'PYMODULE'),
  ('selectors',
   'C:\\Program Files (x86)\\Python38-32\\lib\\selectors.py',
   'PYMODULE'),
  ('random',
   'C:\\Program Files (x86)\\Python38-32\\lib\\random.py',
   'PYMODULE'),
  ('hashlib',
   'C:\\Program Files (x86)\\Python38-32\\lib\\hashlib.py',
   'PYMODULE'),
  ('logging',
   'C:\\Program Files (x86)\\Python38-32\\lib\\logging\\__init__.py',
   'PYMODULE'),
  ('bisect',
   'C:\\Program Files (x86)\\Python38-32\\lib\\bisect.py',
   'PYMODULE'),
  ('email.feedparser',
   'C:\\Program Files (x86)\\Python38-32\\lib\\email\\feedparser.py',
   'PYMODULE'),
  ('email.message',
   'C:\\Program Files (x86)\\Python38-32\\lib\\email\\message.py',
   'PYMODULE'),
  ('email.policy',
   'C:\\Program Files (x86)\\Python38-32\\lib\\email\\policy.py',
   'PYMODULE'),
  ('email.contentmanager',
   'C:\\Program Files (x86)\\Python38-32\\lib\\email\\contentmanager.py',
   'PYMODULE'),
  ('email.quoprimime',
   'C:\\Program Files (x86)\\Python38-32\\lib\\email\\quoprimime.py',
   'PYMODULE'),
  ('email.headerregistry',
   'C:\\Program Files (x86)\\Python38-32\\lib\\email\\headerregistry.py',
   'PYMODULE'),
  ('email.iterators',
   'C:\\Program Files (x86)\\Python38-32\\lib\\email\\iterators.py',
   'PYMODULE'),
  ('email.generator',
   'C:\\Program Files (x86)\\Python38-32\\lib\\email\\generator.py',
   'PYMODULE'),
  ('email._encoded_words',
   'C:\\Program Files (x86)\\Python38-32\\lib\\email\\_encoded_words.py',
   'PYMODULE'),
  ('base64',
   'C:\\Program Files (x86)\\Python38-32\\lib\\base64.py',
   'PYMODULE'),
  ('quopri',
   'C:\\Program Files (x86)\\Python38-32\\lib\\quopri.py',
   'PYMODULE'),
  ('uu', 'C:\\Program Files (x86)\\Python38-32\\lib\\uu.py', 'PYMODULE'),
  ('optparse',
   'C:\\Program Files (x86)\\Python38-32\\lib\\optparse.py',
   'PYMODULE'),
  ('email._header_value_parser',
   'C:\\Program Files (x86)\\Python38-32\\lib\\email\\_header_value_parser.py',
   'PYMODULE'),
  ('email.header',
   'C:\\Program Files (x86)\\Python38-32\\lib\\email\\header.py',
   'PYMODULE'),
  ('email.base64mime',
   'C:\\Program Files (x86)\\Python38-32\\lib\\email\\base64mime.py',
   'PYMODULE'),
  ('email.charset',
   'C:\\Program Files (x86)\\Python38-32\\lib\\email\\charset.py',
   'PYMODULE'),
  ('email.encoders',
   'C:\\Program Files (x86)\\Python38-32\\lib\\email\\encoders.py',
   'PYMODULE'),
  ('email.errors',
   'C:\\Program Files (x86)\\Python38-32\\lib\\email\\errors.py',
   'PYMODULE'),
  ('csv', 'C:\\Program Files (x86)\\Python38-32\\lib\\csv.py', 'PYMODULE'),
  ('tokenize',
   'C:\\Program Files (x86)\\Python38-32\\lib\\tokenize.py',
   'PYMODULE'),
  ('token', 'C:\\Program Files (x86)\\Python38-32\\lib\\token.py', 'PYMODULE'),
  ('lzma', 'C:\\Program Files (x86)\\Python38-32\\lib\\lzma.py', 'PYMODULE'),
  ('_compression',
   'C:\\Program Files (x86)\\Python38-32\\lib\\_compression.py',
   'PYMODULE'),
  ('bz2', 'C:\\Program Files (x86)\\Python38-32\\lib\\bz2.py', 'PYMODULE'),
  ('stat', 'C:\\Program Files (x86)\\Python38-32\\lib\\stat.py', 'PYMODULE'),
  ('posixpath',
   'C:\\Program Files (x86)\\Python38-32\\lib\\posixpath.py',
   'PYMODULE'),
  ('importlib.util',
   'C:\\Program Files (x86)\\Python38-32\\lib\\importlib\\util.py',
   'PYMODULE'),
  ('pickle',
   'C:\\Program Files (x86)\\Python38-32\\lib\\pickle.py',
   'PYMODULE'),
  ('pprint',
   'C:\\Program Files (x86)\\Python38-32\\lib\\pprint.py',
   'PYMODULE'),
  ('doctest',
   'C:\\Program Files (x86)\\Python38-32\\lib\\doctest.py',
   'PYMODULE'),
  ('unittest',
   'C:\\Program Files (x86)\\Python38-32\\lib\\unittest\\__init__.py',
   'PYMODULE'),
  ('unittest.signals',
   'C:\\Program Files (x86)\\Python38-32\\lib\\unittest\\signals.py',
   'PYMODULE'),
  ('signal',
   'C:\\Program Files (x86)\\Python38-32\\lib\\signal.py',
   'PYMODULE'),
  ('unittest.main',
   'C:\\Program Files (x86)\\Python38-32\\lib\\unittest\\main.py',
   'PYMODULE'),
  ('unittest.runner',
   'C:\\Program Files (x86)\\Python38-32\\lib\\unittest\\runner.py',
   'PYMODULE'),
  ('unittest.loader',
   'C:\\Program Files (x86)\\Python38-32\\lib\\unittest\\loader.py',
   'PYMODULE'),
  ('unittest.suite',
   'C:\\Program Files (x86)\\Python38-32\\lib\\unittest\\suite.py',
   'PYMODULE'),
  ('unittest.case',
   'C:\\Program Files (x86)\\Python38-32\\lib\\unittest\\case.py',
   'PYMODULE'),
  ('unittest.async_case',
   'C:\\Program Files (x86)\\Python38-32\\lib\\unittest\\async_case.py',
   'PYMODULE'),
  ('asyncio',
   'C:\\Program Files (x86)\\Python38-32\\lib\\asyncio\\__init__.py',
   'PYMODULE'),
  ('asyncio.unix_events',
   'C:\\Program Files (x86)\\Python38-32\\lib\\asyncio\\unix_events.py',
   'PYMODULE'),
  ('asyncio.log',
   'C:\\Program Files (x86)\\Python38-32\\lib\\asyncio\\log.py',
   'PYMODULE'),
  ('subprocess',
   'C:\\Program Files (x86)\\Python38-32\\lib\\subprocess.py',
   'PYMODULE'),
  ('asyncio.windows_events',
   'C:\\Program Files (x86)\\Python38-32\\lib\\asyncio\\windows_events.py',
   'PYMODULE'),
  ('asyncio.windows_utils',
   'C:\\Program Files (x86)\\Python38-32\\lib\\asyncio\\windows_utils.py',
   'PYMODULE'),
  ('asyncio.selector_events',
   'C:\\Program Files (x86)\\Python38-32\\lib\\asyncio\\selector_events.py',
   'PYMODULE'),
  ('ssl', 'C:\\Program Files (x86)\\Python38-32\\lib\\ssl.py', 'PYMODULE'),
  ('asyncio.proactor_events',
   'C:\\Program Files (x86)\\Python38-32\\lib\\asyncio\\proactor_events.py',
   'PYMODULE'),
  ('asyncio.base_subprocess',
   'C:\\Program Files (x86)\\Python38-32\\lib\\asyncio\\base_subprocess.py',
   'PYMODULE'),
  ('asyncio.subprocess',
   'C:\\Program Files (x86)\\Python38-32\\lib\\asyncio\\subprocess.py',
   'PYMODULE'),
  ('asyncio.streams',
   'C:\\Program Files (x86)\\Python38-32\\lib\\asyncio\\streams.py',
   'PYMODULE'),
  ('asyncio.queues',
   'C:\\Program Files (x86)\\Python38-32\\lib\\asyncio\\queues.py',
   'PYMODULE'),
  ('asyncio.runners',
   'C:\\Program Files (x86)\\Python38-32\\lib\\asyncio\\runners.py',
   'PYMODULE'),
  ('asyncio.events',
   'C:\\Program Files (x86)\\Python38-32\\lib\\asyncio\\events.py',
   'PYMODULE'),
  ('contextvars',
   'C:\\Program Files (x86)\\Python38-32\\lib\\contextvars.py',
   'PYMODULE'),
  ('asyncio.trsock',
   'C:\\Program Files (x86)\\Python38-32\\lib\\asyncio\\trsock.py',
   'PYMODULE'),
  ('asyncio.staggered',
   'C:\\Program Files (x86)\\Python38-32\\lib\\asyncio\\staggered.py',
   'PYMODULE'),
  ('typing',
   'C:\\Program Files (x86)\\Python38-32\\lib\\typing.py',
   'PYMODULE'),
  ('asyncio.tasks',
   'C:\\Program Files (x86)\\Python38-32\\lib\\asyncio\\tasks.py',
   'PYMODULE'),
  ('concurrent.futures',
   'C:\\Program Files '
   '(x86)\\Python38-32\\lib\\concurrent\\futures\\__init__.py',
   'PYMODULE'),
  ('concurrent.futures.thread',
   'C:\\Program Files (x86)\\Python38-32\\lib\\concurrent\\futures\\thread.py',
   'PYMODULE'),
  ('queue', 'C:\\Program Files (x86)\\Python38-32\\lib\\queue.py', 'PYMODULE'),
  ('concurrent.futures.process',
   'C:\\Program Files (x86)\\Python38-32\\lib\\concurrent\\futures\\process.py',
   'PYMODULE'),
  ('multiprocessing.queues',
   'C:\\Program Files (x86)\\Python38-32\\lib\\multiprocessing\\queues.py',
   'PYMODULE'),
  ('multiprocessing.synchronize',
   'C:\\Program Files (x86)\\Python38-32\\lib\\multiprocessing\\synchronize.py',
   'PYMODULE'),
  ('multiprocessing.heap',
   'C:\\Program Files (x86)\\Python38-32\\lib\\multiprocessing\\heap.py',
   'PYMODULE'),
  ('multiprocessing.resource_tracker',
   'C:\\Program Files '
   '(x86)\\Python38-32\\lib\\multiprocessing\\resource_tracker.py',
   'PYMODULE'),
  ('multiprocessing.spawn',
   'C:\\Program Files (x86)\\Python38-32\\lib\\multiprocessing\\spawn.py',
   'PYMODULE'),
  ('runpy', 'C:\\Program Files (x86)\\Python38-32\\lib\\runpy.py', 'PYMODULE'),
  ('pkgutil',
   'C:\\Program Files (x86)\\Python38-32\\lib\\pkgutil.py',
   'PYMODULE'),
  ('zipimport',
   'C:\\Program Files (x86)\\Python38-32\\lib\\zipimport.py',
   'PYMODULE'),
  ('multiprocessing.process',
   'C:\\Program Files (x86)\\Python38-32\\lib\\multiprocessing\\process.py',
   'PYMODULE'),
  ('multiprocessing.util',
   'C:\\Program Files (x86)\\Python38-32\\lib\\multiprocessing\\util.py',
   'PYMODULE'),
  ('multiprocessing.forkserver',
   'C:\\Program Files (x86)\\Python38-32\\lib\\multiprocessing\\forkserver.py',
   'PYMODULE'),
  ('test.support',
   'C:\\Program Files (x86)\\Python38-32\\lib\\test\\support\\__init__.py',
   'PYMODULE'),
  ('decimal',
   'C:\\Program Files (x86)\\Python38-32\\lib\\decimal.py',
   'PYMODULE'),
  ('_pydecimal',
   'C:\\Program Files (x86)\\Python38-32\\lib\\_pydecimal.py',
   'PYMODULE'),
  ('numbers',
   'C:\\Program Files (x86)\\Python38-32\\lib\\numbers.py',
   'PYMODULE'),
  ('distutils.spawn',
   'C:\\Program Files (x86)\\Python38-32\\lib\\distutils\\spawn.py',
   'PYMODULE'),
  ('distutils.log',
   'C:\\Program Files (x86)\\Python38-32\\lib\\distutils\\log.py',
   'PYMODULE'),
  ('distutils.debug',
   'C:\\Program Files (x86)\\Python38-32\\lib\\distutils\\debug.py',
   'PYMODULE'),
  ('distutils.errors',
   'C:\\Program Files (x86)\\Python38-32\\lib\\distutils\\errors.py',
   'PYMODULE'),
  ('distutils.sysconfig',
   'C:\\Program Files (x86)\\Python38-32\\lib\\distutils\\sysconfig.py',
   'PYMODULE'),
  ('distutils.text_file',
   'C:\\Program Files (x86)\\Python38-32\\lib\\distutils\\text_file.py',
   'PYMODULE'),
  ('_osx_support',
   'C:\\Program Files (x86)\\Python38-32\\lib\\_osx_support.py',
   'PYMODULE'),
  ('distutils.util',
   'C:\\Program Files (x86)\\Python38-32\\lib\\distutils\\util.py',
   'PYMODULE'),
  ('distutils.filelist',
   'C:\\Program Files (x86)\\Python38-32\\lib\\distutils\\filelist.py',
   'PYMODULE'),
  ('distutils.file_util',
   'C:\\Program Files (x86)\\Python38-32\\lib\\distutils\\file_util.py',
   'PYMODULE'),
  ('distutils.dir_util',
   'C:\\Program Files (x86)\\Python38-32\\lib\\distutils\\dir_util.py',
   'PYMODULE'),
  ('lib2to3.refactor',
   'C:\\Program Files (x86)\\Python38-32\\lib\\lib2to3\\refactor.py',
   'PYMODULE'),
  ('lib2to3.btm_matcher',
   'C:\\Program Files (x86)\\Python38-32\\lib\\lib2to3\\btm_matcher.py',
   'PYMODULE'),
  ('lib2to3.btm_utils',
   'C:\\Program Files (x86)\\Python38-32\\lib\\lib2to3\\btm_utils.py',
   'PYMODULE'),
  ('lib2to3.pgen2.grammar',
   'C:\\Program Files (x86)\\Python38-32\\lib\\lib2to3\\pgen2\\grammar.py',
   'PYMODULE'),
  ('lib2to3.pygram',
   'C:\\Program Files (x86)\\Python38-32\\lib\\lib2to3\\pygram.py',
   'PYMODULE'),
  ('lib2to3.pytree',
   'C:\\Program Files (x86)\\Python38-32\\lib\\lib2to3\\pytree.py',
   'PYMODULE'),
  ('lib2to3',
   'C:\\Program Files (x86)\\Python38-32\\lib\\lib2to3\\__init__.py',
   'PYMODULE'),
  ('lib2to3.patcomp',
   'C:\\Program Files (x86)\\Python38-32\\lib\\lib2to3\\patcomp.py',
   'PYMODULE'),
  ('lib2to3.pgen2.parse',
   'C:\\Program Files (x86)\\Python38-32\\lib\\lib2to3\\pgen2\\parse.py',
   'PYMODULE'),
  ('lib2to3.pgen2.literals',
   'C:\\Program Files (x86)\\Python38-32\\lib\\lib2to3\\pgen2\\literals.py',
   'PYMODULE'),
  ('lib2to3.fixer_util',
   'C:\\Program Files (x86)\\Python38-32\\lib\\lib2to3\\fixer_util.py',
   'PYMODULE'),
  ('lib2to3.pgen2.token',
   'C:\\Program Files (x86)\\Python38-32\\lib\\lib2to3\\pgen2\\token.py',
   'PYMODULE'),
  ('lib2to3.pgen2.tokenize',
   'C:\\Program Files (x86)\\Python38-32\\lib\\lib2to3\\pgen2\\tokenize.py',
   'PYMODULE'),
  ('lib2to3.pgen2.driver',
   'C:\\Program Files (x86)\\Python38-32\\lib\\lib2to3\\pgen2\\driver.py',
   'PYMODULE'),
  ('lib2to3.pgen2.pgen',
   'C:\\Program Files (x86)\\Python38-32\\lib\\lib2to3\\pgen2\\pgen.py',
   'PYMODULE'),
  ('lib2to3.pgen2',
   'C:\\Program Files (x86)\\Python38-32\\lib\\lib2to3\\pgen2\\__init__.py',
   'PYMODULE'),
  ('distutils.dep_util',
   'C:\\Program Files (x86)\\Python38-32\\lib\\distutils\\dep_util.py',
   'PYMODULE'),
  ('distutils.ccompiler',
   'C:\\Program Files (x86)\\Python38-32\\lib\\distutils\\ccompiler.py',
   'PYMODULE'),
  ('distutils.fancy_getopt',
   'C:\\Program Files (x86)\\Python38-32\\lib\\distutils\\fancy_getopt.py',
   'PYMODULE'),
  ('distutils',
   'C:\\Program Files (x86)\\Python38-32\\lib\\distutils\\__init__.py',
   'PYMODULE'),
  ('tracemalloc',
   'C:\\Program Files (x86)\\Python38-32\\lib\\tracemalloc.py',
   'PYMODULE'),
  ('urllib.request',
   'C:\\Program Files (x86)\\Python38-32\\lib\\urllib\\request.py',
   'PYMODULE'),
  ('getpass',
   'C:\\Program Files (x86)\\Python38-32\\lib\\getpass.py',
   'PYMODULE'),
  ('nturl2path',
   'C:\\Program Files (x86)\\Python38-32\\lib\\nturl2path.py',
   'PYMODULE'),
  ('ftplib',
   'C:\\Program Files (x86)\\Python38-32\\lib\\ftplib.py',
   'PYMODULE'),
  ('netrc', 'C:\\Program Files (x86)\\Python38-32\\lib\\netrc.py', 'PYMODULE'),
  ('shlex', 'C:\\Program Files (x86)\\Python38-32\\lib\\shlex.py', 'PYMODULE'),
  ('mimetypes',
   'C:\\Program Files (x86)\\Python38-32\\lib\\mimetypes.py',
   'PYMODULE'),
  ('http.cookiejar',
   'C:\\Program Files (x86)\\Python38-32\\lib\\http\\cookiejar.py',
   'PYMODULE'),
  ('http',
   'C:\\Program Files (x86)\\Python38-32\\lib\\http\\__init__.py',
   'PYMODULE'),
  ('urllib.response',
   'C:\\Program Files (x86)\\Python38-32\\lib\\urllib\\response.py',
   'PYMODULE'),
  ('http.client',
   'C:\\Program Files (x86)\\Python38-32\\lib\\http\\client.py',
   'PYMODULE'),
  ('tkinter',
   'C:\\Program Files (x86)\\Python38-32\\lib\\tkinter\\__init__.py',
   'PYMODULE'),
  ('tkinter.ttk',
   'C:\\Program Files (x86)\\Python38-32\\lib\\tkinter\\ttk.py',
   'PYMODULE'),
  ('tkinter.constants',
   'C:\\Program Files (x86)\\Python38-32\\lib\\tkinter\\constants.py',
   'PYMODULE'),
  ('ctypes.util',
   'C:\\Program Files (x86)\\Python38-32\\lib\\ctypes\\util.py',
   'PYMODULE'),
  ('ctypes._aix',
   'C:\\Program Files (x86)\\Python38-32\\lib\\ctypes\\_aix.py',
   'PYMODULE'),
  ('ctypes.macholib.dyld',
   'C:\\Program Files (x86)\\Python38-32\\lib\\ctypes\\macholib\\dyld.py',
   'PYMODULE'),
  ('ctypes.macholib',
   'C:\\Program Files (x86)\\Python38-32\\lib\\ctypes\\macholib\\__init__.py',
   'PYMODULE'),
  ('ctypes.macholib.dylib',
   'C:\\Program Files (x86)\\Python38-32\\lib\\ctypes\\macholib\\dylib.py',
   'PYMODULE'),
  ('ctypes.macholib.framework',
   'C:\\Program Files (x86)\\Python38-32\\lib\\ctypes\\macholib\\framework.py',
   'PYMODULE'),
  ('ctypes.wintypes',
   'C:\\Program Files (x86)\\Python38-32\\lib\\ctypes\\wintypes.py',
   'PYMODULE'),
  ('ctypes',
   'C:\\Program Files (x86)\\Python38-32\\lib\\ctypes\\__init__.py',
   'PYMODULE'),
  ('ctypes._endian',
   'C:\\Program Files (x86)\\Python38-32\\lib\\ctypes\\_endian.py',
   'PYMODULE'),
  ('gzip', 'C:\\Program Files (x86)\\Python38-32\\lib\\gzip.py', 'PYMODULE'),
  ('test.support.testresult',
   'C:\\Program Files (x86)\\Python38-32\\lib\\test\\support\\testresult.py',
   'PYMODULE'),
  ('xml.etree.ElementTree',
   'C:\\Program Files (x86)\\Python38-32\\lib\\xml\\etree\\ElementTree.py',
   'PYMODULE'),
  ('xml.etree.cElementTree',
   'C:\\Program Files (x86)\\Python38-32\\lib\\xml\\etree\\cElementTree.py',
   'PYMODULE'),
  ('xml.etree.ElementInclude',
   'C:\\Program Files (x86)\\Python38-32\\lib\\xml\\etree\\ElementInclude.py',
   'PYMODULE'),
  ('xml.parsers.expat',
   'C:\\Program Files (x86)\\Python38-32\\lib\\xml\\parsers\\expat.py',
   'PYMODULE'),
  ('xml.parsers',
   'C:\\Program Files (x86)\\Python38-32\\lib\\xml\\parsers\\__init__.py',
   'PYMODULE'),
  ('xml',
   'C:\\Program Files (x86)\\Python38-32\\lib\\xml\\__init__.py',
   'PYMODULE'),
  ('xml.sax.expatreader',
   'C:\\Program Files (x86)\\Python38-32\\lib\\xml\\sax\\expatreader.py',
   'PYMODULE'),
  ('xml.sax.saxutils',
   'C:\\Program Files (x86)\\Python38-32\\lib\\xml\\sax\\saxutils.py',
   'PYMODULE'),
  ('xml.sax',
   'C:\\Program Files (x86)\\Python38-32\\lib\\xml\\sax\\__init__.py',
   'PYMODULE'),
  ('xml.sax.handler',
   'C:\\Program Files (x86)\\Python38-32\\lib\\xml\\sax\\handler.py',
   'PYMODULE'),
  ('xml.sax._exceptions',
   'C:\\Program Files (x86)\\Python38-32\\lib\\xml\\sax\\_exceptions.py',
   'PYMODULE'),
  ('xml.sax.xmlreader',
   'C:\\Program Files (x86)\\Python38-32\\lib\\xml\\sax\\xmlreader.py',
   'PYMODULE'),
  ('xml.etree.ElementPath',
   'C:\\Program Files (x86)\\Python38-32\\lib\\xml\\etree\\ElementPath.py',
   'PYMODULE'),
  ('xml.etree',
   'C:\\Program Files (x86)\\Python38-32\\lib\\xml\\etree\\__init__.py',
   'PYMODULE'),
  ('urllib.error',
   'C:\\Program Files (x86)\\Python38-32\\lib\\urllib\\error.py',
   'PYMODULE'),
  ('sysconfig',
   'C:\\Program Files (x86)\\Python38-32\\lib\\sysconfig.py',
   'PYMODULE'),
  ('platform',
   'C:\\Program Files (x86)\\Python38-32\\lib\\platform.py',
   'PYMODULE'),
  ('plistlib',
   'C:\\Program Files (x86)\\Python38-32\\lib\\plistlib.py',
   'PYMODULE'),
  ('nntplib',
   'C:\\Program Files (x86)\\Python38-32\\lib\\nntplib.py',
   'PYMODULE'),
  ('logging.handlers',
   'C:\\Program Files (x86)\\Python38-32\\lib\\logging\\handlers.py',
   'PYMODULE'),
  ('win32evtlogutil',
   'c:\\projects\\mobile_royale_spam_bot.dev\\venv\\lib\\site-packages\\win32\\lib\\win32evtlogutil.py',
   'PYMODULE'),
  ('smtplib',
   'C:\\Program Files (x86)\\Python38-32\\lib\\smtplib.py',
   'PYMODULE'),
  ('hmac', 'C:\\Program Files (x86)\\Python38-32\\lib\\hmac.py', 'PYMODULE'),
  ('test',
   'C:\\Program Files (x86)\\Python38-32\\lib\\test\\__init__.py',
   'PYMODULE'),
  ('multiprocessing.context',
   'C:\\Program Files (x86)\\Python38-32\\lib\\multiprocessing\\context.py',
   'PYMODULE'),
  ('multiprocessing.popen_spawn_win32',
   'C:\\Program Files '
   '(x86)\\Python38-32\\lib\\multiprocessing\\popen_spawn_win32.py',
   'PYMODULE'),
  ('multiprocessing.popen_forkserver',
   'C:\\Program Files '
   '(x86)\\Python38-32\\lib\\multiprocessing\\popen_forkserver.py',
   'PYMODULE'),
  ('multiprocessing.popen_spawn_posix',
   'C:\\Program Files '
   '(x86)\\Python38-32\\lib\\multiprocessing\\popen_spawn_posix.py',
   'PYMODULE'),
  ('multiprocessing.popen_fork',
   'C:\\Program Files (x86)\\Python38-32\\lib\\multiprocessing\\popen_fork.py',
   'PYMODULE'),
  ('multiprocessing.sharedctypes',
   'C:\\Program Files '
   '(x86)\\Python38-32\\lib\\multiprocessing\\sharedctypes.py',
   'PYMODULE'),
  ('multiprocessing.pool',
   'C:\\Program Files (x86)\\Python38-32\\lib\\multiprocessing\\pool.py',
   'PYMODULE'),
  ('multiprocessing.dummy',
   'C:\\Program Files '
   '(x86)\\Python38-32\\lib\\multiprocessing\\dummy\\__init__.py',
   'PYMODULE'),
  ('multiprocessing.dummy.connection',
   'C:\\Program Files '
   '(x86)\\Python38-32\\lib\\multiprocessing\\dummy\\connection.py',
   'PYMODULE'),
  ('multiprocessing.managers',
   'C:\\Program Files (x86)\\Python38-32\\lib\\multiprocessing\\managers.py',
   'PYMODULE'),
  ('multiprocessing.shared_memory',
   'C:\\Program Files '
   '(x86)\\Python38-32\\lib\\multiprocessing\\shared_memory.py',
   'PYMODULE'),
  ('secrets',
   'C:\\Program Files (x86)\\Python38-32\\lib\\secrets.py',
   'PYMODULE'),
  ('multiprocessing.reduction',
   'C:\\Program Files (x86)\\Python38-32\\lib\\multiprocessing\\reduction.py',
   'PYMODULE'),
  ('multiprocessing.resource_sharer',
   'C:\\Program Files '
   '(x86)\\Python38-32\\lib\\multiprocessing\\resource_sharer.py',
   'PYMODULE'),
  ('multiprocessing.connection',
   'C:\\Program Files (x86)\\Python38-32\\lib\\multiprocessing\\connection.py',
   'PYMODULE'),
  ('xmlrpc.client',
   'C:\\Program Files (x86)\\Python38-32\\lib\\xmlrpc\\client.py',
   'PYMODULE'),
  ('xmlrpc',
   'C:\\Program Files (x86)\\Python38-32\\lib\\xmlrpc\\__init__.py',
   'PYMODULE'),
  ('multiprocessing',
   'C:\\Program Files (x86)\\Python38-32\\lib\\multiprocessing\\__init__.py',
   'PYMODULE'),
  ('concurrent.futures._base',
   'C:\\Program Files (x86)\\Python38-32\\lib\\concurrent\\futures\\_base.py',
   'PYMODULE'),
  ('concurrent',
   'C:\\Program Files (x86)\\Python38-32\\lib\\concurrent\\__init__.py',
   'PYMODULE'),
  ('asyncio.base_tasks',
   'C:\\Program Files (x86)\\Python38-32\\lib\\asyncio\\base_tasks.py',
   'PYMODULE'),
  ('asyncio.locks',
   'C:\\Program Files (x86)\\Python38-32\\lib\\asyncio\\locks.py',
   'PYMODULE'),
  ('asyncio.sslproto',
   'C:\\Program Files (x86)\\Python38-32\\lib\\asyncio\\sslproto.py',
   'PYMODULE'),
  ('asyncio.transports',
   'C:\\Program Files (x86)\\Python38-32\\lib\\asyncio\\transports.py',
   'PYMODULE'),
  ('asyncio.base_events',
   'C:\\Program Files (x86)\\Python38-32\\lib\\asyncio\\base_events.py',
   'PYMODULE'),
  ('asyncio.protocols',
   'C:\\Program Files (x86)\\Python38-32\\lib\\asyncio\\protocols.py',
   'PYMODULE'),
  ('asyncio.futures',
   'C:\\Program Files (x86)\\Python38-32\\lib\\asyncio\\futures.py',
   'PYMODULE'),
  ('asyncio.coroutines',
   'C:\\Program Files (x86)\\Python38-32\\lib\\asyncio\\coroutines.py',
   'PYMODULE'),
  ('asyncio.base_futures',
   'C:\\Program Files (x86)\\Python38-32\\lib\\asyncio\\base_futures.py',
   'PYMODULE'),
  ('asyncio.exceptions',
   'C:\\Program Files (x86)\\Python38-32\\lib\\asyncio\\exceptions.py',
   'PYMODULE'),
  ('asyncio.format_helpers',
   'C:\\Program Files (x86)\\Python38-32\\lib\\asyncio\\format_helpers.py',
   'PYMODULE'),
  ('asyncio.constants',
   'C:\\Program Files (x86)\\Python38-32\\lib\\asyncio\\constants.py',
   'PYMODULE'),
  ('unittest.result',
   'C:\\Program Files (x86)\\Python38-32\\lib\\unittest\\result.py',
   'PYMODULE'),
  ('unittest.util',
   'C:\\Program Files (x86)\\Python38-32\\lib\\unittest\\util.py',
   'PYMODULE'),
  ('pdb', 'C:\\Program Files (x86)\\Python38-32\\lib\\pdb.py', 'PYMODULE'),
  ('pydoc', 'C:\\Program Files (x86)\\Python38-32\\lib\\pydoc.py', 'PYMODULE'),
  ('webbrowser',
   'C:\\Program Files (x86)\\Python38-32\\lib\\webbrowser.py',
   'PYMODULE'),
  ('http.server',
   'C:\\Program Files (x86)\\Python38-32\\lib\\http\\server.py',
   'PYMODULE'),
  ('socketserver',
   'C:\\Program Files (x86)\\Python38-32\\lib\\socketserver.py',
   'PYMODULE'),
  ('html',
   'C:\\Program Files (x86)\\Python38-32\\lib\\html\\__init__.py',
   'PYMODULE'),
  ('html.entities',
   'C:\\Program Files (x86)\\Python38-32\\lib\\html\\entities.py',
   'PYMODULE'),
  ('pydoc_data.topics',
   'C:\\Program Files (x86)\\Python38-32\\lib\\pydoc_data\\topics.py',
   'PYMODULE'),
  ('pydoc_data',
   'C:\\Program Files (x86)\\Python38-32\\lib\\pydoc_data\\__init__.py',
   'PYMODULE'),
  ('tty', 'C:\\Program Files (x86)\\Python38-32\\lib\\tty.py', 'PYMODULE'),
  ('code', 'C:\\Program Files (x86)\\Python38-32\\lib\\code.py', 'PYMODULE'),
  ('codeop',
   'C:\\Program Files (x86)\\Python38-32\\lib\\codeop.py',
   'PYMODULE'),
  ('dis', 'C:\\Program Files (x86)\\Python38-32\\lib\\dis.py', 'PYMODULE'),
  ('opcode',
   'C:\\Program Files (x86)\\Python38-32\\lib\\opcode.py',
   'PYMODULE'),
  ('bdb', 'C:\\Program Files (x86)\\Python38-32\\lib\\bdb.py', 'PYMODULE'),
  ('cmd', 'C:\\Program Files (x86)\\Python38-32\\lib\\cmd.py', 'PYMODULE'),
  ('inspect',
   'C:\\Program Files (x86)\\Python38-32\\lib\\inspect.py',
   'PYMODULE'),
  ('ast', 'C:\\Program Files (x86)\\Python38-32\\lib\\ast.py', 'PYMODULE'),
  ('difflib',
   'C:\\Program Files (x86)\\Python38-32\\lib\\difflib.py',
   'PYMODULE'),
  ('__future__',
   'C:\\Program Files (x86)\\Python38-32\\lib\\__future__.py',
   'PYMODULE'),
  ('_compat_pickle',
   'C:\\Program Files (x86)\\Python38-32\\lib\\_compat_pickle.py',
   'PYMODULE'),
  ('glob', 'C:\\Program Files (x86)\\Python38-32\\lib\\glob.py', 'PYMODULE'),
  ('win32com.client.selecttlb',
   'c:\\projects\\mobile_royale_spam_bot.dev\\venv\\lib\\site-packages\\win32com\\client\\selecttlb.py',
   'PYMODULE'),
  ('pywin.dialogs.list',
   'c:\\projects\\mobile_royale_spam_bot.dev\\venv\\lib\\site-packages\\Pythonwin\\pywin\\dialogs\\list.py',
   'PYMODULE'),
  ('commctrl',
   'c:\\projects\\mobile_royale_spam_bot.dev\\venv\\lib\\site-packages\\win32\\lib\\commctrl.py',
   'PYMODULE'),
  ('win32com.client.genpy',
   'c:\\projects\\mobile_royale_spam_bot.dev\\venv\\lib\\site-packages\\win32com\\client\\genpy.py',
   'PYMODULE'),
  ('win32com.client.CLSIDToClass',
   'c:\\projects\\mobile_royale_spam_bot.dev\\venv\\lib\\site-packages\\win32com\\client\\CLSIDToClass.py',
   'PYMODULE'),
  ('win32com.client.dynamic',
   'c:\\projects\\mobile_royale_spam_bot.dev\\venv\\lib\\site-packages\\win32com\\client\\dynamic.py',
   'PYMODULE'),
  ('win32com.client.build',
   'c:\\projects\\mobile_royale_spam_bot.dev\\venv\\lib\\site-packages\\win32com\\client\\build.py',
   'PYMODULE'),
  ('pywintypes',
   'c:\\projects\\mobile_royale_spam_bot.dev\\venv\\lib\\site-packages\\win32\\lib\\pywintypes.py',
   'PYMODULE'),
  ('win32com.server',
   'c:\\projects\\mobile_royale_spam_bot.dev\\venv\\lib\\site-packages\\win32com\\server\\__init__.py',
   'PYMODULE'),
  ('win32com.universal',
   'c:\\projects\\mobile_royale_spam_bot.dev\\venv\\lib\\site-packages\\win32com\\universal.py',
   'PYMODULE'),
  ('win32com.client.util',
   'c:\\projects\\mobile_royale_spam_bot.dev\\venv\\lib\\site-packages\\win32com\\client\\util.py',
   'PYMODULE'),
  ('imp', 'C:\\Program Files (x86)\\Python38-32\\lib\\imp.py', 'PYMODULE'),
  ('pythoncom',
   'c:\\projects\\mobile_royale_spam_bot.dev\\venv\\lib\\site-packages\\pythoncom.py',
   'PYMODULE'),
  ('tempfile',
   'C:\\Program Files (x86)\\Python38-32\\lib\\tempfile.py',
   'PYMODULE'),
  ('shutil',
   'C:\\Program Files (x86)\\Python38-32\\lib\\shutil.py',
   'PYMODULE'),
  ('tarfile',
   'C:\\Program Files (x86)\\Python38-32\\lib\\tarfile.py',
   'PYMODULE'),
  ('os', 'C:\\Program Files (x86)\\Python38-32\\lib\\os.py', 'PYMODULE'),
  ('stringprep',
   'C:\\Program Files (x86)\\Python38-32\\lib\\stringprep.py',
   'PYMODULE'),
  ('_py_abc',
   'C:\\Program Files (x86)\\Python38-32\\lib\\_py_abc.py',
   'PYMODULE'),
  ('pywinauto.keyboard',
   'c:\\projects\\mobile_royale_spam_bot.dev\\venv\\lib\\site-packages\\pywinauto\\keyboard.py',
   'PYMODULE'),
  ('pywinauto.win32functions',
   'c:\\projects\\mobile_royale_spam_bot.dev\\venv\\lib\\site-packages\\pywinauto\\win32functions.py',
   'PYMODULE'),
  ('pywinauto.actionlogger',
   'c:\\projects\\mobile_royale_spam_bot.dev\\venv\\lib\\site-packages\\pywinauto\\actionlogger.py',
   'PYMODULE'),
  ('pywinauto.win32defines',
   'c:\\projects\\mobile_royale_spam_bot.dev\\venv\\lib\\site-packages\\pywinauto\\win32defines.py',
   'PYMODULE'),
  ('pywinauto.win32structures',
   'c:\\projects\\mobile_royale_spam_bot.dev\\venv\\lib\\site-packages\\pywinauto\\win32structures.py',
   'PYMODULE'),
  ('pywinauto.sysinfo',
   'c:\\projects\\mobile_royale_spam_bot.dev\\venv\\lib\\site-packages\\pywinauto\\sysinfo.py',
   'PYMODULE'),
  ('comtypes',
   'c:\\projects\\mobile_royale_spam_bot.dev\\venv\\lib\\site-packages\\comtypes\\__init__.py',
   'PYMODULE'),
  ('comtypes._meta',
   'c:\\projects\\mobile_royale_spam_bot.dev\\venv\\lib\\site-packages\\comtypes\\_meta.py',
   'PYMODULE'),
  ('comtypes._comobject',
   'c:\\projects\\mobile_royale_spam_bot.dev\\venv\\lib\\site-packages\\comtypes\\_comobject.py',
   'PYMODULE'),
  ('comtypes.typeinfo',
   'c:\\projects\\mobile_royale_spam_bot.dev\\venv\\lib\\site-packages\\comtypes\\typeinfo.py',
   'PYMODULE'),
  ('comtypes.hresult',
   'c:\\projects\\mobile_royale_spam_bot.dev\\venv\\lib\\site-packages\\comtypes\\hresult.py',
   'PYMODULE'),
  ('comtypes.errorinfo',
   'c:\\projects\\mobile_royale_spam_bot.dev\\venv\\lib\\site-packages\\comtypes\\errorinfo.py',
   'PYMODULE'),
  ('comtypes.server',
   'c:\\projects\\mobile_royale_spam_bot.dev\\venv\\lib\\site-packages\\comtypes\\server\\__init__.py',
   'PYMODULE'),
  ('comtypes.client',
   'c:\\projects\\mobile_royale_spam_bot.dev\\venv\\lib\\site-packages\\comtypes\\client\\__init__.py',
   'PYMODULE'),
  ('comtypes.gen',
   'c:\\projects\\mobile_royale_spam_bot.dev\\venv\\lib\\site-packages\\comtypes\\gen\\__init__.py',
   'PYMODULE'),
  ('comtypes.client._code_cache',
   'c:\\projects\\mobile_royale_spam_bot.dev\\venv\\lib\\site-packages\\comtypes\\client\\_code_cache.py',
   'PYMODULE'),
  ('comtypes.client._generate',
   'c:\\projects\\mobile_royale_spam_bot.dev\\venv\\lib\\site-packages\\comtypes\\client\\_generate.py',
   'PYMODULE'),
  ('comtypes.tools.tlbparser',
   'c:\\projects\\mobile_royale_spam_bot.dev\\venv\\lib\\site-packages\\comtypes\\tools\\tlbparser.py',
   'PYMODULE'),
  ('comtypes.persist',
   'c:\\projects\\mobile_royale_spam_bot.dev\\venv\\lib\\site-packages\\comtypes\\persist.py',
   'PYMODULE'),
  ('comtypes.tools.typedesc',
   'c:\\projects\\mobile_royale_spam_bot.dev\\venv\\lib\\site-packages\\comtypes\\tools\\typedesc.py',
   'PYMODULE'),
  ('comtypes.tools.typedesc_base',
   'c:\\projects\\mobile_royale_spam_bot.dev\\venv\\lib\\site-packages\\comtypes\\tools\\typedesc_base.py',
   'PYMODULE'),
  ('comtypes.tools',
   'c:\\projects\\mobile_royale_spam_bot.dev\\venv\\lib\\site-packages\\comtypes\\tools\\__init__.py',
   'PYMODULE'),
  ('comtypes.client._events',
   'c:\\projects\\mobile_royale_spam_bot.dev\\venv\\lib\\site-packages\\comtypes\\client\\_events.py',
   'PYMODULE'),
  ('comtypes.connectionpoints',
   'c:\\projects\\mobile_royale_spam_bot.dev\\venv\\lib\\site-packages\\comtypes\\connectionpoints.py',
   'PYMODULE'),
  ('comtypes.client.dynamic',
   'c:\\projects\\mobile_royale_spam_bot.dev\\venv\\lib\\site-packages\\comtypes\\client\\dynamic.py',
   'PYMODULE'),
  ('comtypes.client.lazybind',
   'c:\\projects\\mobile_royale_spam_bot.dev\\venv\\lib\\site-packages\\comtypes\\client\\lazybind.py',
   'PYMODULE'),
  ('comtypes.automation',
   'c:\\projects\\mobile_royale_spam_bot.dev\\venv\\lib\\site-packages\\comtypes\\automation.py',
   'PYMODULE'),
  ('comtypes.safearray',
   'c:\\projects\\mobile_royale_spam_bot.dev\\venv\\lib\\site-packages\\comtypes\\safearray.py',
   'PYMODULE'),
  ('comtypes.tools.codegenerator',
   'c:\\projects\\mobile_royale_spam_bot.dev\\venv\\lib\\site-packages\\comtypes\\tools\\codegenerator.py',
   'PYMODULE'),
  ('comtypes.messageloop',
   'c:\\projects\\mobile_royale_spam_bot.dev\\venv\\lib\\site-packages\\comtypes\\messageloop.py',
   'PYMODULE'),
  ('comtypes._safearray',
   'c:\\projects\\mobile_royale_spam_bot.dev\\venv\\lib\\site-packages\\comtypes\\_safearray.py',
   'PYMODULE'),
  ('comtypes.npsupport',
   'c:\\projects\\mobile_royale_spam_bot.dev\\venv\\lib\\site-packages\\comtypes\\npsupport.py',
   'PYMODULE'),
  ('comtypes.GUID',
   'c:\\projects\\mobile_royale_spam_bot.dev\\venv\\lib\\site-packages\\comtypes\\GUID.py',
   'PYMODULE'),
  ('comtypes.patcher',
   'c:\\projects\\mobile_royale_spam_bot.dev\\venv\\lib\\site-packages\\comtypes\\patcher.py',
   'PYMODULE'),
  ('six',
   'c:\\projects\\mobile_royale_spam_bot.dev\\venv\\lib\\site-packages\\six.py',
   'PYMODULE'),
  ('pywinauto.linux.keyboard',
   'c:\\projects\\mobile_royale_spam_bot.dev\\venv\\lib\\site-packages\\pywinauto\\linux\\keyboard.py',
   'PYMODULE'),
  ('pywinauto.linux',
   'c:\\projects\\mobile_royale_spam_bot.dev\\venv\\lib\\site-packages\\pywinauto\\linux\\__init__.py',
   'PYMODULE'),
  ('pywinauto',
   'c:\\projects\\mobile_royale_spam_bot.dev\\venv\\lib\\site-packages\\pywinauto\\__init__.py',
   'PYMODULE'),
  ('pywinauto.application',
   'c:\\projects\\mobile_royale_spam_bot.dev\\venv\\lib\\site-packages\\pywinauto\\application.py',
   'PYMODULE'),
  ('pywinauto.handleprops',
   'c:\\projects\\mobile_royale_spam_bot.dev\\venv\\lib\\site-packages\\pywinauto\\handleprops.py',
   'PYMODULE'),
  ('pywinauto.timings',
   'c:\\projects\\mobile_royale_spam_bot.dev\\venv\\lib\\site-packages\\pywinauto\\timings.py',
   'PYMODULE'),
  ('pywinauto.findwindows',
   'c:\\projects\\mobile_royale_spam_bot.dev\\venv\\lib\\site-packages\\pywinauto\\findwindows.py',
   'PYMODULE'),
  ('pywinauto.xml_helpers',
   'c:\\projects\\mobile_royale_spam_bot.dev\\venv\\lib\\site-packages\\pywinauto\\xml_helpers.py',
   'PYMODULE'),
  ('PIL.Image',
   'c:\\projects\\mobile_royale_spam_bot.dev\\venv\\lib\\site-packages\\PIL\\Image.py',
   'PYMODULE'),
  ('PIL.GbrImagePlugin',
   'c:\\projects\\mobile_royale_spam_bot.dev\\venv\\lib\\site-packages\\PIL\\GbrImagePlugin.py',
   'PYMODULE'),
  ('PIL.ImageFile',
   'c:\\projects\\mobile_royale_spam_bot.dev\\venv\\lib\\site-packages\\PIL\\ImageFile.py',
   'PYMODULE'),
  ('PIL.PcdImagePlugin',
   'c:\\projects\\mobile_royale_spam_bot.dev\\venv\\lib\\site-packages\\PIL\\PcdImagePlugin.py',
   'PYMODULE'),
  ('PIL.DcxImagePlugin',
   'c:\\projects\\mobile_royale_spam_bot.dev\\venv\\lib\\site-packages\\PIL\\DcxImagePlugin.py',
   'PYMODULE'),
  ('PIL.PixarImagePlugin',
   'c:\\projects\\mobile_royale_spam_bot.dev\\venv\\lib\\site-packages\\PIL\\PixarImagePlugin.py',
   'PYMODULE'),
  ('PIL.PcxImagePlugin',
   'c:\\projects\\mobile_royale_spam_bot.dev\\venv\\lib\\site-packages\\PIL\\PcxImagePlugin.py',
   'PYMODULE'),
  ('PIL.IcoImagePlugin',
   'c:\\projects\\mobile_royale_spam_bot.dev\\venv\\lib\\site-packages\\PIL\\IcoImagePlugin.py',
   'PYMODULE'),
  ('PIL.MpoImagePlugin',
   'c:\\projects\\mobile_royale_spam_bot.dev\\venv\\lib\\site-packages\\PIL\\MpoImagePlugin.py',
   'PYMODULE'),
  ('PIL.CurImagePlugin',
   'c:\\projects\\mobile_royale_spam_bot.dev\\venv\\lib\\site-packages\\PIL\\CurImagePlugin.py',
   'PYMODULE'),
  ('PIL.DdsImagePlugin',
   'c:\\projects\\mobile_royale_spam_bot.dev\\venv\\lib\\site-packages\\PIL\\DdsImagePlugin.py',
   'PYMODULE'),
  ('PIL.PdfImagePlugin',
   'c:\\projects\\mobile_royale_spam_bot.dev\\venv\\lib\\site-packages\\PIL\\PdfImagePlugin.py',
   'PYMODULE'),
  ('PIL.PdfParser',
   'c:\\projects\\mobile_royale_spam_bot.dev\\venv\\lib\\site-packages\\PIL\\PdfParser.py',
   'PYMODULE'),
  ('PIL.ImageSequence',
   'c:\\projects\\mobile_royale_spam_bot.dev\\venv\\lib\\site-packages\\PIL\\ImageSequence.py',
   'PYMODULE'),
  ('PIL.FitsStubImagePlugin',
   'c:\\projects\\mobile_royale_spam_bot.dev\\venv\\lib\\site-packages\\PIL\\FitsStubImagePlugin.py',
   'PYMODULE'),
  ('PIL.PsdImagePlugin',
   'c:\\projects\\mobile_royale_spam_bot.dev\\venv\\lib\\site-packages\\PIL\\PsdImagePlugin.py',
   'PYMODULE'),
  ('PIL.Hdf5StubImagePlugin',
   'c:\\projects\\mobile_royale_spam_bot.dev\\venv\\lib\\site-packages\\PIL\\Hdf5StubImagePlugin.py',
   'PYMODULE'),
  ('PIL.XbmImagePlugin',
   'c:\\projects\\mobile_royale_spam_bot.dev\\venv\\lib\\site-packages\\PIL\\XbmImagePlugin.py',
   'PYMODULE'),
  ('PIL.BlpImagePlugin',
   'c:\\projects\\mobile_royale_spam_bot.dev\\venv\\lib\\site-packages\\PIL\\BlpImagePlugin.py',
   'PYMODULE'),
  ('PIL.SunImagePlugin',
   'c:\\projects\\mobile_royale_spam_bot.dev\\venv\\lib\\site-packages\\PIL\\SunImagePlugin.py',
   'PYMODULE'),
  ('PIL.MpegImagePlugin',
   'c:\\projects\\mobile_royale_spam_bot.dev\\venv\\lib\\site-packages\\PIL\\MpegImagePlugin.py',
   'PYMODULE'),
  ('PIL.XpmImagePlugin',
   'c:\\projects\\mobile_royale_spam_bot.dev\\venv\\lib\\site-packages\\PIL\\XpmImagePlugin.py',
   'PYMODULE'),
  ('PIL.ImtImagePlugin',
   'c:\\projects\\mobile_royale_spam_bot.dev\\venv\\lib\\site-packages\\PIL\\ImtImagePlugin.py',
   'PYMODULE'),
  ('PIL.GribStubImagePlugin',
   'c:\\projects\\mobile_royale_spam_bot.dev\\venv\\lib\\site-packages\\PIL\\GribStubImagePlugin.py',
   'PYMODULE'),
  ('PIL.FpxImagePlugin',
   'c:\\projects\\mobile_royale_spam_bot.dev\\venv\\lib\\site-packages\\PIL\\FpxImagePlugin.py',
   'PYMODULE'),
  ('PIL.XVThumbImagePlugin',
   'c:\\projects\\mobile_royale_spam_bot.dev\\venv\\lib\\site-packages\\PIL\\XVThumbImagePlugin.py',
   'PYMODULE'),
  ('PIL.WmfImagePlugin',
   'c:\\projects\\mobile_royale_spam_bot.dev\\venv\\lib\\site-packages\\PIL\\WmfImagePlugin.py',
   'PYMODULE'),
  ('PIL.FliImagePlugin',
   'c:\\projects\\mobile_royale_spam_bot.dev\\venv\\lib\\site-packages\\PIL\\FliImagePlugin.py',
   'PYMODULE'),
  ('PIL.SgiImagePlugin',
   'c:\\projects\\mobile_royale_spam_bot.dev\\venv\\lib\\site-packages\\PIL\\SgiImagePlugin.py',
   'PYMODULE'),
  ('PIL.IcnsImagePlugin',
   'c:\\projects\\mobile_royale_spam_bot.dev\\venv\\lib\\site-packages\\PIL\\IcnsImagePlugin.py',
   'PYMODULE'),
  ('PIL.McIdasImagePlugin',
   'c:\\projects\\mobile_royale_spam_bot.dev\\venv\\lib\\site-packages\\PIL\\McIdasImagePlugin.py',
   'PYMODULE'),
  ('PIL.ImImagePlugin',
   'c:\\projects\\mobile_royale_spam_bot.dev\\venv\\lib\\site-packages\\PIL\\ImImagePlugin.py',
   'PYMODULE'),
  ('PIL.MspImagePlugin',
   'c:\\projects\\mobile_royale_spam_bot.dev\\venv\\lib\\site-packages\\PIL\\MspImagePlugin.py',
   'PYMODULE'),
  ('PIL.WebPImagePlugin',
   'c:\\projects\\mobile_royale_spam_bot.dev\\venv\\lib\\site-packages\\PIL\\WebPImagePlugin.py',
   'PYMODULE'),
  ('PIL.SpiderImagePlugin',
   'c:\\projects\\mobile_royale_spam_bot.dev\\venv\\lib\\site-packages\\PIL\\SpiderImagePlugin.py',
   'PYMODULE'),
  ('PIL.ImageTk',
   'c:\\projects\\mobile_royale_spam_bot.dev\\venv\\lib\\site-packages\\PIL\\ImageTk.py',
   'PYMODULE'),
  ('PIL.FtexImagePlugin',
   'c:\\projects\\mobile_royale_spam_bot.dev\\venv\\lib\\site-packages\\PIL\\FtexImagePlugin.py',
   'PYMODULE'),
  ('PIL.PalmImagePlugin',
   'c:\\projects\\mobile_royale_spam_bot.dev\\venv\\lib\\site-packages\\PIL\\PalmImagePlugin.py',
   'PYMODULE'),
  ('PIL.Jpeg2KImagePlugin',
   'c:\\projects\\mobile_royale_spam_bot.dev\\venv\\lib\\site-packages\\PIL\\Jpeg2KImagePlugin.py',
   'PYMODULE'),
  ('PIL.MicImagePlugin',
   'c:\\projects\\mobile_royale_spam_bot.dev\\venv\\lib\\site-packages\\PIL\\MicImagePlugin.py',
   'PYMODULE'),
  ('PIL.EpsImagePlugin',
   'c:\\projects\\mobile_royale_spam_bot.dev\\venv\\lib\\site-packages\\PIL\\EpsImagePlugin.py',
   'PYMODULE'),
  ('PIL.IptcImagePlugin',
   'c:\\projects\\mobile_royale_spam_bot.dev\\venv\\lib\\site-packages\\PIL\\IptcImagePlugin.py',
   'PYMODULE'),
  ('PIL.BufrStubImagePlugin',
   'c:\\projects\\mobile_royale_spam_bot.dev\\venv\\lib\\site-packages\\PIL\\BufrStubImagePlugin.py',
   'PYMODULE'),
  ('PIL.TgaImagePlugin',
   'c:\\projects\\mobile_royale_spam_bot.dev\\venv\\lib\\site-packages\\PIL\\TgaImagePlugin.py',
   'PYMODULE'),
  ('PIL.TiffImagePlugin',
   'c:\\projects\\mobile_royale_spam_bot.dev\\venv\\lib\\site-packages\\PIL\\TiffImagePlugin.py',
   'PYMODULE'),
  ('fractions',
   'C:\\Program Files (x86)\\Python38-32\\lib\\fractions.py',
   'PYMODULE'),
  ('PIL.ImageShow',
   'c:\\projects\\mobile_royale_spam_bot.dev\\venv\\lib\\site-packages\\PIL\\ImageShow.py',
   'PYMODULE'),
  ('PIL.ImageQt',
   'c:\\projects\\mobile_royale_spam_bot.dev\\venv\\lib\\site-packages\\PIL\\ImageQt.py',
   'PYMODULE'),
  ('PIL.ImageColor',
   'c:\\projects\\mobile_royale_spam_bot.dev\\venv\\lib\\site-packages\\PIL\\ImageColor.py',
   'PYMODULE'),
  ('colorsys',
   'C:\\Program Files (x86)\\Python38-32\\lib\\colorsys.py',
   'PYMODULE'),
  ('PIL.ImageFilter',
   'c:\\projects\\mobile_royale_spam_bot.dev\\venv\\lib\\site-packages\\PIL\\ImageFilter.py',
   'PYMODULE'),
  ('PIL.PyAccess',
   'c:\\projects\\mobile_royale_spam_bot.dev\\venv\\lib\\site-packages\\PIL\\PyAccess.py',
   'PYMODULE'),
  ('PIL.ImagePalette',
   'c:\\projects\\mobile_royale_spam_bot.dev\\venv\\lib\\site-packages\\PIL\\ImagePalette.py',
   'PYMODULE'),
  ('PIL.PaletteFile',
   'c:\\projects\\mobile_royale_spam_bot.dev\\venv\\lib\\site-packages\\PIL\\PaletteFile.py',
   'PYMODULE'),
  ('PIL.GimpPaletteFile',
   'c:\\projects\\mobile_royale_spam_bot.dev\\venv\\lib\\site-packages\\PIL\\GimpPaletteFile.py',
   'PYMODULE'),
  ('PIL.GimpGradientFile',
   'c:\\projects\\mobile_royale_spam_bot.dev\\venv\\lib\\site-packages\\PIL\\GimpGradientFile.py',
   'PYMODULE'),
  ('PIL.PngImagePlugin',
   'c:\\projects\\mobile_royale_spam_bot.dev\\venv\\lib\\site-packages\\PIL\\PngImagePlugin.py',
   'PYMODULE'),
  ('PIL.ImageChops',
   'c:\\projects\\mobile_royale_spam_bot.dev\\venv\\lib\\site-packages\\PIL\\ImageChops.py',
   'PYMODULE'),
  ('PIL.PpmImagePlugin',
   'c:\\projects\\mobile_royale_spam_bot.dev\\venv\\lib\\site-packages\\PIL\\PpmImagePlugin.py',
   'PYMODULE'),
  ('PIL.JpegImagePlugin',
   'c:\\projects\\mobile_royale_spam_bot.dev\\venv\\lib\\site-packages\\PIL\\JpegImagePlugin.py',
   'PYMODULE'),
  ('PIL.JpegPresets',
   'c:\\projects\\mobile_royale_spam_bot.dev\\venv\\lib\\site-packages\\PIL\\JpegPresets.py',
   'PYMODULE'),
  ('PIL.GifImagePlugin',
   'c:\\projects\\mobile_royale_spam_bot.dev\\venv\\lib\\site-packages\\PIL\\GifImagePlugin.py',
   'PYMODULE'),
  ('PIL.BmpImagePlugin',
   'c:\\projects\\mobile_royale_spam_bot.dev\\venv\\lib\\site-packages\\PIL\\BmpImagePlugin.py',
   'PYMODULE'),
  ('PIL._util',
   'c:\\projects\\mobile_royale_spam_bot.dev\\venv\\lib\\site-packages\\PIL\\_util.py',
   'PYMODULE'),
  ('PIL._binary',
   'c:\\projects\\mobile_royale_spam_bot.dev\\venv\\lib\\site-packages\\PIL\\_binary.py',
   'PYMODULE'),
  ('PIL.TiffTags',
   'c:\\projects\\mobile_royale_spam_bot.dev\\venv\\lib\\site-packages\\PIL\\TiffTags.py',
   'PYMODULE'),
  ('PIL.ImageMode',
   'c:\\projects\\mobile_royale_spam_bot.dev\\venv\\lib\\site-packages\\PIL\\ImageMode.py',
   'PYMODULE'),
  ('PIL',
   'c:\\projects\\mobile_royale_spam_bot.dev\\venv\\lib\\site-packages\\PIL\\__init__.py',
   'PYMODULE'),
  ('PIL.ImageGrab',
   'c:\\projects\\mobile_royale_spam_bot.dev\\venv\\lib\\site-packages\\PIL\\ImageGrab.py',
   'PYMODULE'),
  ('PIL.ImageDraw2',
   'c:\\projects\\mobile_royale_spam_bot.dev\\venv\\lib\\site-packages\\PIL\\ImageDraw2.py',
   'PYMODULE'),
  ('PIL.ImagePath',
   'c:\\projects\\mobile_royale_spam_bot.dev\\venv\\lib\\site-packages\\PIL\\ImagePath.py',
   'PYMODULE'),
  ('PIL.ImageDraw',
   'c:\\projects\\mobile_royale_spam_bot.dev\\venv\\lib\\site-packages\\PIL\\ImageDraw.py',
   'PYMODULE'),
  ('PIL.ImageFont',
   'c:\\projects\\mobile_royale_spam_bot.dev\\venv\\lib\\site-packages\\PIL\\ImageFont.py',
   'PYMODULE'),
  ('PIL.ImageOps',
   'c:\\projects\\mobile_royale_spam_bot.dev\\venv\\lib\\site-packages\\PIL\\ImageOps.py',
   'PYMODULE'),
  ('PIL._version',
   'c:\\projects\\mobile_royale_spam_bot.dev\\venv\\lib\\site-packages\\PIL\\_version.py',
   'PYMODULE'),
  ('pywinauto.controls',
   'c:\\projects\\mobile_royale_spam_bot.dev\\venv\\lib\\site-packages\\pywinauto\\controls\\__init__.py',
   'PYMODULE'),
  ('pywinauto.base_wrapper',
   'c:\\projects\\mobile_royale_spam_bot.dev\\venv\\lib\\site-packages\\pywinauto\\base_wrapper.py',
   'PYMODULE'),
  ('pywinauto.mouse',
   'c:\\projects\\mobile_royale_spam_bot.dev\\venv\\lib\\site-packages\\pywinauto\\mouse.py',
   'PYMODULE'),
  ('pywinauto.controls.uia_controls',
   'c:\\projects\\mobile_royale_spam_bot.dev\\venv\\lib\\site-packages\\pywinauto\\controls\\uia_controls.py',
   'PYMODULE'),
  ('pywinauto.uia_defines',
   'c:\\projects\\mobile_royale_spam_bot.dev\\venv\\lib\\site-packages\\pywinauto\\uia_defines.py',
   'PYMODULE'),
  ('pywinauto.uia_element_info',
   'c:\\projects\\mobile_royale_spam_bot.dev\\venv\\lib\\site-packages\\pywinauto\\uia_element_info.py',
   'PYMODULE'),
  ('pywinauto.element_info',
   'c:\\projects\\mobile_royale_spam_bot.dev\\venv\\lib\\site-packages\\pywinauto\\element_info.py',
   'PYMODULE'),
  ('pywinauto.controls.common_controls',
   'c:\\projects\\mobile_royale_spam_bot.dev\\venv\\lib\\site-packages\\pywinauto\\controls\\common_controls.py',
   'PYMODULE'),
  ('pywinauto.remote_memory_block',
   'c:\\projects\\mobile_royale_spam_bot.dev\\venv\\lib\\site-packages\\pywinauto\\remote_memory_block.py',
   'PYMODULE'),
  ('pywinauto.controls.win32_controls',
   'c:\\projects\\mobile_royale_spam_bot.dev\\venv\\lib\\site-packages\\pywinauto\\controls\\win32_controls.py',
   'PYMODULE'),
  ('pywinauto.controls.hwndwrapper',
   'c:\\projects\\mobile_royale_spam_bot.dev\\venv\\lib\\site-packages\\pywinauto\\controls\\hwndwrapper.py',
   'PYMODULE'),
  ('pywinauto.controls.menuwrapper',
   'c:\\projects\\mobile_royale_spam_bot.dev\\venv\\lib\\site-packages\\pywinauto\\controls\\menuwrapper.py',
   'PYMODULE'),
  ('win32gui_struct',
   'c:\\projects\\mobile_royale_spam_bot.dev\\venv\\lib\\site-packages\\win32\\lib\\win32gui_struct.py',
   'PYMODULE'),
  ('pywinauto.win32_element_info',
   'c:\\projects\\mobile_royale_spam_bot.dev\\venv\\lib\\site-packages\\pywinauto\\win32_element_info.py',
   'PYMODULE'),
  ('pywinauto.controls.uiawrapper',
   'c:\\projects\\mobile_royale_spam_bot.dev\\venv\\lib\\site-packages\\pywinauto\\controls\\uiawrapper.py',
   'PYMODULE'),
  ('pywinauto.tests',
   'c:\\projects\\mobile_royale_spam_bot.dev\\venv\\lib\\site-packages\\pywinauto\\tests\\__init__.py',
   'PYMODULE'),
  ('pywinauto.controlproperties',
   'c:\\projects\\mobile_royale_spam_bot.dev\\venv\\lib\\site-packages\\pywinauto\\controlproperties.py',
   'PYMODULE'),
  ('pywinauto.backend',
   'c:\\projects\\mobile_royale_spam_bot.dev\\venv\\lib\\site-packages\\pywinauto\\backend.py',
   'PYMODULE'),
  ('pywinauto.findbestmatch',
   'c:\\projects\\mobile_royale_spam_bot.dev\\venv\\lib\\site-packages\\pywinauto\\findbestmatch.py',
   'PYMODULE'),
  ('pyautogui',
   'c:\\projects\\mobile_royale_spam_bot.dev\\venv\\lib\\site-packages\\pyautogui\\__init__.py',
   'PYMODULE'),
  ('pyautogui._pyautogui_x11',
   'c:\\projects\\mobile_royale_spam_bot.dev\\venv\\lib\\site-packages\\pyautogui\\_pyautogui_x11.py',
   'PYMODULE'),
  ('pyautogui._pyautogui_win',
   'c:\\projects\\mobile_royale_spam_bot.dev\\venv\\lib\\site-packages\\pyautogui\\_pyautogui_win.py',
   'PYMODULE'),
  ('pyautogui._pyautogui_osx',
   'c:\\projects\\mobile_royale_spam_bot.dev\\venv\\lib\\site-packages\\pyautogui\\_pyautogui_osx.py',
   'PYMODULE'),
  ('pygetwindow',
   'c:\\projects\\mobile_royale_spam_bot.dev\\venv\\lib\\site-packages\\pygetwindow\\__init__.py',
   'PYMODULE'),
  ('pygetwindow._pygetwindow_win',
   'c:\\projects\\mobile_royale_spam_bot.dev\\venv\\lib\\site-packages\\pygetwindow\\_pygetwindow_win.py',
   'PYMODULE'),
  ('pygetwindow._pygetwindow_macos',
   'c:\\projects\\mobile_royale_spam_bot.dev\\venv\\lib\\site-packages\\pygetwindow\\_pygetwindow_macos.py',
   'PYMODULE'),
  ('pyrect',
   'c:\\projects\\mobile_royale_spam_bot.dev\\venv\\lib\\site-packages\\pyrect\\__init__.py',
   'PYMODULE'),
  ('mouseinfo',
   'c:\\projects\\mobile_royale_spam_bot.dev\\venv\\lib\\site-packages\\mouseinfo\\__init__.py',
   'PYMODULE'),
  ('pyperclip',
   'c:\\projects\\mobile_royale_spam_bot.dev\\venv\\lib\\site-packages\\pyperclip\\__init__.py',
   'PYMODULE'),
  ('pyscreeze',
   'c:\\projects\\mobile_royale_spam_bot.dev\\venv\\lib\\site-packages\\pyscreeze\\__init__.py',
   'PYMODULE'),
  ('pymsgbox',
   'c:\\projects\\mobile_royale_spam_bot.dev\\venv\\lib\\site-packages\\pymsgbox\\__init__.py',
   'PYMODULE'),
  ('pymsgbox._native_win',
   'c:\\projects\\mobile_royale_spam_bot.dev\\venv\\lib\\site-packages\\pymsgbox\\_native_win.py',
   'PYMODULE'),
  ('pytweening',
   'c:\\projects\\mobile_royale_spam_bot.dev\\venv\\lib\\site-packages\\pytweening\\__init__.py',
   'PYMODULE')])
