# 1 "C:\\Users\\sgart\\Documents\\Coding\\C\\cpp\\lift-door\\Build\\HelloWorld.c"
# 1 "C:\\Users\\sgart\\Documents\\Coding\\C\\cpp\\lift-door\\Build//"
# 1 "<built-in>"
# 1 "<command-line>"
# 1 "C:\\Users\\sgart\\Documents\\Coding\\C\\cpp\\lift-door\\Build\\HelloWorld.c"
# 1 "C:\\Users\\sgart\\Documents\\Avr\\ToolChain\\AvrLib\\include/Atmega328P.h" 1
# 10 "C:\\Users\\sgart\\Documents\\Avr\\ToolChain\\AvrLib\\include/Atmega328P.h"
# 1 "c:\\users\\sgart\\documents\\avr\\toolchain\\avr8-gnu-toolchain-win32_x86\\avr\\include\\avr\\sfr_defs.h" 1 3
# 126 "c:\\users\\sgart\\documents\\avr\\toolchain\\avr8-gnu-toolchain-win32_x86\\avr\\include\\avr\\sfr_defs.h" 3
# 1 "c:\\users\\sgart\\documents\\avr\\toolchain\\avr8-gnu-toolchain-win32_x86\\avr\\include\\inttypes.h" 1 3
# 37 "c:\\users\\sgart\\documents\\avr\\toolchain\\avr8-gnu-toolchain-win32_x86\\avr\\include\\inttypes.h" 3
# 1 "c:\\users\\sgart\\documents\\avr\\toolchain\\avr8-gnu-toolchain-win32_x86\\lib\\gcc\\avr\\5.4.0\\include\\stdint.h" 1 3 4
# 9 "c:\\users\\sgart\\documents\\avr\\toolchain\\avr8-gnu-toolchain-win32_x86\\lib\\gcc\\avr\\5.4.0\\include\\stdint.h" 3 4
# 1 "c:\\users\\sgart\\documents\\avr\\toolchain\\avr8-gnu-toolchain-win32_x86\\avr\\include\\stdint.h" 1 3 4
# 125 "c:\\users\\sgart\\documents\\avr\\toolchain\\avr8-gnu-toolchain-win32_x86\\avr\\include\\stdint.h" 3 4

# 125 "c:\\users\\sgart\\documents\\avr\\toolchain\\avr8-gnu-toolchain-win32_x86\\avr\\include\\stdint.h" 3 4
typedef signed int int8_t __attribute__((__mode__(__QI__)));
typedef unsigned int uint8_t __attribute__((__mode__(__QI__)));
typedef signed int int16_t __attribute__ ((__mode__ (__HI__)));
typedef unsigned int uint16_t __attribute__ ((__mode__ (__HI__)));
typedef signed int int32_t __attribute__ ((__mode__ (__SI__)));
typedef unsigned int uint32_t __attribute__ ((__mode__ (__SI__)));

typedef signed int int64_t __attribute__((__mode__(__DI__)));
typedef unsigned int uint64_t __attribute__((__mode__(__DI__)));
# 146 "c:\\users\\sgart\\documents\\avr\\toolchain\\avr8-gnu-toolchain-win32_x86\\avr\\include\\stdint.h" 3 4
typedef int16_t intptr_t;




typedef uint16_t uintptr_t;
# 163 "c:\\users\\sgart\\documents\\avr\\toolchain\\avr8-gnu-toolchain-win32_x86\\avr\\include\\stdint.h" 3 4
typedef int8_t int_least8_t;




typedef uint8_t uint_least8_t;




typedef int16_t int_least16_t;




typedef uint16_t uint_least16_t;




typedef int32_t int_least32_t;




typedef uint32_t uint_least32_t;







typedef int64_t int_least64_t;






typedef uint64_t uint_least64_t;
# 217 "c:\\users\\sgart\\documents\\avr\\toolchain\\avr8-gnu-toolchain-win32_x86\\avr\\include\\stdint.h" 3 4
typedef int8_t int_fast8_t;




typedef uint8_t uint_fast8_t;




typedef int16_t int_fast16_t;




typedef uint16_t uint_fast16_t;




typedef int32_t int_fast32_t;




typedef uint32_t uint_fast32_t;







typedef int64_t int_fast64_t;






typedef uint64_t uint_fast64_t;
# 277 "c:\\users\\sgart\\documents\\avr\\toolchain\\avr8-gnu-toolchain-win32_x86\\avr\\include\\stdint.h" 3 4
typedef int64_t intmax_t;




typedef uint64_t uintmax_t;
# 10 "c:\\users\\sgart\\documents\\avr\\toolchain\\avr8-gnu-toolchain-win32_x86\\lib\\gcc\\avr\\5.4.0\\include\\stdint.h" 2 3 4
# 38 "c:\\users\\sgart\\documents\\avr\\toolchain\\avr8-gnu-toolchain-win32_x86\\avr\\include\\inttypes.h" 2 3
# 77 "c:\\users\\sgart\\documents\\avr\\toolchain\\avr8-gnu-toolchain-win32_x86\\avr\\include\\inttypes.h" 3
typedef int32_t int_farptr_t;



typedef uint32_t uint_farptr_t;
# 127 "c:\\users\\sgart\\documents\\avr\\toolchain\\avr8-gnu-toolchain-win32_x86\\avr\\include\\avr\\sfr_defs.h" 2 3
# 11 "C:\\Users\\sgart\\Documents\\Avr\\ToolChain\\AvrLib\\include/Atmega328P.h" 2
# 1 "c:\\users\\sgart\\documents\\avr\\toolchain\\avr8-gnu-toolchain-win32_x86\\avr\\include\\avr\\common.h" 1 3
# 12 "C:\\Users\\sgart\\Documents\\Avr\\ToolChain\\AvrLib\\include/Atmega328P.h" 2

# 1 "c:\\users\\sgart\\documents\\avr\\toolchain\\avr8-gnu-toolchain-win32_x86\\avr\\include\\avr\\interrupt.h" 1 3
# 38 "c:\\users\\sgart\\documents\\avr\\toolchain\\avr8-gnu-toolchain-win32_x86\\avr\\include\\avr\\interrupt.h" 3
# 1 "c:\\users\\sgart\\documents\\avr\\toolchain\\avr8-gnu-toolchain-win32_x86\\avr\\include\\avr\\io.h" 1 3
# 272 "c:\\users\\sgart\\documents\\avr\\toolchain\\avr8-gnu-toolchain-win32_x86\\avr\\include\\avr\\io.h" 3
# 1 "c:\\users\\sgart\\documents\\avr\\toolchain\\avr8-gnu-toolchain-win32_x86\\avr\\include\\avr\\iom328p.h" 1 3
# 273 "c:\\users\\sgart\\documents\\avr\\toolchain\\avr8-gnu-toolchain-win32_x86\\avr\\include\\avr\\io.h" 2 3
# 627 "c:\\users\\sgart\\documents\\avr\\toolchain\\avr8-gnu-toolchain-win32_x86\\avr\\include\\avr\\io.h" 3
# 1 "c:\\users\\sgart\\documents\\avr\\toolchain\\avr8-gnu-toolchain-win32_x86\\avr\\include\\avr\\portpins.h" 1 3
# 628 "c:\\users\\sgart\\documents\\avr\\toolchain\\avr8-gnu-toolchain-win32_x86\\avr\\include\\avr\\io.h" 2 3



# 1 "c:\\users\\sgart\\documents\\avr\\toolchain\\avr8-gnu-toolchain-win32_x86\\avr\\include\\avr\\version.h" 1 3
# 632 "c:\\users\\sgart\\documents\\avr\\toolchain\\avr8-gnu-toolchain-win32_x86\\avr\\include\\avr\\io.h" 2 3






# 1 "c:\\users\\sgart\\documents\\avr\\toolchain\\avr8-gnu-toolchain-win32_x86\\avr\\include\\avr\\fuse.h" 1 3
# 239 "c:\\users\\sgart\\documents\\avr\\toolchain\\avr8-gnu-toolchain-win32_x86\\avr\\include\\avr\\fuse.h" 3
typedef struct
{
    unsigned char low;
    unsigned char high;
    unsigned char extended;
} __fuse_t;
# 639 "c:\\users\\sgart\\documents\\avr\\toolchain\\avr8-gnu-toolchain-win32_x86\\avr\\include\\avr\\io.h" 2 3


# 1 "c:\\users\\sgart\\documents\\avr\\toolchain\\avr8-gnu-toolchain-win32_x86\\avr\\include\\avr\\lock.h" 1 3
# 642 "c:\\users\\sgart\\documents\\avr\\toolchain\\avr8-gnu-toolchain-win32_x86\\avr\\include\\avr\\io.h" 2 3
# 39 "c:\\users\\sgart\\documents\\avr\\toolchain\\avr8-gnu-toolchain-win32_x86\\avr\\include\\avr\\interrupt.h" 2 3
# 14 "C:\\Users\\sgart\\Documents\\Avr\\ToolChain\\AvrLib\\include/Atmega328P.h" 2
# 107 "C:\\Users\\sgart\\Documents\\Avr\\ToolChain\\AvrLib\\include/Atmega328P.h"

# 107 "C:\\Users\\sgart\\Documents\\Avr\\ToolChain\\AvrLib\\include/Atmega328P.h"
typedef enum
{
    Idle=0,
    AdcNoiseRed=1,
    PowerDown=2,
    PowerSave=3,
    StandBy=6,
    ExtStandBy=7,
} SleepMode;
# 184 "C:\\Users\\sgart\\Documents\\Avr\\ToolChain\\AvrLib\\include/Atmega328P.h"
typedef enum
{
    InterruptOnLow=0,
    InterruptOnChange=1,
    InterruptOnFallingEdge=2,
    InterruptOnRaisingEdge=3,
} IscOptions;







typedef struct GPIO_T_tag
{
    volatile uint8_t PIN;
    volatile uint8_t DDR;
    volatile uint8_t PORT;
} GPIO_T;
# 264 "C:\\Users\\sgart\\Documents\\Avr\\ToolChain\\AvrLib\\include/Atmega328P.h"
typedef enum
{
    DdrInput=0,
    DdrOutput=1,
} DataDirection_T;







typedef struct TCNT8_T_tag
{
    volatile uint8_t TCCRA;
    volatile uint8_t TCCRB;
    volatile uint8_t TCNT;
    volatile uint8_t OCRA;
    volatile uint8_t OCRB;
} TCNT8_T;
# 314 "C:\\Users\\sgart\\Documents\\Avr\\ToolChain\\AvrLib\\include/Atmega328P.h"
typedef enum
{
    Normal=0,
    PwmNormal=1,
    ClrTmrOnCmpMatch=2,
    FastPwm=3,
} WaveFormGenerationModes;
# 365 "C:\\Users\\sgart\\Documents\\Avr\\ToolChain\\AvrLib\\include/Atmega328P.h"
typedef enum
{
    CS_Off=0,
    CS_Div1=1,
    CS_Div8=2,
    CsT1_Div64=3,
    CsT1_Div256=4,
    CsT1_Div1024=5,
    CsT1_T0Falling=6,
    CsT1_T0Raising=7,
    CsT2_Div32=3,
    CsT2_Div64=4,
    CsT2_Div128=5,
    CsT2_Div256=6,
    CsT2_Div1024=7,
} ClkSelect;







typedef struct TCNT16_T_tag
{
    volatile uint8_t TCCRA;
    volatile int8_t TCCRB;
    volatile uint8_t TCCRC;
    volatile uint8_t Reserved;
    volatile uint16_t TCNT;
    volatile uint16_t ICR;
    volatile uint16_t OCRA;
    volatile uint16_t OCRB;
} TCNT16_T;
# 490 "C:\\Users\\sgart\\Documents\\Avr\\ToolChain\\AvrLib\\include/Atmega328P.h"
typedef struct USART_T_tag
{
    volatile uint8_t UCSRA;
    volatile uint8_t UCSRB;
    volatile uint8_t UCSRC;
    volatile uint8_t Reserved;
    volatile uint16_t UBBR;
    volatile uint8_t UDR;
} USART_T;
# 646 "C:\\Users\\sgart\\Documents\\Avr\\ToolChain\\AvrLib\\include/Atmega328P.h"
typedef enum
{
    NoParityCheck=0,
    EvenParity=2,
    OddParity=3,
} UART_ParityMode;

typedef enum
{
    Asynchronous=0,
    Synchronous=1,
    SpiMaster=3,
} UART_ModeSelect;
# 674 "C:\\Users\\sgart\\Documents\\Avr\\ToolChain\\AvrLib\\include/Atmega328P.h"
typedef struct ADC_T_tag
{
    volatile uint16_t Data;
    volatile uint8_t Adcsra;
    volatile uint8_t Adcsrb;
    volatile uint8_t Admux;
    volatile uint8_t Reserved;
    volatile uint8_t Didr0;
    volatile uint8_t Didr1;
} ADC_T;
# 726 "C:\\Users\\sgart\\Documents\\Avr\\ToolChain\\AvrLib\\include/Atmega328P.h"
typedef enum
{
    AdcDiv2=1,
    AdcDiv4=2,
    AdcDiv8=3,
    AdcDiv16=4,
    AdcDiv32=5,
    AdcDiv64=6,
    AdcDiv128=7,
} AdcPrescaler;
# 765 "C:\\Users\\sgart\\Documents\\Avr\\ToolChain\\AvrLib\\include/Atmega328P.h"
typedef enum
{
    FreeRunning=0,
    AnalogComparator=1,
    ExtInterrupt=2,
    Tc0Compare=3,
    Tc0Overflow=4,
    Tc1Compare=5,
    Tc1Overflow=6,
    Tc1Capture=6,
} AD_AutoTriggerSource;
# 805 "C:\\Users\\sgart\\Documents\\Avr\\ToolChain\\AvrLib\\include/Atmega328P.h"
typedef enum
{
    MuxAdc0=0,
    MuxAdc1=1,
    MuxAdc2=2,
    MuxAdc3=3,
    MuxAdc4=4,
    MuxAdc5=5,
    MuxAdc6=6,
    MuxAdc7=7,
    MuxTemp=8,
    Mux11V=14,
    MuxGnd=15,
} AnalogChannelSelection;

typedef enum
{
    ExternalAREF=0,
    InternalVCC=1,
    Internal1_1=3,
} ReferenceSelection;
# 2 "C:\\Users\\sgart\\Documents\\Coding\\C\\cpp\\lift-door\\Build\\HelloWorld.c" 2
# 1 "C:\\Users\\sgart\\Documents\\Avr\\ToolChain\\AvrLib\\include/avrlib.h" 1
# 28 "C:\\Users\\sgart\\Documents\\Avr\\ToolChain\\AvrLib\\include/avrlib.h"
typedef enum
{
 False = 0,
 True = 1
} Bool;







typedef enum
{
    ExtInterruptSource0,
    ExtInterruptSource1
}ExtInteruptSource;





typedef enum
{
    ExtIntTrigger_OnLow = 0,
    ExtIntTrigger_OnChange = 1,
    ExtIntTrigger_OnFallingEdge = 2,
    ExtIntTrigger_OnRaisingEdge = 3,
}ExtIntTrigger;







typedef enum
{
    CompareMatchSource1=0,
    CompareMatchSource2=1,
    CompareMatchSource3=2,
    CompareMatchSource4=3,
}CompareMatchSource;






typedef enum
{
    TimerFrequency_Div1 = 0,
    TimerFrequency_Div8 = 1,
    TimerFrequency_Div64 = 2,
    TimerFrequency_Div256 = 3,
    TimerFrequency_Div1024 = 4,
}TimerFrequency;


typedef enum
{
    Priority_0,
    Priority_1,
    Priority_2,
    Priority_3,
    Priority_4,
    Priority_5,
    Priority_6,
    Priority_7,
} Priority_T;

typedef enum
{
    MessageId_Undefined = 0,
    MessageId_HwEvent = 1,
} MessageId;




typedef enum
{
  PacketType_Undefined = 0,
  PacketType_LiftSimulatorButton = 0xA2,
  PacketType_TestCommand = 0xA3,
     PacketType_RawData = 0xA4,
     PacketType_ReadRegister = 0xA6,
     PacketType_WriteRegister = 0xA8,
     PacketType_TraceMassagePadLen = 0xA8,
  PacketType_TraceMessage = 0xA5,
} AvrPacketType;






 typedef struct AvrMessage_tag
 {
  AvrPacketType MsgType;
  uint8_t Length;
  uint8_t Payload[12];
 }AvrMessage;
# 141 "C:\\Users\\sgart\\Documents\\Avr\\ToolChain\\AvrLib\\include/avrlib.h"
 typedef struct Message_tag
 {
     uint8_t Priority;

     uint8_t Id;
     union
     {
         struct
         {
             uint8_t MsgParamLow;
             uint8_t MsgParamHigh;
         };
         void* Ptr;
     };
     struct Message_tag* __next;
 }Message;







 typedef void (*IsrHandler)(void);




 typedef void (*StateHandler)(const Message* msg);




 typedef Bool (*AvrMessageHandler)(const AvrMessage* msg);
# 189 "C:\\Users\\sgart\\Documents\\Avr\\ToolChain\\AvrLib\\include/avrlib.h"
 typedef struct Fsm_tag
 {
     struct Fsm_tag* Next;
     uint8_t RxMask;
     StateHandler CurrentState;
 }Fsm;
# 216 "C:\\Users\\sgart\\Documents\\Avr\\ToolChain\\AvrLib\\include/avrlib.h"
 void InitializeStateEventFramework(void);
# 228 "C:\\Users\\sgart\\Documents\\Avr\\ToolChain\\AvrLib\\include/avrlib.h"
 AvrMessageHandler RegisterAvrMessageHandler(AvrMessageHandler handler);
# 240 "C:\\Users\\sgart\\Documents\\Avr\\ToolChain\\AvrLib\\include/avrlib.h"
 Bool DefaultMessageHandler(const AvrMessage* msg);
# 252 "C:\\Users\\sgart\\Documents\\Avr\\ToolChain\\AvrLib\\include/avrlib.h"
 void RegisterExternalInteruptHandler(ExtInteruptSource source,
     ExtIntTrigger trigger, IsrHandler handler);






 void SetExtInterruptEnable(ExtInteruptSource source, Bool enable);
# 272 "C:\\Users\\sgart\\Documents\\Avr\\ToolChain\\AvrLib\\include/avrlib.h"
 uint16_t MeasureOnce(AnalogChannelSelection channel, ReferenceSelection Vref, AdcPrescaler prescaler);






 void UnregisterExternalInterruptHandler(ExtInteruptSource source);
# 295 "C:\\Users\\sgart\\Documents\\Avr\\ToolChain\\AvrLib\\include/avrlib.h"
 void RegisterCompareMatchInterrupt(CompareMatchSource source,
     TimerFrequency frequency, uint8_t match, IsrHandler handler);

 void UnregisterCompareMatchInterrupt(CompareMatchSource source);
# 309 "C:\\Users\\sgart\\Documents\\Avr\\ToolChain\\AvrLib\\include/avrlib.h"
 void StartTimer(void);





 uint32_t GetElapsedTime(void);





void RegisterFsm(Fsm* fsm);







void SetState(Fsm* fsm, StateHandler state);
# 340 "C:\\Users\\sgart\\Documents\\Avr\\ToolChain\\AvrLib\\include/avrlib.h"
void SendMessage(uint8_t prio, uint8_t id, uint8_t msgLow, uint8_t msgHigh);
# 350 "C:\\Users\\sgart\\Documents\\Avr\\ToolChain\\AvrLib\\include/avrlib.h"
Bool DispatchEvent(void);




void Usart_Init(uint32_t baudrate);





void Usart_Trace0(uint16_t id );
void Usart_Trace1(uint16_t id, uint8_t val);
void Usart_Trace2(uint16_t id, uint8_t val1, uint8_t val2);
void Usart_Trace3(uint16_t id, uint8_t val1, uint8_t val2, uint8_t val3);
void Usart_Trace4(uint16_t id, uint8_t val1, uint8_t val2, uint8_t val3, uint8_t val4);






void Usart_PutChar(char ch);




void EnterAtomic(void);

void LeaveAtomic(void);




void IsrEnter(void);




void IsrLeave(void);
# 3 "C:\\Users\\sgart\\Documents\\Coding\\C\\cpp\\lift-door\\Build\\HelloWorld.c" 2
# 1 "C:\\Users\\sgart\\Documents\\Avr\\ToolChain\\AvrLib\\include/RegisterAccess.h" 1
# 4 "C:\\Users\\sgart\\Documents\\Coding\\C\\cpp\\lift-door\\Build\\HelloWorld.c" 2

# 1 "c:\\users\\sgart\\documents\\avr\\toolchain\\avr8-gnu-toolchain-win32_x86\\avr\\include\\util\\delay.h" 1 3
# 45 "c:\\users\\sgart\\documents\\avr\\toolchain\\avr8-gnu-toolchain-win32_x86\\avr\\include\\util\\delay.h" 3
# 1 "c:\\users\\sgart\\documents\\avr\\toolchain\\avr8-gnu-toolchain-win32_x86\\avr\\include\\util\\delay_basic.h" 1 3
# 40 "c:\\users\\sgart\\documents\\avr\\toolchain\\avr8-gnu-toolchain-win32_x86\\avr\\include\\util\\delay_basic.h" 3

# 40 "c:\\users\\sgart\\documents\\avr\\toolchain\\avr8-gnu-toolchain-win32_x86\\avr\\include\\util\\delay_basic.h" 3
static __inline__ void _delay_loop_1(uint8_t __count) __attribute__((__always_inline__));
static __inline__ void _delay_loop_2(uint16_t __count) __attribute__((__always_inline__));
# 80 "c:\\users\\sgart\\documents\\avr\\toolchain\\avr8-gnu-toolchain-win32_x86\\avr\\include\\util\\delay_basic.h" 3
void
_delay_loop_1(uint8_t __count)
{
 __asm__ volatile (
  "1: dec %0" "\n\t"
  "brne 1b"
  : "=r" (__count)
  : "0" (__count)
 );
}
# 102 "c:\\users\\sgart\\documents\\avr\\toolchain\\avr8-gnu-toolchain-win32_x86\\avr\\include\\util\\delay_basic.h" 3
void
_delay_loop_2(uint16_t __count)
{
 __asm__ volatile (
  "1: sbiw %0,1" "\n\t"
  "brne 1b"
  : "=w" (__count)
  : "0" (__count)
 );
}
# 46 "c:\\users\\sgart\\documents\\avr\\toolchain\\avr8-gnu-toolchain-win32_x86\\avr\\include\\util\\delay.h" 2 3
# 1 "c:\\users\\sgart\\documents\\avr\\toolchain\\avr8-gnu-toolchain-win32_x86\\avr\\include\\math.h" 1 3
# 127 "c:\\users\\sgart\\documents\\avr\\toolchain\\avr8-gnu-toolchain-win32_x86\\avr\\include\\math.h" 3
extern double cos(double __x) __attribute__((__const__));





extern double sin(double __x) __attribute__((__const__));





extern double tan(double __x) __attribute__((__const__));






extern double fabs(double __x) __attribute__((__const__));






extern double fmod(double __x, double __y) __attribute__((__const__));
# 168 "c:\\users\\sgart\\documents\\avr\\toolchain\\avr8-gnu-toolchain-win32_x86\\avr\\include\\math.h" 3
extern double modf(double __x, double *__iptr);


extern float modff (float __x, float *__iptr);




extern double sqrt(double __x) __attribute__((__const__));


extern float sqrtf (float) __attribute__((__const__));




extern double cbrt(double __x) __attribute__((__const__));
# 195 "c:\\users\\sgart\\documents\\avr\\toolchain\\avr8-gnu-toolchain-win32_x86\\avr\\include\\math.h" 3
extern double hypot (double __x, double __y) __attribute__((__const__));







extern double square(double __x) __attribute__((__const__));






extern double floor(double __x) __attribute__((__const__));






extern double ceil(double __x) __attribute__((__const__));
# 235 "c:\\users\\sgart\\documents\\avr\\toolchain\\avr8-gnu-toolchain-win32_x86\\avr\\include\\math.h" 3
extern double frexp(double __x, int *__pexp);







extern double ldexp(double __x, int __exp) __attribute__((__const__));





extern double exp(double __x) __attribute__((__const__));





extern double cosh(double __x) __attribute__((__const__));





extern double sinh(double __x) __attribute__((__const__));





extern double tanh(double __x) __attribute__((__const__));







extern double acos(double __x) __attribute__((__const__));







extern double asin(double __x) __attribute__((__const__));






extern double atan(double __x) __attribute__((__const__));
# 299 "c:\\users\\sgart\\documents\\avr\\toolchain\\avr8-gnu-toolchain-win32_x86\\avr\\include\\math.h" 3
extern double atan2(double __y, double __x) __attribute__((__const__));





extern double log(double __x) __attribute__((__const__));





extern double log10(double __x) __attribute__((__const__));





extern double pow(double __x, double __y) __attribute__((__const__));






extern int isnan(double __x) __attribute__((__const__));
# 334 "c:\\users\\sgart\\documents\\avr\\toolchain\\avr8-gnu-toolchain-win32_x86\\avr\\include\\math.h" 3
extern int isinf(double __x) __attribute__((__const__));






__attribute__((__const__)) static inline int isfinite (double __x)
{
    unsigned char __exp;
    __asm__ (
 "mov	%0, %C1		\n\t"
 "lsl	%0		\n\t"
 "mov	%0, %D1		\n\t"
 "rol	%0		"
 : "=r" (__exp)
 : "r" (__x) );
    return __exp != 0xff;
}






__attribute__((__const__)) static inline double copysign (double __x, double __y)
{
    __asm__ (
 "bst	%D2, 7	\n\t"
 "bld	%D0, 7	"
 : "=r" (__x)
 : "0" (__x), "r" (__y) );
    return __x;
}
# 377 "c:\\users\\sgart\\documents\\avr\\toolchain\\avr8-gnu-toolchain-win32_x86\\avr\\include\\math.h" 3
extern int signbit (double __x) __attribute__((__const__));






extern double fdim (double __x, double __y) __attribute__((__const__));
# 393 "c:\\users\\sgart\\documents\\avr\\toolchain\\avr8-gnu-toolchain-win32_x86\\avr\\include\\math.h" 3
extern double fma (double __x, double __y, double __z) __attribute__((__const__));







extern double fmax (double __x, double __y) __attribute__((__const__));







extern double fmin (double __x, double __y) __attribute__((__const__));






extern double trunc (double __x) __attribute__((__const__));
# 427 "c:\\users\\sgart\\documents\\avr\\toolchain\\avr8-gnu-toolchain-win32_x86\\avr\\include\\math.h" 3
extern double round (double __x) __attribute__((__const__));
# 440 "c:\\users\\sgart\\documents\\avr\\toolchain\\avr8-gnu-toolchain-win32_x86\\avr\\include\\math.h" 3
extern long lround (double __x) __attribute__((__const__));
# 454 "c:\\users\\sgart\\documents\\avr\\toolchain\\avr8-gnu-toolchain-win32_x86\\avr\\include\\math.h" 3
extern long lrint (double __x) __attribute__((__const__));
# 47 "c:\\users\\sgart\\documents\\avr\\toolchain\\avr8-gnu-toolchain-win32_x86\\avr\\include\\util\\delay.h" 2 3
# 86 "c:\\users\\sgart\\documents\\avr\\toolchain\\avr8-gnu-toolchain-win32_x86\\avr\\include\\util\\delay.h" 3
static __inline__ void _delay_us(double __us) __attribute__((__always_inline__));
static __inline__ void _delay_ms(double __ms) __attribute__((__always_inline__));
# 165 "c:\\users\\sgart\\documents\\avr\\toolchain\\avr8-gnu-toolchain-win32_x86\\avr\\include\\util\\delay.h" 3
void
_delay_ms(double __ms)
{
 double __tmp ;



 uint32_t __ticks_dc;
 extern void __builtin_avr_delay_cycles(unsigned long);
 __tmp = ((
# 174 "c:\\users\\sgart\\documents\\avr\\toolchain\\avr8-gnu-toolchain-win32_x86\\avr\\include\\util\\delay.h"
          16000000
# 174 "c:\\users\\sgart\\documents\\avr\\toolchain\\avr8-gnu-toolchain-win32_x86\\avr\\include\\util\\delay.h" 3
               ) / 1e3) * __ms;
# 184 "c:\\users\\sgart\\documents\\avr\\toolchain\\avr8-gnu-toolchain-win32_x86\\avr\\include\\util\\delay.h" 3
  __ticks_dc = (uint32_t)(ceil(fabs(__tmp)));


 __builtin_avr_delay_cycles(__ticks_dc);
# 210 "c:\\users\\sgart\\documents\\avr\\toolchain\\avr8-gnu-toolchain-win32_x86\\avr\\include\\util\\delay.h" 3
}
# 254 "c:\\users\\sgart\\documents\\avr\\toolchain\\avr8-gnu-toolchain-win32_x86\\avr\\include\\util\\delay.h" 3
void
_delay_us(double __us)
{
 double __tmp ;



 uint32_t __ticks_dc;
 extern void __builtin_avr_delay_cycles(unsigned long);
 __tmp = ((
# 263 "c:\\users\\sgart\\documents\\avr\\toolchain\\avr8-gnu-toolchain-win32_x86\\avr\\include\\util\\delay.h"
          16000000
# 263 "c:\\users\\sgart\\documents\\avr\\toolchain\\avr8-gnu-toolchain-win32_x86\\avr\\include\\util\\delay.h" 3
               ) / 1e6) * __us;
# 273 "c:\\users\\sgart\\documents\\avr\\toolchain\\avr8-gnu-toolchain-win32_x86\\avr\\include\\util\\delay.h" 3
  __ticks_dc = (uint32_t)(ceil(fabs(__tmp)));


 __builtin_avr_delay_cycles(__ticks_dc);
# 299 "c:\\users\\sgart\\documents\\avr\\toolchain\\avr8-gnu-toolchain-win32_x86\\avr\\include\\util\\delay.h" 3
}
# 6 "C:\\Users\\sgart\\Documents\\Coding\\C\\cpp\\lift-door\\Build\\HelloWorld.c" 2




# 9 "C:\\Users\\sgart\\Documents\\Coding\\C\\cpp\\lift-door\\Build\\HelloWorld.c"
void openDoor();
void CloseDoor();
void doorClosed();
void doorOpened();
Bool CustomAvrMessageHandler(const AvrMessage* msg);
void InitialState(const Message*msg);

Fsm controller = {.RxMask=0xFF, .CurrentState=InitialState};

int main(void) {
 Usart_Init(250000);


    RegisterFsm(&controller);

    RegisterAvrMessageHandler(CustomAvrMessageHandler);


    RegisterExternalInteruptHandler(ExtInterruptSource0, ExtIntTrigger_OnRaisingEdge, doorOpened);
    RegisterExternalInteruptHandler(ExtInterruptSource1, ExtIntTrigger_OnRaisingEdge, doorClosed);


    (*((volatile TCNT8_T*)0x00000044)).TCCRA = 1 | (2 << 4) | (2 << 6);
    (*((volatile TCNT8_T*)0x00000044)).TCCRB = 0x5;
    (*((volatile TCNT8_T*)0x00000044)).OCRA = 0;
    (*((volatile TCNT8_T*)0x00000044)).OCRB = 0;

    InitializeStateEventFramework();
    return 0;
}


void openDoor() {
    SendMessage(3, 1, 0x1, 0x2);


    SetExtInterruptEnable(ExtInterruptSource0, False);
    SetExtInterruptEnable(ExtInterruptSource1, True);

    (*((volatile TCNT8_T*)0x00000044)).OCRA = 0x33;
    (*((volatile TCNT8_T*)0x00000044)).OCRB = 0x0;
}
void closeDoor() {
    SendMessage(3, 2, 0x1, 0x2);


    SetExtInterruptEnable(ExtInterruptSource0, True);
    SetExtInterruptEnable(ExtInterruptSource1, False);

    (*((volatile TCNT8_T*)0x00000044)).OCRA = 0x0;
    (*((volatile TCNT8_T*)0x00000044)).OCRB = 0x33;
}


void doorClosed() {
    SendMessage(2, 3, 0x1, 0x2);


    (*((volatile TCNT8_T*)0x00000044)).OCRA = 0x0;
    (*((volatile TCNT8_T*)0x00000044)).OCRB = 0x0;
}
void doorOpened() {
    SendMessage(2, 4, 0x1, 0x2);


    (*((volatile TCNT8_T*)0x00000044)).OCRA = 0x0;
    (*((volatile TCNT8_T*)0x00000044)).OCRB = 0x0;
}

Bool CustomAvrMessageHandler(const AvrMessage* msg) {


    if (msg->Payload[0] == 0xcf) openDoor();
    if (msg->Payload[0] == 0xef) closeDoor();

    return False;
}

void InitialState(const Message*msg){

}
