module gitlab.com/myfantasy.ru/tech/ctxmf

go 1.20

require (
	github.com/myfantasy/ints v0.0.1
	github.com/prometheus/client_golang v1.16.0
	go.opentelemetry.io/otel v1.16.0
	go.opentelemetry.io/otel/exporters/jaeger v1.16.0
	go.opentelemetry.io/otel/exporters/stdout/stdouttrace v1.16.0
	go.opentelemetry.io/otel/sdk v1.16.0
	go.opentelemetry.io/otel/trace v1.16.0
)

require (
	github.com/beorn7/perks v1.0.1 // indirect
	github.com/cespare/xxhash/v2 v2.2.0 // indirect
	github.com/go-logr/logr v1.2.4 // indirect
	github.com/go-logr/stdr v1.2.2 // indirect
	github.com/golang/protobuf v1.5.3 // indirect
	github.com/matttproud/golang_protobuf_extensions v1.0.4 // indirect
	github.com/prometheus/client_model v0.4.0 // indirect
	github.com/prometheus/common v0.44.0 // indirect
	github.com/prometheus/procfs v0.11.0 // indirect
	go.opentelemetry.io/otel/metric v1.16.0 // indirect
	golang.org/x/sys v0.9.0 // indirect
	google.golang.org/protobuf v1.30.0 // indirect
)
