## group: nn_nns
stick,sticks,1.03634934567
leech,leeches,1.15272124431
asset,assets,1.19796723555
obstetric,obstetrics,1.26967341253
caliper,calipers,1.35530695964
scratch,scratches,1.39006726501
wage,wages,1.53111060823
stock,stocks,1.55604653167
onward,onwards,1.6027087976
sport,sports,1.66178518477
proceed,proceeds,1.70790082933
technic,technics,1.76958967178
surround,surroundings,1.9070550244
arch,arches,2.16211730328
outdoor,outdoors,2.2153987212
syringe,syringes,2.29136853142
mechanic,mechanics,2.35393027778
chip,chips,2.3663626106
clip,clips,2.3903449839
button,buttons,2.70425710153
blink,blinks,2.71430448689
sander,sanders,2.71812180406
synapse,synapses,2.81409414297
backward,backwards,2.85348672602
pharmacodynamic,pharmacodynamics,2.92634846426
stay,stays,2.95483977608
street,streets,3.06964765485
spectacle,spectacles,3.21122447506
ground,grounds,3.3297146999
quarter,quarters,3.60032747054
hydrodynamic,hydrodynamics,3.67539542231
table,tables,3.75125618953
link,links,3.82311371844
harmonic,harmonics,4.05850341539
plastic,plastics,4.05940420844
geriatric,geriatrics,4.66507134278
gain,gains,4.90572920136
ellipse,ellipses,4.91813210339
session,sessions,5.29043411483
content,contents,5.30483949687
size,sizes,5.33387896463
turn,turns,5.34520414861
class,classes,5.37474882891
hemodynamic,hemodynamics,5.55595742168
effect,effects,5.56305682374
glass,glasses,5.58609428756
damage,damages,5.67905320944
cone,cones,5.85454904086
needle,needles,6.06740387293
phase,phases,6.19974386898
work,works,6.28203116323
pediatric,pediatrics,6.28350067277
base,bases,6.36575463881
manner,manners,6.37962999074
night,nights,6.39387417014
remain,remains,6.44135030522
scale,scales,6.5339871097
biometric,biometrics,6.67481429723
brain,brains,7.0091256568
morning,mornings,7.26702066828
need,needs,7.46907010356
diagnose,diagnoses,7.60249572733
wound,wounds,7.60485118474
color,colors,7.74918048961
become,becomes,7.95922569328
term,terms,8.6783245168
analyse,analyses,8.95400065419
side,sides,8.97731857313
heart,hearts,9.10827448141
test,testes,9.69282221541
time,times,9.74945909072

