## group: nn_nns
obstetric,obstetrics,2.12412627136
stick,sticks,2.31691274943
asset,assets,2.4172164772
scratch,scratches,2.58975148233
leech,leeches,3.03163858535
caliper,calipers,3.45384805632
stock,stocks,3.55526076585
blink,blinks,3.60402776429
proceed,proceeds,3.84559250978
surround,surroundings,3.93929091441
sport,sports,4.09052665069
technic,technics,4.09780921854
onward,onwards,4.11858310922
wage,wages,4.59477517605
arch,arches,5.51033163269
sander,sanders,5.64982804528
chip,chips,5.67097993724
mechanic,mechanics,6.04728705573
backward,backwards,6.18984726345
pharmacodynamic,pharmacodynamics,6.46660153006
outdoor,outdoors,6.68618681306
synapse,synapses,6.76894044882
quarter,quarters,7.72287049067
clip,clips,8.12074359408
syringe,syringes,8.30293002362
ground,grounds,8.36826720279
button,buttons,8.41790845151
street,streets,8.84759540767
harmonic,harmonics,9.4965409666
hydrodynamic,hydrodynamics,9.64367324751
stay,stays,9.64658805388
spectacle,spectacles,9.94996115136
plastic,plastics,11.8788806952
table,tables,13.4619000674
turn,turns,13.7437885999
ellipse,ellipses,13.7719995174
geriatric,geriatrics,14.4796004059
gain,gains,15.6442536156
glass,glasses,16.4250070752
link,links,16.465961738
base,bases,17.8922151399
cone,cones,18.5091475684
session,sessions,19.3311217395
class,classes,20.6917577855
hemodynamic,hemodynamics,21.6725041013
content,contents,23.474154517
needle,needles,24.4114848426
manner,manners,25.5756585378
work,works,25.9509698877
remain,remains,26.0884975223
morning,mornings,26.3642556276
biometric,biometrics,26.8158066274
size,sizes,27.2923815511
night,nights,27.6736507606
scale,scales,28.073261941
diagnose,diagnoses,29.3171817373
wound,wounds,30.392250407
phase,phases,30.9468189936
pediatric,pediatrics,33.1952022242
need,needs,33.207184904
color,colors,34.0447550809
become,becomes,34.8543154277
damage,damages,35.1290127764
brain,brains,36.6787538444
term,terms,41.5501629211
effect,effects,41.7559604111
test,testes,41.8966695151
analyse,analyses,43.9034378413
heart,hearts,46.7598691716
side,sides,48.0800658197
time,times,48.1179106212

