## group: nn_vbg
tattoo,tattooing,0.034831830493
regard,regarding,0.0445615715458
reveal,revealing,0.0505638119282
show,showing,0.0621659060456
undergo,undergoing,0.110480375171
learn,learning,0.112651392542
suggest,suggesting,0.123691610742
test,testing,0.124640749627
look,looking,0.130947868689
feel,feeling,0.133998486272
concern,concerning,0.159507847288
remain,remaining,0.196551113999
walk,walking,0.238449258744
rest,resting,0.27064360857
work,working,0.276290999923
form,forming,0.288183152914
proceed,proceeding,0.295521000441
screen,screening,0.319965566344
stain,staining,0.326420777005
understand,understanding,0.494000470642
extend,extending,0.627519439646
start,starting,0.837071181538

