## group: bigrams
and,in,5.93578625122
of,the,5.97963518524
by,the,6.16271972846
and,the,6.21043869803
to,the,6.90312140857
in,the,7.38749932887
intraocular,pressure,8.5624876278
anterior,chamber,9.13496755506
for,the,9.20856940035
on,the,9.44130065909
with,the,9.74339987265
of,this,10.9242345197
optic,nerve,11.082393109
from,the,11.2585764241
may,be,11.5807090884
visual,field,11.738761056
ocular,hypertension,12.2606800365
that,the,12.4226423573
there,was,13.0499412805
in,this,13.3862409058
of,glaucoma,13.7043742129
with,glaucoma,13.8420083152
between,the,13.9468899726
in,glaucoma,14.2914202567
glaucoma,in,14.2914202567
at,the,14.3694796365
number,of,14.7757455263
use,of,15.8814589759
glaucoma,and,16.0145553596
optic,disc,16.9379949196
to,be,16.9687137719
treatment,of,17.4182082419
associated,with,19.8265076578
effect,of,20.4551090865
visual,acuity,20.6142165994
to,determine,20.6834134264
the,anterior,21.7732336552
this,study,22.9409128183
the,study,23.2910723297
the,optic,24.7757970593
to,evaluate,25.4057849383
the,mean,27.9331439885
purpose,to,43.4893573761

