## group: nn_vbg
learn,learning,0.378111616682
undergo,undergoing,0.893944783037
walk,walking,1.048221696
concern,concerning,1.13009821443
stain,staining,1.19591236623
suggest,suggesting,1.21000336908
regard,regarding,1.21146809652
extend,extending,1.28011005871
tattoo,tattooing,1.36995889675
proceed,proceeding,1.39806949397
look,looking,1.56931868148
remain,remaining,1.75459575935
start,starting,2.03519208631
feel,feeling,2.19334418761
reveal,revealing,2.25536301324
work,working,2.25832868597
rest,resting,2.35786870551
understand,understanding,2.38271710919
test,testing,2.40180111277
show,showing,2.479126982
screen,screening,2.86054651399
form,forming,2.93070405512

