## group: nn_vbg
learn,learning,0.336381496537
suggest,suggesting,0.426460278858
concern,concerning,0.598833366045
undergo,undergoing,0.684723064154
walk,walking,0.790832323404
regard,regarding,0.817624977899
extend,extending,0.865725374791
stain,staining,0.869617397075
look,looking,0.934952522715
tattoo,tattooing,1.10192097113
proceed,proceeding,1.14519255804
remain,remaining,1.25539010048
feel,feeling,1.27984099681
rest,resting,1.58860227296
reveal,revealing,1.73176330116
show,showing,1.82967284825
work,working,1.84366017251
test,testing,2.17167176536
start,starting,2.48135942884
understand,understanding,2.54522089434
screen,screening,2.88593275641
form,forming,3.0305365725

