## group: nn_nns
term,terms,0.064731349429
base,bases,0.131269475548
remain,remains,0.211935618319
need,needs,0.255715579227
work,works,0.275074833506
time,times,0.365260064567
effect,effects,0.621997114765

