## group: nn_nns
obstetric,obstetrics,0.921292605763
stick,sticks,1.06146695236
scratch,scratches,1.22959822754
asset,assets,1.24516798403
leech,leeches,1.33067762172
surround,surroundings,1.44507232111
sport,sports,1.57297104694
caliper,calipers,1.58820136314
stock,stocks,1.63461170738
technic,technics,1.66344794748
onward,onwards,1.71398395233
wage,wages,1.76430128049
chip,chips,2.1067846094
proceed,proceeds,2.24709306674
mechanic,mechanics,2.34270625943
clip,clips,2.6339842124
blink,blinks,2.68618970534
arch,arches,2.76691454975
outdoor,outdoors,2.86776404989
pharmacodynamic,pharmacodynamics,3.05198771115
button,buttons,3.19200834279
synapse,synapses,3.22142084843
sander,sanders,3.34120571758
syringe,syringes,3.38566599153
backward,backwards,3.52828022131
ground,grounds,3.85665684266
quarter,quarters,3.90083839106
spectacle,spectacles,3.90911629191
street,streets,3.916517605
hydrodynamic,hydrodynamics,5.14364285712
stay,stays,5.265673842
plastic,plastics,5.31377194893
harmonic,harmonics,5.58659232506
geriatric,geriatrics,6.04245861612
table,tables,7.07730563337
turn,turns,7.0806985115
gain,gains,7.1899867979
ellipse,ellipses,7.42403960056
cone,cones,7.51732139691
glass,glasses,7.55300648726
link,links,7.70905958257
base,bases,8.9201435252
class,classes,8.9642049634
content,contents,9.33649932336
session,sessions,9.7890895658
hemodynamic,hemodynamics,10.7701810606
size,sizes,10.791268424
phase,phases,10.9403944828
work,works,11.1410054173
biometric,biometrics,11.4845846149
remain,remains,11.5551175318
night,nights,11.5971051007
needle,needles,11.6094471507
effect,effects,11.6437735755
pediatric,pediatrics,11.867455233
scale,scales,12.2539227447
morning,mornings,12.3949773969
manner,manners,12.4369066824
wound,wounds,13.8459894096
color,colors,14.086654342
need,needs,14.2764625287
brain,brains,14.3215622467
diagnose,diagnoses,14.7763941017
damage,damages,14.8448729536
become,becomes,15.3450554213
term,terms,16.5509776179
test,testes,18.091084876
side,sides,18.3529790446
heart,hearts,18.4353549359
analyse,analyses,18.7893638867
time,times,19.9616932429

## group: nn_vbg
void,voiding,0.792020404396
stitch,stitching,0.83873659764
unlock,unlocking,0.872906317956
depress,depressing,0.88878437693
afflict,afflicting,0.903742755228
finish,finishing,0.924567037448
perturb,perturbing,0.938478946522
underpin,underpinning,0.943489844759
ladder,laddering,0.990815133389
ripe,ripening,0.998282284492
sweat,sweating,1.01448767488
sprout,sprouting,1.02957617049
farm,farming,1.03483561426
unravel,unraveling,1.06462296656
unravel,unravelling,1.07793381134
lift,lifting,1.11988372557
weaken,weakening,1.13564393775
shrink,shrinking,1.14629626826
push,pushing,1.1479925416
smart,smarting,1.15512933517
interrupt,interrupting,1.2080607013
knock,knocking,1.27111878485
reward,rewarding,1.2874286006
scratch,scratching,1.29336251283
discern,discerning,1.31526213869
forget,forgetting,1.36830573798
multiply,multiplying,1.38102593895
talk,talking,1.40349214028
hatch,hatching,1.44229713842
mold,molding,1.48097744011
hunt,hunting,1.49454320234
watch,watching,1.60358317107
kill,killing,1.60938829599
absorb,absorbing,1.64465185734
comb,combing,1.6487906723
warn,warning,1.67382016412
shadow,shadowing,1.68511647021
tattoo,tattooing,1.6977524254
trap,trapping,1.70941023608
speak,speaking,1.72191305169
resist,resisting,1.72687509111
tailor,tailoring,1.72879484645
flush,flushing,1.73615513724
join,joining,1.73925997112
seal,sealing,1.74316476448
shea,sheathing,1.74545807568
satisfy,satisfying,1.75924011293
appeal,appealing,1.78545095427
strengthen,strengthening,1.81339261461
spark,sparkling,1.82544367607
float,floating,1.89292784671
govern,governing,1.92686804128
weigh,weighting,1.93632439252
weigh,weighing,1.94587156782
crack,cracking,1.95601413881
book,booking,1.95918858299
wash,washing,1.96040605125
worry,worrying,1.96882044815
cast,casting,2.00006891774
poison,poisoning,2.02032022899
wick,wicking,2.02288880918
shea,shearing,2.05944404426
disturb,disturbing,2.13334523183
grasp,grasping,2.15976566455
pick,pickering,2.17907265189
press,pressing,2.17912832615
kiss,kissing,2.2025030816
club,clubbing,2.23411774255
retard,retarding,2.24885234916
cool,cooling,2.25176426873
disappear,disappearing,2.30289741811
mislead,misleading,2.31581320825
alarm,alarming,2.32254286598
feed,feeding,2.34422753929
wish,wishing,2.42352759252
partition,partitioning,2.46363254642
recur,recurring,2.54072849506
sustain,sustaining,2.56103897613
creep,creeping,2.57588074972
dissect,dissecting,2.58812565565
resp,respecting,2.60876471795
char,charting,2.62374432802
cree,creeping,2.62998620004
coat,coating,2.66045008078
auto,autografting,2.66140751121
path,pathfinding,2.70231053208
taper,tapering,2.75209460901
distress,distressing,2.77755915308
proceed,proceeding,2.82003753229
sick,sickling,2.89132939019
justify,justifying,2.92396728422
counteract,counteracting,2.93366916834
consult,consulting,2.95210429812
tape,tapering,2.97575812768
chin,ching,2.99956324383
mount,mounting,3.03771690425
neighbor,neighboring,3.14992902648
counter,counteracting,3.1580721622
melt,melting,3.28520301922
plug,plugging,3.32633326848
shorten,shortening,3.33217185328
tail,tailoring,3.47291095247
travel,traveling,3.50158851071
autograft,autografting,3.5068344025
halt,halting,3.50941323144
convert,converting,3.55310005824
retain,retaining,3.55854802321
house,housekeeping,3.56880280222
favor,favoring,3.57726883736
genera,generating,3.61274460321
enter,entering,3.62866482704
scaffold,scaffolding,3.72726842402
stiff,stiffening,3.73187189324
hold,holding,3.7780392937
walk,walking,3.77961708724
render,rendering,3.81937987113
seek,seeking,3.82216521405
stiffen,stiffening,3.83272628659
mark,marking,3.90001733751
wear,wearing,3.96517571744
agree,agreeing,4.03550457613
spread,spreading,4.30407451031
notch,notching,4.32793845068
possess,possessing,4.34793198453
shield,shielding,4.36834987856
deal,dealing,4.38315050843
drift,drifting,4.38600723398
scatter,scattering,4.47352270683
draw,drawing,4.67067976466
awake,awakening,4.70445573197
match,matching,4.80879577992
expand,expanding,4.8263305432
stand,standing,4.90690972054
call,calling,4.91347859083
coup,coupling,4.97448588396
think,thinking,4.99393397907
rais,raising,5.02120220155
sheath,sheathing,5.03362100885
persist,persisting,5.20730665099
flank,flanking,5.29841039307
exceed,exceeding,5.30081351276
round,rounding,5.30282464584
pertain,pertaining,5.34572895503
demand,demanding,5.35111489111
conflict,conflicting,5.36857729978
wait,waiting,5.4383807092
arrest,arresting,5.44609276098
nick,nicking,5.55226314745
look,looking,5.73214877894
list,listening,5.75821630493
feel,feeling,5.81166820154
load,loading,6.01254667482
break,breaking,6.04484583667
peel,peeling,6.12428386455
fold,folding,6.23972337244
switch,switching,6.48890486429
shear,shearing,6.50799879458
cover,covering,6.53506294872
stop,stopping,6.58568544448
rest,resting,6.81879935934
start,starting,6.85302916838
miss,missing,6.86710588958
carry,carrying,6.96340573096
cloud,clouding,7.1525162857
turn,turning,7.18319855634
invest,investigating,7.33539374507
fail,failing,7.44509238399
extend,extending,7.60852101493
yield,yielding,7.69062258928
threat,threatening,7.78093700437
carr,carrying,7.83026323023
touch,touching,7.85335223717
comb,combining,7.87681429679
plot,plotting,8.0267334097
gain,gaining,8.17897779174
teach,teaching,8.21953677724
yellow,yellowing,8.59435107744
grow,growing,8.76230421719
consent,consenting,8.91448549504
deva,devastating,8.97568435387
scar,scarring,9.06376120341
wild,wilding,9.08304532554
cross,crossing,9.16435655433
reach,reaching,9.18398694884
vault,vaulting,9.19230635704
tend,tending,9.253413303
distinguish,distinguishing,9.27367888965
crush,crushing,9.39457383392
delay,delaying,9.66964026466
transfer,transferring,9.69727098985
worsen,worsening,9.73944440441
exam,examining,9.78379687463
depend,depending,9.82454493833
project,projecting,10.0134782561
cluster,clustering,10.1151836928
confound,confounding,10.1675625636
thick,thickening,10.195858063
strength,strengthening,10.3183698482
reflect,reflecting,10.3401714324
foster,fostering,10.3601236524
fall,falling,10.3988933945
tunnel,tunneling,10.4041928013
surround,surrounding,10.4194221134
concern,concerning,10.4450929584
begin,beginning,10.4795400302
protect,protecting,10.5047262247
smooth,smoothing,10.5941125535
flash,flashing,10.7737601207
flicker,flickering,10.885741882
school,schooling,10.8943898733
shift,shifting,10.9183146549
ring,ringing,10.9901609603
exact,exacting,11.0983334547
bloc,blocking,11.0985093989
compound,compounding,11.1290866956
correct,correcting,11.137295184
suffer,suffering,11.2041045674
link,linking,11.2370577138
count,counteracting,11.4159592916
step,stepping,11.42775916
reveal,revealing,11.5021957965
reason,reasoning,11.6025998494
fill,filling,11.7576719956
confirm,confirming,11.8904983343
tilt,tilting,11.9963171244
spot,spotting,12.0999283573
alter,alternating,12.1391610641
correspond,corresponding,12.193550264
form,forming,12.2259097799
support,supporting,12.2554339986
mode,modeling,12.4161761406
record,recording,12.5547059637
strip,stripping,12.5663902303
search,searching,12.5772521017
transform,transforming,12.6674619241
interest,interesting,12.7699243618
thin,thinking,12.8091317791
shunt,shunting,12.8597728315
pattern,patterning,12.8617557507
explain,explaining,13.0411696045
work,working,13.0568381885
model,modeling,13.0864450442
test,testing,13.2005505453
treat,treating,13.2448645794
head,heading,13.2783561616
part,partitioning,13.3286087471
show,showing,13.3638754333
limit,limiting,13.4085870018
seem,seeming,13.6245531305
deep,deepening,13.6552933518
peak,peaking,13.6660964806
respect,respecting,13.6913921047
result,resulting,13.7415920287
fast,fasting,13.7631737814
chart,charting,13.7926333146
help,helping,13.8443154595
lamp,lamping,13.8465423185
dark,darkening,13.8757928882
sleep,sleeping,13.9263248178
stain,staining,13.9735736743
screen,screening,14.1239750173
point,pointing,14.2993867342
water,watering,14.3279748055
design,designing,14.329273035
learn,learning,14.4705952224
regard,regarding,14.6448830151
transport,transporting,14.6598146469
understand,understanding,14.6791209447
weight,weighting,14.6853306301
color,coloring,14.7685311257
suggest,suggesting,15.0938595762
light,lighting,15.1074348433
undergo,undergoing,15.2754053436
affect,affecting,15.2816174219
heal,healing,15.3357325193
filter,filtering,15.3472239648
tear,tearing,15.3786388988
center,centering,15.7295790901
approach,approaching,15.8089474052
thin,thinning,15.9993517186
wound,wounding,16.0962114028
stem,stemming,16.2311256672
survey,surveying,16.3024646014
cost,costing,16.3058328021
assay,assaying,16.3128309092
need,needing,16.3540715278
graft,grafting,16.3705433728
block,blocking,16.4626661366
cent,centering,16.474423175
actin,acting,16.6449862946
drop,dropping,16.7995268526
visit,visiting,17.6501469695
hand,handling,17.830371266
gene,generating,18.2080262412
group,grouping,18.8960264845
accord,according,19.3319634419
flow,flowing,19.3324239568
need,needling,20.262823351
lead,leading,20.3066432725
found,founding,21.4782430987

## group: jj_jjr_jjs
young,younger,13.1683790537
high,highest,14.3947937662
small,smaller,15.137618101
high,higher,16.3543113175
great,greater,20.2671932808

## group: nn_vbd_vbn
hyper,hypertrophied,0.722854649211
enforce,enforced,0.723824148047
convince,convinced,0.726883109225
restrain,restrained,0.774899014041
fade,faded,0.860451586149
concert,concerted,0.861694635493
precondition,preconditioned,0.887200438621
lapse,lapsed,0.902027215884
multinucleate,multinucleated,0.92492726943
avert,averted,0.929456621016
traverse,traversed,0.930020439699
shea,sheathed,0.94155822273
constrain,constrained,0.970356837201
bevel,beveled,1.03536764724
conceal,concealed,1.04444314247
silence,silenced,1.05446290152
articulate,articulated,1.06311221191
tune,tuned,1.0680633169
buck,buckled,1.09809071611
bill,billed,1.12446428999
sort,sorted,1.14001250629
graduate,graduated,1.229043007
plague,plagued,1.25949250885
fire,fired,1.27481995609
watch,watched,1.30562029406
tackle,tackled,1.31657143568
erode,eroded,1.34534939469
forgot,forgotten,1.35684585058
peel,peeled,1.39095749371
finish,finished,1.40172559684
digest,digested,1.4305860961
polis,polished,1.43606943359
sequester,sequestered,1.44288669887
waste,wasted,1.44340512848
serra,serrated,1.46230310135
engage,engaged,1.48774834273
retract,retracted,1.5232817766
hyper,hyperpigmented,1.54563265999
title,titled,1.56216669462
decompose,decomposed,1.57892443426
acknowledge,acknowledged,1.63393961644
pick,picked,1.65912975079
assure,assured,1.7010190931
saturate,saturated,1.71310442536
defer,deferred,1.72995502284
deform,deformed,1.75814626044
spark,sparked,1.80190701052
book,booked,1.80553119261
tint,tinted,1.80912129917
license,licensed,1.81650075835
belt,belted,1.86156962257
gate,gated,1.91163814193
trap,trapped,1.97092088967
reform,reformed,2.10739311074
flank,flanked,2.14184700932
inspire,inspired,2.1740514168
seal,sealed,2.22726097978
anchor,anchored,2.27473604741
constrict,constricted,2.28815475814
seed,seeded,2.30108792784
disperse,dispersed,2.30205500474
taper,tapered,2.31379222042
trabecula,trabeculated,2.31544707441
stream,streamlined,2.33650315227
merit,merited,2.33766508168
coil,coiled,2.35367673849
notch,notched,2.41348834148
print,printed,2.43177673002
contract,contracted,2.44004271116
afflict,afflicted,2.44499236999
confound,confounded,2.49081795813
tape,tapered,2.53565681611
conjugate,conjugated,2.56781580791
degrade,degraded,2.56787172446
handle,handled,2.57662838391
devote,devoted,2.62768784085
warm,warmed,2.65153703021
crow,crowded,2.70484546132
arch,arched,2.77101245581
wish,wished,2.82375285899
smoke,smoked,2.8319238849
frost,frosted,2.88628588084
hydrate,hydrated,2.88850477722
bond,bonded,2.91161641383
weigh,weighed,2.92376639152
ciliate,ciliated,2.94944329894
interrupt,interrupted,2.95540043155
brand,branded,2.95863090417
compress,compressed,2.96354052341
partition,partitioned,3.05951859063
educate,educated,3.06939469712
retard,retarded,3.1091523224
mail,mailed,3.11242775034
ground,grounded,3.17645515044
threat,threaten,3.27113238452
strip,stripped,3.32968199051
track,tracked,3.33975278032
distort,distorted,3.36653339761
super,superimposed,3.3808397607
dilute,diluted,3.39151331906
skill,skilled,3.45636907691
bridge,bridged,3.46314116809
melt,melted,3.47895461516
perforate,perforated,3.52518355264
sick,sickled,3.56365223327
travel,traveled,3.58560008246
mirror,mirrored,3.62416066045
plug,plugged,3.63972060507
rotate,rotated,3.66158104522
illuminate,illuminated,3.6647023921
coat,coated,3.68502930923
suppose,supposed,3.71335240522
compact,compacted,3.76681955122
travel,travelled,3.84773894212
striate,striated,3.85256388911
favor,favored,3.89842947205
refine,refined,3.9386160045
reconstruct,reconstructed,4.02829344093
replicate,replicated,4.06543216216
wash,washed,4.09134727493
instruct,instructed,4.17212872541
advise,advised,4.17866272772
learn,learned,4.21816975514
drain,drained,4.28217759035
fuse,fused,4.28803389942
concentrate,concentrated,4.39234222675
shield,shielded,4.39994812201
hope,hoped,4.41566783474
myelin,myelinated,4.57608222866
puncture,punctured,4.59416567664
accomplish,accomplished,4.74327021329
accelerate,accelerated,4.75617062784
round,rounded,4.80920380131
decide,decided,4.81864721819
possess,possessed,4.96050665724
detach,detached,4.97962232366
agree,agreed,5.04816305133
seat,seated,5.05034160715
glue,glued,5.10930562096
scatter,scattered,5.12545605508
list,listed,5.16202288736
precipitate,precipitated,5.20725944548
guard,guarded,5.29647107884
sheath,sheathed,5.37733341541
relieve,relieved,5.39049900806
desire,desired,5.409216616
handicap,handicapped,5.43198268437
cannula,cannulated,5.52174069695
mount,mounted,5.6061610609
mela,melamed,5.81751690642
substitute,substituted,5.91084224564
restrict,restricted,5.92080545412
outline,outlined,5.93455084276
bound,bounded,5.95883667828
expand,expanded,6.07320027219
intend,intended,6.09934923167
fold,folded,6.1748779461
kind,kindred,6.20294571694
adopt,adopted,6.22647080052
surround,surrounded,6.2560824034
rest,restrained,6.48760601105
fill,filled,6.67955408209
fear,feared,6.78491448903
perfect,perfected,6.7994108824
abstract,abstracted,6.80781966102
coup,coupled,6.81863945037
price,priced,6.8501082178
couple,coupled,6.89259365934
absorb,absorbed,6.98361773028
oppose,opposed,7.01267140161
permit,permitted,7.01285429737
convert,converted,7.02132863393
incorporate,incorporated,7.09062412194
predispose,predisposed,7.16554274824
force,forced,7.21879381985
burn,burned,7.36488929353
reserve,reserved,7.4481769106
trigger,triggered,7.47700551324
plot,plotted,7.74549939723
load,loaded,7.7507076837
turn,turned,7.7937719309
mani,manifested,7.81404878915
rupture,ruptured,7.81694276609
augment,augmented,7.84869343698
dissect,dissected,7.86763507779
buckle,buckled,7.88161833787
square,squared,7.98349341391
connect,connected,8.17786319198
suppress,suppressed,8.25195671634
check,checked,8.31180418311
stop,stopped,8.31689622772
enlarge,enlarged,8.43811935046
touch,touched,8.55878300202
weigh,weighted,8.56058494973
rest,restricted,8.6396677081
fragment,fragmented,8.79628221744
compose,composed,8.83635013633
extend,extended,8.88829866599
inform,informed,8.95341414267
experiment,experimented,9.04809378768
reverse,reversed,9.22517598293
spike,spiked,9.2390011355
vault,vaulted,9.24555014571
transfer,transferred,9.26599831515
crush,crushed,9.27819637922
genera,generalized,9.30068939904
warrant,warranted,9.51166276073
fall,fallen,9.61392991668
organ,organized,9.76434906628
suspect,suspected,9.77382713814
discover,discovered,9.87833247929
admit,admitted,9.91096486671
band,banded,9.94084837044
feature,featured,9.99225367084
attach,attached,9.99419179224
sickle,sickled,10.0499909523
face,faced,10.0582136182
prefer,preferred,10.1054162026
branch,branched,10.1590772692
return,returned,10.258257531
plate,plated,10.3010909621
cluster,clustered,10.3113058116
fashion,fashioned,10.4957098285
tunnel,tunneled,10.5102278887
atta,attached,10.6560639906
train,trained,10.7043573069
sight,sighted,10.7367559589
register,registered,10.7458064132
forme,formed,10.7679187762
stand,standardized,10.8244112801
distinguish,distinguished,10.8642589089
rank,ranked,10.9691215927
employ,employed,11.0047690682
cross,crossed,11.0219543314
switch,switched,11.1279995201
cover,covered,11.1700958446
border,bordered,11.2674938415
decline,declined,11.2940882382
insert,inserted,11.349948824
repeat,repeated,11.3737309519
bloc,blocked,11.3769238904
reflect,reflected,11.3874051196
raise,raised,11.387475201
sustain,sustained,11.5111238569
step,stepped,11.5299242305
culture,cultured,11.6329801143
class,classed,11.6429720707
scar,scarred,11.7043068792
comprise,comprised,11.8103724891
spot,spotted,11.8319285326
dilate,dilated,11.8770490704
state,stated,12.155050098
slope,sloped,12.2034381041
author,authorized,12.2109767443
shape,shaped,12.2481257956
regulate,regulated,12.3064988687
pattern,patterned,12.5073598887
needle,needled,12.6048832697
rais,raised,12.6057307014
blur,blurred,12.64541313
balance,balanced,12.7282897957
position,positioned,12.886360838
part,partitioned,12.9830445352
line,lined,12.9859317096
diffuse,diffused,12.9871638957
grade,graded,13.1899341181
transport,transported,13.1903134473
pair,paired,13.2560554983
work,worked,13.2730104492
enhance,enhanced,13.3238728584
derive,derived,13.3690166369
peak,peaked,13.4250085033
screen,screened,13.4371603012
post,posted,13.4844621487
color,colored,13.5304444995
target,targeted,13.5341226148
resolve,resolved,13.6628629744
sector,sectored,13.6934882549
extract,extracted,13.7907337377
comb,combined,14.0181541034
wall,walled,14.0434725701
combine,combined,14.053602606
select,selected,14.1982757116
valve,valved,14.2743794298
structure,structured,14.322630247
standard,standardized,14.4574785066
form,formed,14.4978957879
scale,scaled,14.5001567879
water,watershed,14.511173065
score,scored,14.5428405882
value,valued,14.5796438161
prove,proved,14.7048817606
course,coursed,14.71826734
mark,marked,14.7759293897
complicate,complicated,14.8941194292
size,sized,14.9561017878
order,ordered,15.0666342258
point,pointed,15.1152771349
correct,corrected,15.2512199359
power,powered,15.2621702593
produce,produced,15.36466702
center,centered,15.3840413604
sele,selected,15.452668395
involve,involved,15.6270165528
confirm,confirmed,15.636038551
elevate,elevated,15.82750325
blind,blinded,15.9291863878
space,spaced,15.9567103444
wound,wounded,15.9831224838
note,noted,15.9864005975
weight,weighted,16.0265877275
practice,practiced,16.0851084725
assign,assigned,16.0928472962
pain,painted,16.1259832897
link,linked,16.184413989
surface,surfaced,16.2654756444
impact,impacted,16.2784865922
stage,staged,16.2923208184
stem,stemmed,16.46353597
receive,received,16.5386917948
disorder,disordered,16.5749216614
express,expressed,16.7503276002
curve,curved,16.7921643913
layer,layered,17.0046863686
collect,collected,17.0933568902
provide,provided,17.1069036931
condition,conditioned,17.1622503314
mask,masked,17.288798234
hand,handed,17.6221213357
need,needled,17.7489674195
reveal,revealed,17.7798605705
range,ranged,17.8558707622
hand,handled,17.8967971444
coll,collected,17.962565786
block,blocked,18.1653199189
subject,subjected,18.2518078197
design,designed,18.2834142435
correlate,correlated,18.3302368347
enroll,enrolled,18.6889783734
time,timed,18.7313680558
calculate,calculated,18.7509133014
graft,grafted,18.7889068053
divide,divided,18.8072668417
test,tested,19.091528887
cent,centered,19.1911633511
disease,diseased,19.1998069351
lamina,laminated,19.2319980484
base,based,19.291015401
rate,rated,19.3420223622
segment,segmented,19.37545786
group,grouped,19.7690717712
include,included,19.9587805527
gene,generalized,20.7445008944
show,shown,20.7992794354
carr,carried,21.3021372896
angle,angled,21.3037845179
measure,measured,21.4107274655
define,defined,21.9338303286
assess,assessed,22.5650726698
class,classified,22.6427111866
associate,associated,23.7941839358
determine,determined,24.1815757185

## group: bigrams
of,the,9.45547375023
and,the,10.135119287
and,in,11.3177244326
in,the,11.7650456626
for,the,13.5411874101
with,the,15.0948955862
glaucoma,and,15.3578197533
of,glaucoma,15.6583480789
to,the,16.21314712
in,glaucoma,16.4405444649
glaucoma,in,16.4405444649
with,glaucoma,16.5021579273
on,the,17.0383812151
that,the,17.2920933287
of,this,18.187561497
from,the,18.2314533798
at,the,18.5305124229
by,the,18.6314679178
in,this,19.4262306492
number,of,20.0334501296
treatment,of,20.6490844838
use,of,20.7438215656
the,mean,20.863103737
the,anterior,21.3579973806
the,study,21.8635676103
between,the,22.3320031283
the,optic,22.3441883168
effect,of,24.9982710526
this,study,26.0163963469
associated,with,28.6178501788
anterior,chamber,28.6644813177
intraocular,pressure,28.6810022114
to,be,30.1668808029
visual,field,30.3665144208
visual,acuity,30.7335839692
to,determine,31.0141499284
optic,disc,31.082471569
optic,nerve,31.1149711034
there,was,31.5166318195
to,evaluate,32.2923797029
ocular,hypertension,33.1297837317
purpose,to,35.8917491288
may,be,37.5605340393

