## group: bigrams
and,in,2.64174636614
and,the,2.77837686585
in,the,2.82962568694
that,the,2.91226874349
of,the,3.08296565812
at,the,3.41978625235
for,the,3.7304222893
the,mean,3.91963497016
intraocular,pressure,3.98766159411
number,of,4.01812128637
glaucoma,and,4.02812334578
on,the,4.0368346755
from,the,4.14258844896
this,study,4.27763104933
to,the,4.29817388114
with,the,4.32579819961
visual,field,4.35182479026
the,study,4.52778798959
between,the,4.57257823493
in,glaucoma,4.5770204846
glaucoma,in,4.5770204846
with,glaucoma,4.73520102955
by,the,4.83213570174
treatment,of,4.84413258284
visual,acuity,4.89809983164
anterior,chamber,5.04145388883
of,glaucoma,5.08925607502
use,of,5.1091709402
there,was,5.1148137432
in,this,5.16782457594
the,anterior,5.33567420952
optic,disc,5.36958258761
to,evaluate,5.51961525402
of,this,5.62017743305
to,determine,5.6379120161
associated,with,5.67410115381
the,optic,5.73544719827
effect,of,6.23622382472
ocular,hypertension,6.4980879547
optic,nerve,6.5928637446
purpose,to,6.60018772639
to,be,8.30508203881
may,be,9.80204051542

