## group: nn_nns
obstetric,obstetrics,1.70051709245
stick,sticks,1.88906483314
asset,assets,1.89061070856
scratch,scratches,2.30739874056
leech,leeches,2.48267687483
blink,blinks,2.49610247153
stock,stocks,2.74014500168
proceed,proceeds,3.00658416768
caliper,calipers,3.07337661784
surround,surroundings,3.18813651081
sport,sports,3.19992176886
onward,onwards,3.20300281388
technic,technics,3.54041978274
wage,wages,4.25086896
arch,arches,4.76270441886
chip,chips,4.83891427263
pharmacodynamic,pharmacodynamics,5.07153724294
sander,sanders,5.14045975844
backward,backwards,5.14578565182
mechanic,mechanics,5.19036728597
outdoor,outdoors,5.47414102528
synapse,synapses,5.85147434574
clip,clips,6.45620791313
quarter,quarters,6.56236490282
ground,grounds,6.59353599324
button,buttons,6.90280568331
hydrodynamic,hydrodynamics,7.66430897845
syringe,syringes,7.79554563198
stay,stays,7.95992321242
street,streets,8.069711454
harmonic,harmonics,8.25761679248
spectacle,spectacles,8.4471841164
plastic,plastics,10.7299334303
table,tables,10.7838006852
gain,gains,12.0762194765
turn,turns,12.1587107954
geriatric,geriatrics,12.5672467645
ellipse,ellipses,12.570380124
session,sessions,13.6999614615
link,links,13.9484639086
class,classes,14.7102949778
glass,glasses,14.8876348833
cone,cones,15.7126008134
base,bases,16.0224096528
hemodynamic,hemodynamics,18.9614060958
remain,remains,20.31857971
content,contents,20.9759255453
needle,needles,21.2975515108
manner,manners,21.7453623064
size,sizes,21.7530611826
work,works,22.6783001843
night,nights,23.4240074313
scale,scales,23.8878738019
morning,mornings,24.2924942598
biometric,biometrics,24.8126131367
need,needs,25.5285327657
phase,phases,25.7654171117
diagnose,diagnoses,26.0928934606
damage,damages,26.5391793375
wound,wounds,26.5408860118
color,colors,26.6573224053
effect,effects,28.3308398421
pediatric,pediatrics,28.8814598139
time,times,31.7450274713
become,becomes,32.0081405507
brain,brains,32.3766323527
term,terms,32.8090364662
test,testes,35.5832677804
analyse,analyses,35.6344765937
heart,hearts,39.6086603171
side,sides,44.0646773845

