## group: nn_vbd_vbn
hyper,hypertrophied,0.376404513164
convince,convinced,0.441184946112
fade,faded,0.45144490058
precondition,preconditioned,0.466006570236
bevel,beveled,0.608059701107
enforce,enforced,0.624891812584
constrain,constrained,0.64147306748
traverse,traversed,0.644435932466
concert,concerted,0.645527950961
shea,sheathed,0.681209467049
avert,averted,0.682514500334
conceal,concealed,0.714365957791
buck,buckled,0.723258882991
tune,tuned,0.725499566189
silence,silenced,0.73472088648
lapse,lapsed,0.740083638409
restrain,restrained,0.762354179811
articulate,articulated,0.764258403476
peel,peeled,0.817073513751
multinucleate,multinucleated,0.827950944837
decompose,decomposed,0.836111385986
defer,deferred,0.854776927549
fire,fired,0.871615263008
digest,digested,0.896389936878
plague,plagued,0.920371740757
graduate,graduated,0.931433594193
erode,eroded,0.942088347812
engage,engaged,0.967246026039
waste,wasted,0.976237610194
watch,watched,0.977146666137
sequester,sequestered,0.99055737792
tint,tinted,1.03079043112
sort,sorted,1.03662371821
assure,assured,1.04198978835
pick,picked,1.05382564187
tackle,tackled,1.07268616405
hyper,hyperpigmented,1.07357627027
forgot,forgotten,1.10480632166
bill,billed,1.11293156401
finish,finished,1.11825459856
title,titled,1.1205751254
license,licensed,1.15598086683
acknowledge,acknowledged,1.16732929035
confound,confounded,1.17264989989
deform,deformed,1.23276930606
polis,polished,1.23690496223
saturate,saturated,1.3135091559
stream,streamlined,1.36079792459
spark,sparked,1.39419291565
flank,flanked,1.4111320294
merit,merited,1.41982377459
retract,retracted,1.43207616619
serra,serrated,1.43480810822
print,printed,1.44874476642
book,booked,1.45485178572
contract,contracted,1.4766711549
inspire,inspired,1.50271826623
belt,belted,1.54531251917
trap,trapped,1.5822220488
seed,seeded,1.597922356
anchor,anchored,1.64656524919
retard,retarded,1.67037087905
gate,gated,1.77051333334
constrict,constricted,1.78289281632
seal,sealed,1.80499517998
wish,wished,1.81922092039
devote,devoted,1.85176001422
disperse,dispersed,1.85766974601
arch,arched,1.86544475501
reform,reformed,1.91679706719
degrade,degraded,1.92474706955
smoke,smoked,1.96475711755
educate,educated,1.97884366309
taper,tapered,1.99474375238
coil,coiled,2.027448099
trabecula,trabeculated,2.05071499938
partition,partitioned,2.07622797821
afflict,afflicted,2.08688662024
frost,frosted,2.12841479831
compress,compressed,2.15196652097
weigh,weighed,2.16538246291
handle,handled,2.18011903877
crow,crowded,2.20234055567
accelerate,accelerated,2.20760910545
super,superimposed,2.22198942896
mail,mailed,2.23446575767
tape,tapered,2.24117882014
conjugate,conjugated,2.24347803961
distort,distorted,2.25003609967
ground,grounded,2.30541346855
melt,melted,2.31333264865
coat,coated,2.3265018469
threat,threaten,2.33507176449
warm,warmed,2.34082652574
ciliate,ciliated,2.36349848662
skill,skilled,2.40651764145
notch,notched,2.43581468302
bond,bonded,2.47453221679
hydrate,hydrated,2.4895993985
interrupt,interrupted,2.4904593607
track,tracked,2.58254798979
suppose,supposed,2.59710314078
strip,stripped,2.63253031604
brand,branded,2.72511746025
advise,advised,2.7423532817
bridge,bridged,2.76454578774
illuminate,illuminated,2.77712633101
travel,traveled,2.7781977085
learn,learned,2.78010911934
sick,sickled,2.81844046216
favor,favored,2.89126973891
precipitate,precipitated,2.90909682547
dilute,diluted,2.93963646905
striate,striated,2.96198588474
perforate,perforated,2.97120483691
wash,washed,2.99565615709
drain,drained,2.99679296246
hope,hoped,2.99911710297
mirror,mirrored,3.01724072214
travel,travelled,3.01739320258
refine,refined,3.02160214101
concentrate,concentrated,3.03809213495
compact,compacted,3.07197919311
plug,plugged,3.20733934904
replicate,replicated,3.21956210232
rotate,rotated,3.22762320369
shield,shielded,3.3358236082
expand,expanded,3.46161913138
reconstruct,reconstructed,3.47753819977
decide,decided,3.51914560037
myelin,myelinated,3.53482959772
puncture,punctured,3.54388614425
instruct,instructed,3.5824054115
list,listed,3.64671191818
scatter,scattered,3.74244264274
outline,outlined,3.75577488409
glue,glued,3.89549644383
accomplish,accomplished,3.97150811496
possess,possessed,3.98903695614
detach,detached,3.99340685082
fuse,fused,4.05848638552
handicap,handicapped,4.10358778865
agree,agreed,4.13611172826
round,rounded,4.14360047148
seat,seated,4.15827158274
desire,desired,4.21399075935
guard,guarded,4.29753467181
kind,kindred,4.40365514443
relieve,relieved,4.46303905337
oppose,opposed,4.46950833946
substitute,substituted,4.55336987407
cannula,cannulated,4.7008266992
restrict,restricted,4.75936680782
fear,feared,4.79728509298
fold,folded,4.8182321559
rest,restrained,4.91572811228
mount,mounted,4.91661628045
permit,permitted,4.99901730022
bound,bounded,5.0375088036
surround,surrounded,5.13959814143
intend,intended,5.15991042978
force,forced,5.17810802309
burn,burned,5.20626256829
adopt,adopted,5.26258929575
trigger,triggered,5.26469717351
perfect,perfected,5.2747294186
fill,filled,5.46686446267
sheath,sheathed,5.47293946513
extend,extended,5.50365287012
convert,converted,5.61395272765
coup,coupled,5.62931728785
couple,coupled,5.65682435518
connect,connected,5.72322434208
predispose,predisposed,5.72332041763
mela,melamed,5.8542140982
suppress,suppressed,5.94907549452
incorporate,incorporated,5.95268789304
absorb,absorbed,6.19960752629
turn,turned,6.25963370435
load,loaded,6.27229909891
enlarge,enlarged,6.29260184791
abstract,abstracted,6.35223466183
mani,manifested,6.38698723508
price,priced,6.41580464941
buckle,buckled,6.4542089719
plot,plotted,6.45466567378
suspect,suspected,6.48080835235
sickle,sickled,6.52972344383
reserve,reserved,6.58621006957
prefer,preferred,6.64250482595
spike,spiked,6.65044927316
touch,touched,6.69297413113
dissect,dissected,6.74052608385
stop,stopped,6.77525613719
transfer,transferred,6.789769791
return,returned,6.91078557964
check,checked,6.93017854827
inform,informed,6.99082942484
augment,augmented,7.04058947481
rupture,ruptured,7.06177007569
genera,generalized,7.11082938938
culture,cultured,7.15675558913
fall,fallen,7.18921621005
experiment,experimented,7.20075794403
rest,restricted,7.24021787119
weigh,weighted,7.2469620054
organ,organized,7.25651170226
compose,composed,7.25956658425
cover,covered,7.30489911755
band,banded,7.4071119964
square,squared,7.47682254653
distinguish,distinguished,7.60360797098
reverse,reversed,7.69046410712
fashion,fashioned,7.7866293429
decline,declined,7.79714174596
vault,vaulted,7.81687096286
line,lined,7.86575169289
face,faced,7.91852810934
cluster,clustered,7.97584866049
feature,featured,8.00972494426
part,partitioned,8.01597646116
attach,attached,8.03988541083
crush,crushed,8.16409360283
discover,discovered,8.45537720805
fragment,fragmented,8.49930703516
stand,standardized,8.51547348789
warrant,warranted,8.52841793052
sight,sighted,8.5679691934
reflect,reflected,8.64556094872
standard,standardized,8.73720880589
atta,attached,8.79880748077
register,registered,8.80697017301
repeat,repeated,8.84881232894
target,targeted,8.85791498067
admit,admitted,8.89167616974
sustain,sustained,9.03274885359
employ,employed,9.06910273758
raise,raised,9.09531506907
plate,plated,9.15957681417
scar,scarred,9.18833956154
spot,spotted,9.20115077651
cross,crossed,9.24648747401
color,colored,9.24824880993
switch,switched,9.28462765358
class,classed,9.2898662595
dilate,dilated,9.29131914256
forme,formed,9.29690591597
tunnel,tunneled,9.42330680556
comprise,comprised,9.48480386701
position,positioned,9.59392253396
size,sized,9.6159872685
rank,ranked,9.67008455517
regulate,regulated,9.74830995854
train,trained,9.75363580195
shape,shaped,9.78110209287
step,stepped,9.78123890323
pattern,patterned,9.80808757503
state,stated,9.82724977064
author,authorized,9.83787062404
branch,branched,9.83862091772
border,bordered,10.0832940433
range,ranged,10.116643477
power,powered,10.1261320421
post,posted,10.1523067833
impact,impacted,10.2179108289
combine,combined,10.2466867285
bloc,blocked,10.2680301521
derive,derived,10.2702111237
comb,combined,10.293026414
order,ordered,10.391309661
insert,inserted,10.4364951972
peak,peaked,10.4495870835
transport,transported,10.4886037634
course,coursed,10.4958081456
rais,raised,10.5071836407
balance,balanced,10.5090926279
work,worked,10.5469281686
blur,blurred,10.5777868175
slope,sloped,10.5951894671
resolve,resolved,10.6407691659
scale,scaled,10.8202993867
value,valued,10.8443530799
grade,graded,10.8678930779
point,pointed,10.900522505
enhance,enhanced,10.9219950967
produce,produced,11.0041315043
needle,needled,11.0249563333
correct,corrected,11.0287915747
diffuse,diffused,11.06246462
wall,walled,11.153452096
weight,weighted,11.2761339052
surface,surfaced,11.326051909
pair,paired,11.3800603739
score,scored,11.5326339651
mark,marked,11.5583150648
complicate,complicated,11.6576398341
sector,sectored,11.6663607418
prove,proved,11.6694238739
involve,involved,11.7183346316
need,needled,11.7645632567
water,watershed,11.8547966988
structure,structured,11.9792013183
form,formed,11.9921445356
valve,valved,12.0702609577
select,selected,12.0977921435
link,linked,12.1275710548
receive,received,12.1447037309
hand,handed,12.1496253245
hand,handled,12.1762895201
blind,blinded,12.1880350323
screen,screened,12.2188077767
practice,practiced,12.2334099888
center,centered,12.2525243821
time,timed,12.25652469
base,based,12.3141249866
extract,extracted,12.3302261684
stage,staged,12.4662923989
space,spaced,12.586889736
confirm,confirmed,12.8516392518
express,expressed,12.8886739361
pain,painted,12.9276348497
reveal,revealed,12.9802035056
elevate,elevated,13.0563902956
sele,selected,13.1817776909
provide,provided,13.1939590143
rate,rated,13.2089189001
subject,subjected,13.6529526967
test,tested,13.6643084096
disease,diseased,13.6875214498
curve,curved,13.770007002
wound,wounded,13.9750139871
disorder,disordered,13.9806595735
condition,conditioned,14.0813455888
mask,masked,14.1505273077
cent,centered,14.3850389856
note,noted,14.6232637434
design,designed,14.7356353283
layer,layered,14.8534332393
assign,assigned,14.9476365539
stem,stemmed,15.0881203913
graft,grafted,15.1645942454
gene,generalized,15.2030345868
show,shown,15.3322816427
group,grouped,15.4802725481
collect,collected,15.7059980888
block,blocked,15.8812818998
correlate,correlated,15.9800768297
enroll,enrolled,16.1523794377
coll,collected,16.7914076032
calculate,calculated,16.9275293665
include,included,17.3756813353
segment,segmented,17.8139129728
divide,divided,17.8183075847
lamina,laminated,18.1352343577
measure,measured,18.4123804644
associate,associated,18.4355373572
carr,carried,18.8792323215
assess,assessed,19.3773877529
class,classified,19.7404220316
angle,angled,19.8934532434
define,defined,19.965867468
determine,determined,20.8623747585

