## group: nn_nns
stick,sticks,0.92978250229
asset,assets,1.02124834286
leech,leeches,1.14215072709
obstetric,obstetrics,1.30872316563
scratch,scratches,1.33398672349
caliper,calipers,1.34653884277
stock,stocks,1.45028653148
wage,wages,1.46869637066
onward,onwards,1.47108261756
proceed,proceeds,1.67200986104
sport,sports,1.67361148148
technic,technics,1.68113599418
surround,surroundings,1.81920901422
outdoor,outdoors,2.0041890501
arch,arches,2.08830851348
mechanic,mechanics,2.1868331146
syringe,syringes,2.198340095
chip,chips,2.25640942194
clip,clips,2.2734819232
sander,sanders,2.62166922594
button,buttons,2.65674298227
blink,blinks,2.66592862976
synapse,synapses,2.76382898293
backward,backwards,2.79175519278
pharmacodynamic,pharmacodynamics,2.88292287224
stay,stays,2.92169380946
street,streets,2.95054259225
spectacle,spectacles,2.9753023058
ground,grounds,3.14086394098
link,links,3.37282502385
quarter,quarters,3.46862044491
table,tables,3.53680234294
hydrodynamic,hydrodynamics,3.55888041851
effect,effects,3.67022040175
size,sizes,3.68276978232
plastic,plastics,3.83531070386
harmonic,harmonics,4.12209341891
geriatric,geriatrics,4.41177788484
gain,gains,4.4267486706
damage,damages,4.44395911165
class,classes,4.48222017393
content,contents,4.73539727721
session,sessions,4.82228654311
ellipse,ellipses,4.86326830876
phase,phases,5.08114270099
turn,turns,5.155398272
hemodynamic,hemodynamics,5.21445170273
glass,glasses,5.21816311555
pediatric,pediatrics,5.46725647485
scale,scales,5.51395617737
work,works,5.51446781534
cone,cones,5.63316678446
needle,needles,5.80634048272
remain,remains,5.86513793706
manner,manners,5.89843981285
base,bases,5.94995817244
night,nights,5.97943220748
brain,brains,6.09127482247
need,needs,6.13028141198
biometric,biometrics,6.70333907767
wound,wounds,6.71093468927
morning,mornings,6.97003309933
color,colors,6.97122207079
test,testes,7.0622872578
diagnose,diagnoses,7.10295630437
term,terms,7.43005222433
become,becomes,7.45787514097
time,times,7.50630596787
analyse,analyses,7.60086527331
side,sides,7.80688796093
heart,hearts,8.7612020717

## group: nn_vbg
finish,finishing,0.750504498307
stitch,stitching,0.798842268761
unlock,unlocking,0.832870057061
depress,depressing,0.851176525969
ripe,ripening,0.882140112605
multiply,multiplying,0.911136181817
afflict,afflicting,0.911277465824
underpin,underpinning,0.934634778269
ladder,laddering,0.953281446586
perturb,perturbing,1.00575320868
void,voiding,1.0302965591
sweat,sweating,1.03569647539
smart,smarting,1.06937340693
lift,lifting,1.10084929525
unravel,unraveling,1.11681220369
hatch,hatching,1.12744474294
shrink,shrinking,1.1553459911
farm,farming,1.18071744568
tattoo,tattooing,1.20516244067
weaken,weakening,1.24677693684
watch,watching,1.26512706336
push,pushing,1.2695997695
interrupt,interrupting,1.27105723212
forget,forgetting,1.28016855114
unravel,unravelling,1.28097468859
hunt,hunting,1.30868767001
absorb,absorbing,1.34505770668
mold,molding,1.40193316087
reward,rewarding,1.41170711188
talk,talking,1.4494784048
scratch,scratching,1.45523479038
sprout,sprouting,1.46280726838
weigh,weighing,1.48680802579
knock,knocking,1.49472936982
comb,combing,1.503510883
trap,trapping,1.52167885204
shea,sheathing,1.52810607051
book,booking,1.52836555633
resist,resisting,1.57236307985
flush,flushing,1.57305526613
poison,poisoning,1.58988117587
discern,discerning,1.61680297018
kill,killing,1.69825219477
worry,worrying,1.73328510937
shea,shearing,1.76025934689
govern,governing,1.76927585225
shadow,shadowing,1.79325407528
tailor,tailoring,1.7978430811
warn,warning,1.82021668904
cast,casting,1.82185316894
strengthen,strengthening,1.87990805388
spark,sparkling,1.88294529286
crack,cracking,1.88752908098
join,joining,1.89666396934
wick,wicking,1.91022627513
wash,washing,1.92882458276
kiss,kissing,1.9520200055
float,floating,1.96078443145
grasp,grasping,1.96536331565
club,clubbing,1.98383450746
speak,speaking,2.01933872193
seal,sealing,2.03651600456
press,pressing,2.06056246898
appeal,appealing,2.07548350361
satisfy,satisfying,2.09602884009
chin,ching,2.09634441851
mislead,misleading,2.11117504511
creep,creeping,2.12593550317
plug,plugging,2.13083483474
scaffold,scaffolding,2.141855056
partition,partitioning,2.14480042456
weigh,weighting,2.17549406401
pick,pickering,2.18860869202
recur,recurring,2.20504750308
char,charting,2.20882490759
auto,autografting,2.21263070051
disappear,disappearing,2.22414691637
coat,coating,2.24157947775
feed,feeding,2.25061838009
resp,respecting,2.25151848392
alarm,alarming,2.28415157531
taper,tapering,2.29035527566
sick,sickling,2.29665053325
autograft,autografting,2.36091487904
disturb,disturbing,2.36785707109
cool,cooling,2.37677113715
retard,retarding,2.38325830072
wish,wishing,2.40902132651
path,pathfinding,2.43853266173
proceed,proceeding,2.47612461231
cree,creeping,2.50597238457
melt,melting,2.50951745431
justify,justifying,2.55487318452
tape,tapering,2.59613538496
sustain,sustaining,2.61018442749
travel,traveling,2.68702760515
stiff,stiffening,2.71287851342
shorten,shortening,2.71990528809
halt,halting,2.77041159979
mark,marking,2.77528300126
distress,distressing,2.78078813794
dissect,dissecting,2.80152659367
consult,consulting,2.80565747017
render,rendering,2.80962881307
stiffen,stiffening,2.82638657237
possess,possessing,2.83054208027
tail,tailoring,2.85341504604
walk,walking,2.85796462415
house,housekeeping,2.9011963561
counteract,counteracting,2.97456264468
hold,holding,3.02244226192
counter,counteracting,3.02440216995
mount,mounting,3.06086392749
genera,generating,3.10762489983
convert,converting,3.15289794945
think,thinking,3.18809454687
neighbor,neighboring,3.21906554397
seek,seeking,3.21936544186
retain,retaining,3.22584262114
wear,wearing,3.27545303369
favor,favoring,3.28642921246
shield,shielding,3.28744305985
scatter,scattering,3.29278259204
notch,notching,3.33435357256
agree,agreeing,3.3617097207
drift,drifting,3.38738685668
enter,entering,3.4106914149
call,calling,3.41341854919
spread,spreading,3.45456353921
awake,awakening,3.52977905634
expand,expanding,3.57585543552
load,loading,3.60632198452
round,rounding,3.6956692803
nick,nicking,3.73429976015
draw,drawing,3.74391279875
switch,switching,3.74886096664
look,looking,3.75383595139
persist,persisting,3.75416193975
wait,waiting,3.79734406241
sheath,sheathing,3.81612877558
coup,coupling,3.84086545632
match,matching,3.84211157154
deal,dealing,3.85906088817
feel,feeling,3.87434969168
conflict,conflicting,3.92408994748
flank,flanking,3.94510946762
peel,peeling,3.98453980486
list,listening,4.04631340799
exceed,exceeding,4.04779857653
pertain,pertaining,4.08923926683
demand,demanding,4.11680621126
carry,carrying,4.13732122521
rais,raising,4.17323906706
cloud,clouding,4.17810204897
yield,yielding,4.18896665918
reflect,reflecting,4.20327534259
arrest,arresting,4.23885214677
fail,failing,4.24486759651
consent,consenting,4.29117237622
break,breaking,4.30789951228
stand,standing,4.39082321386
touch,touching,4.39193132587
distinguish,distinguishing,4.40615710185
rest,resting,4.45648581745
extend,extending,4.50441677743
tend,tending,4.51790977047
miss,missing,4.55448908298
scar,scarring,4.58820131963
shear,shearing,4.62038233482
cover,covering,4.64402709199
test,testing,4.69302792852
confirm,confirming,4.75136581935
show,showing,4.80576461453
invest,investigating,4.87919477133
plot,plotting,4.90028875937
suffer,suffering,4.90503577384
grow,growing,4.9377711566
wild,wilding,4.94971582842
depend,depending,4.98960368604
protect,protecting,4.99953358933
vault,vaulting,5.0448729351
comb,combining,5.0801016186
result,resulting,5.08822378059
project,projecting,5.09911427565
gain,gaining,5.12779917929
yellow,yellowing,5.14027674151
support,supporting,5.16581319085
turn,turning,5.19416370148
reach,reaching,5.20696629902
correspond,corresponding,5.2115525604
fold,folding,5.24149148642
reveal,revealing,5.24882114754
fall,falling,5.25958164685
worsen,worsening,5.26836396725
carr,carrying,5.31572896966
foster,fostering,5.32454730102
explain,explaining,5.32967889101
cluster,clustering,5.36688381785
crush,crushing,5.37322959608
threat,threatening,5.37898936076
delay,delaying,5.41707069446
suggest,suggesting,5.44670267634
teach,teaching,5.4539521888
stop,stopping,5.46790553344
treat,treating,5.4859537655
thick,thickening,5.48725417783
cross,crossing,5.49054379631
model,modeling,5.50440486437
begin,beginning,5.53361491708
start,starting,5.54694551156
strength,strengthening,5.62284977599
search,searching,5.63799761251
count,counteracting,5.64546217856
affect,affecting,5.66887795379
surround,surrounding,5.69440136831
link,linking,5.70504784423
design,designing,5.70687933777
transfer,transferring,5.72951347127
shift,shifting,5.75726548592
correct,correcting,5.79393780567
tilt,tilting,5.82971569257
confound,confounding,5.83031802927
smooth,smoothing,5.85547027506
compound,compounding,5.86534880341
peak,peaking,5.87065580099
reason,reasoning,5.90262774766
point,pointing,5.90647236768
ring,ringing,5.90687407376
alter,alternating,5.98838174039
found,founding,6.05126133013
form,forming,6.17572195069
shunt,shunting,6.19482059019
pattern,patterning,6.20692247492
exam,examining,6.2276053851
spot,spotting,6.29571514151
stain,staining,6.30631217563
flicker,flickering,6.30987446324
deva,devastating,6.34879700277
respect,respecting,6.38517469606
part,partitioning,6.40865083407
tunnel,tunneling,6.41561448043
seem,seeming,6.41580376501
school,schooling,6.42050938145
regard,regarding,6.45453376948
mode,modeling,6.45630966946
transform,transforming,6.46359577803
survey,surveying,6.52152967387
concern,concerning,6.521598087
step,stepping,6.52678511351
limit,limiting,6.54556500669
visit,visiting,6.55104575553
thin,thinning,6.55817099084
flash,flashing,6.56787019887
screen,screening,6.59653870671
thin,thinking,6.61134904629
weight,weighting,6.62775725828
record,recording,6.63151759271
center,centering,6.70342702997
understand,understanding,6.71108365345
cent,centering,6.74118235369
work,working,6.74275182621
need,needing,6.76308030006
fill,filling,6.76692529936
cost,costing,6.76801925355
learn,learning,6.79290718166
help,helping,6.83631147939
sleep,sleeping,6.85381491037
deep,deepening,6.86921576253
lead,leading,6.87796268054
group,grouping,6.96174155928
water,watering,6.97770524235
flow,flowing,6.9912251753
dark,darkening,7.00564666313
approach,approaching,7.03469864429
transport,transporting,7.07521500861
heal,healing,7.11333093806
undergo,undergoing,7.22913604676
bloc,blocking,7.23074564334
graft,grafting,7.27681060468
assay,assaying,7.29605570877
fast,fasting,7.33805467566
interest,interesting,7.3422862871
color,coloring,7.40881561194
accord,according,7.439716319
strip,stripping,7.51893306397
lamp,lamping,7.53651790826
head,heading,7.55054142391
chart,charting,7.56266250262
stem,stemming,7.57264756996
tear,tearing,7.64470802055
hand,handling,7.65226401241
drop,dropping,7.73276727092
light,lighting,7.76675380985
wound,wounding,7.81691426731
exact,exacting,7.85670244292
filter,filtering,7.90848248498
block,blocking,8.09243442072
gene,generating,9.18187726135
need,needling,9.18864431891
actin,acting,9.45218194531

## group: jj_jjr_jjs
high,higher,5.20701716447
young,younger,5.2227075668
small,smaller,5.28369770802
high,highest,5.62486772261
great,greater,7.20983683741

## group: nn_vbd_vbn
hyper,hypertrophied,0.605080654309
restrain,restrained,0.679427696678
multinucleate,multinucleated,0.691581085406
enforce,enforced,0.730464830996
fade,faded,0.73389505299
avert,averted,0.844328235983
shea,sheathed,0.856679499086
buck,buckled,0.870149814987
lapse,lapsed,0.926359546934
precondition,preconditioned,0.926881194918
bevel,beveled,0.962558143631
fire,fired,0.981242967829
articulate,articulated,0.981807207915
conceal,concealed,0.995697744574
traverse,traversed,1.01189212377
convince,convinced,1.03844728107
constrain,constrained,1.09896022714
concert,concerted,1.10385664861
polis,polished,1.13494605435
silence,silenced,1.16793492702
plague,plagued,1.17160279432
bill,billed,1.18496079236
serra,serrated,1.27775415135
tackle,tackled,1.28334079925
tune,tuned,1.35046048287
waste,wasted,1.36927526047
sort,sorted,1.37382433465
graduate,graduated,1.37406185538
peel,peeled,1.3852462958
gate,gated,1.40003872996
erode,eroded,1.40618476113
hyper,hyperpigmented,1.44594925965
finish,finished,1.44983139092
watch,watched,1.45051263491
decompose,decomposed,1.47113079774
book,booked,1.48531306798
tint,tinted,1.48776718575
digest,digested,1.51248812485
defer,deferred,1.53919266306
trap,trapped,1.55737592405
pick,picked,1.55980106787
sequester,sequestered,1.56866284009
saturate,saturated,1.57028865933
forgot,forgotten,1.57215124612
title,titled,1.59548590979
contract,contracted,1.61533245658
engage,engaged,1.63382701611
wish,wished,1.6952867504
conjugate,conjugated,1.82313797249
spark,sparked,1.82770208857
deform,deformed,1.85384503853
assure,assured,1.86069272083
retract,retracted,1.86825608789
acknowledge,acknowledged,1.92856856683
coil,coiled,1.94156066541
taper,tapered,2.00700500356
disperse,dispersed,2.00874164884
ciliate,ciliated,2.05107140326
arch,arched,2.08488427879
license,licensed,2.1166583611
trabecula,trabeculated,2.11962123163
belt,belted,2.12376415899
frost,frosted,2.13140133931
threat,threaten,2.13148830704
stream,streamlined,2.14755554059
tape,tapered,2.16215669568
notch,notched,2.1897931491
flank,flanked,2.21105435099
devote,devoted,2.25819275097
seal,sealed,2.27047852555
bridge,bridged,2.29848564984
crow,crowded,2.3301628317
constrict,constricted,2.36527676359
bond,bonded,2.3739389478
reform,reformed,2.37498795372
suppose,supposed,2.37901040085
merit,merited,2.39368585878
hydrate,hydrated,2.39406945152
compress,compressed,2.40116488745
fuse,fused,2.40673487444
print,printed,2.42175058289
inspire,inspired,2.42656964199
afflict,afflicted,2.42763290063
confound,confounded,2.43699723519
degrade,degraded,2.43815522186
sick,sickled,2.4408134644
handle,handled,2.47897841972
smoke,smoked,2.48375278477
distort,distorted,2.52562339133
dilute,diluted,2.5590133877
wash,washed,2.56150797551
anchor,anchored,2.57067088004
brand,branded,2.59315939929
warm,warmed,2.66572362859
educate,educated,2.69917695685
retard,retarded,2.70749730148
seed,seeded,2.76173473573
decide,decided,2.76796818807
partition,partitioned,2.79021079772
weigh,weighed,2.81133464748
travel,traveled,2.83878140095
hope,hoped,2.84019248555
plug,plugged,2.8405965037
mela,melamed,2.8569186847
mirror,mirrored,2.86838509185
interrupt,interrupted,2.86892807238
refine,refined,2.87539213073
melt,melted,2.92101903066
super,superimposed,3.01746325378
learn,learned,3.02094763672
illuminate,illuminated,3.04364322374
travel,travelled,3.06322630006
reconstruct,reconstructed,3.06955227252
compact,compacted,3.06993263901
perforate,perforated,3.0786024614
advise,advised,3.09429628645
strip,stripped,3.1003084437
striate,striated,3.13257788641
possess,possessed,3.19281907962
handicap,handicapped,3.20849495583
rotate,rotated,3.24994616978
replicate,replicated,3.25063406154
track,tracked,3.25760067947
instruct,instructed,3.25995867609
ground,grounded,3.27345745223
concentrate,concentrated,3.27648559686
puncture,punctured,3.28820076556
coat,coated,3.32505528168
accomplish,accomplished,3.38719864355
favor,favored,3.40204452516
agree,agreed,3.40771721053
shield,shielded,3.41806880694
restrict,restricted,3.47480460994
mail,mailed,3.48767819859
precipitate,precipitated,3.5452426878
predispose,predisposed,3.58905167488
mount,mounted,3.68475554933
round,rounded,3.69373161871
accelerate,accelerated,3.72289924402
drain,drained,3.72562537584
skill,skilled,3.74049808889
cannula,cannulated,3.74722377854
scatter,scattered,3.76655435428
glue,glued,3.83135586175
outline,outlined,3.84689149664
permit,permitted,3.8728756264
guard,guarded,4.04270699627
myelin,myelinated,4.07274643229
detach,detached,4.08303625242
seat,seated,4.08433178552
adopt,adopted,4.08992468975
sheath,sheathed,4.12123775938
surround,surrounded,4.12390843451
bound,bounded,4.15070345245
rupture,ruptured,4.16146734489
convert,converted,4.16343047426
expand,expanded,4.1885725897
rest,restrained,4.22482407989
oppose,opposed,4.24473713445
intend,intended,4.25440704265
desire,desired,4.3407205697
price,priced,4.37425124727
incorporate,incorporated,4.3944429506
dissect,dissected,4.42322578309
relieve,relieved,4.42710684484
list,listed,4.4442500632
connect,connected,4.51144171162
fragment,fragmented,4.52791011759
kind,kindred,4.55936257787
trigger,triggered,4.56914045884
couple,coupled,4.58570089038
load,loaded,4.59262800737
buckle,buckled,4.60685838096
coup,coupled,4.61570257424
suppress,suppressed,4.63475028211
prefer,preferred,4.63824934782
touch,touched,4.65935517244
distinguish,distinguished,4.66669198705
square,squared,4.67244988726
raise,raised,4.67412503707
weigh,weighted,4.77700741488
sickle,sickled,4.80171724001
absorb,absorbed,4.81330906082
plot,plotted,4.86087922478
repeat,repeated,4.86246017763
fear,feared,4.90195960714
admit,admitted,4.9088952981
mani,manifested,4.92850330819
enlarge,enlarged,4.95825172398
fall,fallen,4.97111623153
fill,filled,5.00325912095
vault,vaulted,5.00841226941
warrant,warranted,5.03385126257
abstract,abstracted,5.04623724179
check,checked,5.0727164748
discover,discovered,5.07702671256
select,selected,5.07870670076
attach,attached,5.08957624729
burn,burned,5.09082897837
substitute,substituted,5.1142522276
rest,restricted,5.12741967854
spike,spiked,5.13051753974
register,registered,5.13179936919
genera,generalized,5.15513777465
suspect,suspected,5.15833058461
employ,employed,5.15842857476
perfect,perfected,5.16058664577
extend,extended,5.19378009014
crush,crushed,5.20244736406
turn,turned,5.21706561568
elevate,elevated,5.23598691875
stop,stopped,5.23855713842
correlate,correlated,5.28105475892
reserve,reserved,5.32588943501
fold,folded,5.34793958716
reverse,reversed,5.36174938802
cluster,clustered,5.38900459665
face,faced,5.39996888385
compose,composed,5.40674976344
rais,raised,5.42474501662
plate,plated,5.43603892542
stand,standardized,5.45833772026
switch,switched,5.51292478298
sustain,sustained,5.52526537653
band,banded,5.55374906108
augment,augmented,5.55473358819
resolve,resolved,5.59218775485
experiment,experimented,5.59961112398
sele,selected,5.61705234736
screen,screened,5.62019113813
bloc,blocked,5.63198616941
force,forced,5.65869670837
prove,proved,5.66218161646
sight,sighted,5.66973877072
peak,peaked,5.67382588076
diffuse,diffused,5.68659898672
regulate,regulated,5.69902278947
fashion,fashioned,5.71277074851
insert,inserted,5.71498939396
feature,featured,5.71573951749
return,returned,5.74108729855
border,bordered,5.75723826205
inform,informed,5.75836144647
combine,combined,5.796760948
atta,attached,5.82246456157
comb,combined,5.84519800178
slope,sloped,5.85916318122
include,included,5.92351327283
decline,declined,5.92670700728
grade,graded,5.93327647806
blur,blurred,5.94848261392
scar,scarred,5.95094307464
pattern,patterned,5.9608211371
standard,standardized,5.98239892665
reflect,reflected,5.99907828378
enhance,enhanced,6.00358022292
forme,formed,6.01110031447
transfer,transferred,6.03085941679
extract,extracted,6.04367907445
balance,balanced,6.04842392448
provide,provided,6.05096418852
involve,involved,6.08339242465
train,trained,6.08846726575
class,classed,6.09310235803
branch,branched,6.13919026047
spot,spotted,6.14423145581
comprise,comprised,6.15571229869
confirm,confirmed,6.23749833264
part,partitioned,6.24836264776
value,valued,6.25185442804
course,coursed,6.26276783786
needle,needled,6.26425219272
cover,covered,6.27473640135
culture,cultured,6.28610001092
note,noted,6.29011240925
cross,crossed,6.29190275687
derive,derived,6.30375915438
pain,painted,6.31051893824
dilate,dilated,6.32269021859
measure,measured,6.3840110313
produce,produced,6.39085256854
impact,impacted,6.39535682228
work,worked,6.40482054484
complicate,complicated,6.40924111225
size,sized,6.41737507582
position,positioned,6.45725439154
target,targeted,6.46201736449
scale,scaled,6.49454100303
calculate,calculated,6.52991901006
sector,sectored,6.53927704186
assign,assigned,6.55560432824
point,pointed,6.56890077313
step,stepped,6.59605549406
tunnel,tunneled,6.60804085832
color,colored,6.64841501943
shape,shaped,6.66932898872
associate,associated,6.70697868953
reveal,revealed,6.70701075352
stage,staged,6.71339638404
state,stated,6.72089425447
receive,received,6.72831873587
condition,conditioned,6.73445327716
disorder,disordered,6.73555937565
author,authorized,6.7505581339
collect,collected,6.75396845479
rank,ranked,6.81206159758
transport,transported,6.81269717799
express,expressed,6.81344074758
score,scored,6.87546947328
time,timed,6.90380426162
enroll,enrolled,6.91257936498
structure,structured,6.91629777741
line,lined,6.95632100297
assess,assessed,7.00867665454
practice,practiced,7.01432859984
show,shown,7.01623971683
blind,blinded,7.05478318346
correct,corrected,7.08245473005
mark,marked,7.08962036783
organ,organized,7.10687790864
pair,paired,7.11128246443
test,tested,7.20087104353
order,ordered,7.21988426218
block,blocked,7.22185732253
divide,divided,7.22295514708
center,centered,7.23561717332
define,defined,7.26348913363
surface,surfaced,7.27006289392
hand,handed,7.29076517546
form,formed,7.31034176918
valve,valved,7.32683263123
link,linked,7.33907755768
hand,handled,7.4034377737
wall,walled,7.4205545377
water,watershed,7.42363804407
power,powered,7.43219851335
design,designed,7.44569791727
post,posted,7.44796577914
coll,collected,7.46731298419
need,needled,7.51164943865
stem,stemmed,7.60995679764
wound,wounded,7.67706711095
determine,determined,7.67940784394
curve,curved,7.7625167421
subject,subjected,7.81746936788
space,spaced,8.01055803504
cent,centered,8.04554421992
angle,angled,8.1551816294
weight,weighted,8.17160108397
disease,diseased,8.2175307741
group,grouped,8.36386094303
rate,rated,8.40386305221
class,classified,8.46684883292
base,based,8.50346641206
lamina,laminated,8.59047619332
graft,grafted,8.62484189646
segment,segmented,8.71721560884
range,ranged,8.85671882583
carr,carried,8.92708020822
mask,masked,9.34994016923
layer,layered,9.44824851733
gene,generalized,10.828168946

## group: bigrams
and,the,5.33818357035
and,in,5.47527283188
of,the,5.71539387319
in,the,5.7623298274
with,the,6.41963781319
that,the,6.58061884258
for,the,6.93468428793
intraocular,pressure,7.03152210898
in,glaucoma,7.0464019826
glaucoma,in,7.0464019826
on,the,7.07845853882
glaucoma,and,7.14746393128
at,the,7.33067859256
with,glaucoma,7.43546823833
the,mean,7.57104475327
visual,acuity,7.79382721659
in,this,7.79437414378
of,glaucoma,7.81451955389
to,the,7.8430749371
the,study,7.96205038913
visual,field,7.97972705898
the,anterior,8.01675181758
number,of,8.07275655184
of,this,8.08626244336
associated,with,8.15657985256
by,the,8.15875246324
optic,disc,8.23496263612
treatment,of,8.28068215563
use,of,8.33079921049
from,the,8.33883433665
the,optic,8.36917584405
this,study,8.62894372609
between,the,8.71348189239
effect,of,8.94855207775
there,was,9.07828042535
optic,nerve,9.36092755212
anterior,chamber,9.42356117114
to,evaluate,9.50618133063
to,determine,9.72807210431
ocular,hypertension,10.1365577568
to,be,11.3506936387
purpose,to,12.3801625893
may,be,12.9615010468

