## group: nn_nns
obstetric,obstetrics,2.02032831698
stick,sticks,2.14142502204
asset,assets,2.18739078014
scratch,scratches,2.84684974689
leech,leeches,3.19929370091
proceed,proceeds,3.3366125283
surround,surroundings,3.34157285959
stock,stocks,3.37096183524
blink,blinks,3.5049424369
caliper,calipers,3.51960618828
sport,sports,3.56249120817
technic,technics,3.74597873068
onward,onwards,4.39402997342
wage,wages,4.76948519517
arch,arches,5.3212848398
synapse,synapses,5.53584483393
sander,sanders,5.68295364765
chip,chips,5.71339226845
mechanic,mechanics,5.79238940286
backward,backwards,5.86999022647
pharmacodynamic,pharmacodynamics,6.06233515693
outdoor,outdoors,6.16135422642
clip,clips,7.39952700203
syringe,syringes,7.61977153105
quarter,quarters,7.85552299234
ground,grounds,8.37817669545
button,buttons,8.38416310958
street,streets,8.4037295266
harmonic,harmonics,8.78842109562
stay,stays,8.83434280297
hydrodynamic,hydrodynamics,9.61926156326
spectacle,spectacles,9.65947451862
table,tables,11.6496282633
plastic,plastics,11.72781444
turn,turns,13.3171307323
ellipse,ellipses,14.2612845399
geriatric,geriatrics,14.3328273617
gain,gains,14.4144713331
glass,glasses,15.8927387618
link,links,16.3172490004
base,bases,17.1383448687
cone,cones,18.2283975019
class,classes,18.785152253
session,sessions,18.9509263245
hemodynamic,hemodynamics,20.9041617757
content,contents,22.7488818364
remain,remains,23.7139998729
needle,needles,23.8006066037
manner,manners,24.1502866908
work,works,25.1717937019
biometric,biometrics,25.4443176173
size,sizes,25.6690042591
night,nights,25.9443621261
morning,mornings,25.9534158369
scale,scales,28.0087782188
wound,wounds,29.0765025221
diagnose,diagnoses,29.1548962459
phase,phases,29.258872675
pediatric,pediatrics,31.1452970526
color,colors,31.4074116582
need,needs,31.6609064231
damage,damages,31.8470192422
become,becomes,33.3192491246
effect,effects,34.2403352876
brain,brains,34.5483310189
test,testes,37.6011317325
time,times,40.5048932944
term,terms,40.9925188532
analyse,analyses,42.7287969281
heart,hearts,45.2402886105
side,sides,46.9768677323

