## group: nn_vbg
unlock,unlocking,0.888832381556
ripe,ripening,0.890225751916
finish,finishing,0.914936723649
stitch,stitching,0.923471865705
void,voiding,0.996870481917
unravel,unraveling,1.00794557015
afflict,afflicting,1.0112372564
depress,depressing,1.03369171357
perturb,perturbing,1.04245956087
ladder,laddering,1.06391890875
unravel,unravelling,1.08245836061
lift,lifting,1.12912457571
weaken,weakening,1.13140471123
multiply,multiplying,1.18177810266
underpin,underpinning,1.18592231891
sweat,sweating,1.19705450012
smart,smarting,1.25683941578
farm,farming,1.26142226865
sprout,sprouting,1.27921114852
shrink,shrinking,1.2885568944
push,pushing,1.28870892758
hatch,hatching,1.32041061879
interrupt,interrupting,1.37883605502
forget,forgetting,1.39101161981
hunt,hunting,1.39366123327
knock,knocking,1.47263562554
tattoo,tattooing,1.49062467266
mold,molding,1.50131193594
reward,rewarding,1.51673487247
talk,talking,1.54860701192
kill,killing,1.5692787426
absorb,absorbing,1.58679376604
watch,watching,1.5953908317
trap,trapping,1.62780770347
scratch,scratching,1.62887827601
shea,sheathing,1.63234102138
discern,discerning,1.65336197604
flush,flushing,1.67185642357
weigh,weighing,1.68995287759
book,booking,1.74105018966
poison,poisoning,1.74863660186
comb,combing,1.76507125237
resist,resisting,1.77670992364
warn,warning,1.80496901015
shea,shearing,1.87820061107
strengthen,strengthening,1.8786584082
shadow,shadowing,1.88630839225
speak,speaking,1.88785498783
worry,worrying,1.89044503607
tailor,tailoring,1.89075925249
spark,sparkling,1.97228649505
crack,cracking,1.98687110422
join,joining,1.99260855589
appeal,appealing,2.0105810714
wick,wicking,2.02079322527
kiss,kissing,2.04724385478
cast,casting,2.05721105283
float,floating,2.05736800209
satisfy,satisfying,2.06465333915
weigh,weighting,2.08598975279
govern,governing,2.12466411845
wash,washing,2.16047959891
grasp,grasping,2.17556167232
seal,sealing,2.2006397576
pick,pickering,2.2050206396
partition,partitioning,2.21624474846
club,clubbing,2.22800592798
mislead,misleading,2.29036653121
disturb,disturbing,2.33872780834
feed,feeding,2.43525432372
press,pressing,2.44229564058
retard,retarding,2.50296943356
wish,wishing,2.51475531357
char,charting,2.51531835668
cool,cooling,2.54324763282
resp,respecting,2.55751774361
creep,creeping,2.5692628509
chin,ching,2.57932041598
coat,coating,2.58516220024
disappear,disappearing,2.58628927959
auto,autografting,2.60705953197
cree,creeping,2.68519604249
recur,recurring,2.69208862499
taper,tapering,2.71431822163
path,pathfinding,2.73835874183
plug,plugging,2.76162434997
alarm,alarming,2.7873126691
justify,justifying,2.8661814416
distress,distressing,2.87538242282
sustain,sustaining,2.88375525154
tape,tapering,2.91993512243
dissect,dissecting,2.93688718277
autograft,autografting,3.00785074228
sick,sickling,3.02600233923
mount,mounting,3.0988769371
proceed,proceeding,3.10858458527
scaffold,scaffolding,3.11013666878
melt,melting,3.13109263616
consult,consulting,3.20454421665
counter,counteracting,3.27825251088
shorten,shortening,3.3105273883
stiff,stiffening,3.32319130789
house,housekeeping,3.34430025619
tail,tailoring,3.34703129706
counteract,counteracting,3.34764537798
walk,walking,3.38097377029
travel,traveling,3.406620025
stiffen,stiffening,3.41679476342
genera,generating,3.4231214833
halt,halting,3.42767987723
neighbor,neighboring,3.44781545387
mark,marking,3.571064166
hold,holding,3.68627093754
render,rendering,3.69209212882
favor,favoring,3.71971273793
notch,notching,3.7927463209
seek,seeking,3.83332947377
convert,converting,3.8409333453
drift,drifting,3.99854109062
retain,retaining,4.08036484753
agree,agreeing,4.13555692218
think,thinking,4.1483818049
shield,shielding,4.16618859909
possess,possessing,4.18516782673
wear,wearing,4.2741955098
enter,entering,4.29646223949
spread,spreading,4.33893031955
nick,nicking,4.38408336677
coup,coupling,4.43399570222
awake,awakening,4.51425856073
scatter,scattering,4.54304467458
flank,flanking,4.60011909479
draw,drawing,4.73255170192
deal,dealing,4.75506946862
persist,persisting,4.75752928573
call,calling,4.76251075944
wait,waiting,4.78893985217
expand,expanding,4.82500414602
round,rounding,4.8294062962
sheath,sheathing,4.84252909502
exceed,exceeding,4.85480943241
stand,standing,4.910834823
peel,peeling,4.92206583222
match,matching,5.00122738704
rais,raising,5.01367421968
demand,demanding,5.15043480872
conflict,conflicting,5.18271208811
arrest,arresting,5.1872375038
list,listening,5.27120812902
pertain,pertaining,5.37221513887
feel,feeling,5.40891379552
cloud,clouding,5.4141748783
switch,switching,5.43917173587
look,looking,5.50387138295
load,loading,5.53162750736
break,breaking,5.73377711221
shear,shearing,5.75037712593
cover,covering,6.19539377795
stop,stopping,6.20345191474
touch,touching,6.25181728769
fold,folding,6.26045115395
miss,missing,6.35073700466
yield,yielding,6.42598726587
carry,carrying,6.44942763429
invest,investigating,6.48443903272
vault,vaulting,6.56225884583
turn,turning,6.58206867911
plot,plotting,6.62736283624
fail,failing,6.6652996466
rest,resting,6.67717586113
extend,extending,6.71224801842
crush,crushing,6.74155460515
tend,tending,6.83805196932
wild,wilding,6.8705708823
teach,teaching,6.89585138822
comb,combining,6.91987850833
yellow,yellowing,6.9608597557
carr,carrying,7.00261182145
consent,consenting,7.02662702697
threat,threatening,7.09223001852
grow,growing,7.12794974499
reflect,reflecting,7.12815200712
distinguish,distinguishing,7.26117478226
gain,gaining,7.26984936419
start,starting,7.41995641683
project,projecting,7.53811097063
foster,fostering,7.76115697406
link,linking,7.79054783527
transfer,transferring,7.8684862904
deva,devastating,7.94403398149
scar,scarring,7.9992517245
depend,depending,8.02044181215
cluster,clustering,8.0285845769
confound,confounding,8.06323823491
smooth,smoothing,8.11464066925
reach,reaching,8.15841991812
surround,surrounding,8.19034405073
cross,crossing,8.19185881358
thick,thickening,8.20789484478
suffer,suffering,8.30346930335
tunnel,tunneling,8.33176361631
protect,protecting,8.3400372135
worsen,worsening,8.35116030476
delay,delaying,8.45556974322
reveal,revealing,8.481312224
transform,transforming,8.5200949263
exam,examining,8.52332738954
flash,flashing,8.5819709445
flicker,flickering,8.58612673457
fall,falling,8.60534140124
strength,strengthening,8.63152945358
tilt,tilting,8.63638581379
ring,ringing,8.6821271077
school,schooling,8.68922321495
spot,spotting,8.7140889997
bloc,blocking,8.72828278099
confirm,confirming,8.85129381446
fill,filling,8.86278526599
count,counteracting,8.9611031728
compound,compounding,9.03737510687
begin,beginning,9.05588475406
shift,shifting,9.0617916439
explain,explaining,9.07910741055
correct,correcting,9.14500744521
search,searching,9.33814622711
shunt,shunting,9.35815573746
exact,exacting,9.46030322769
alter,alternating,9.49414829559
reason,reasoning,9.57566098664
step,stepping,9.64955911838
concern,concerning,9.6507761907
record,recording,9.81705686039
correspond,corresponding,10.0097825114
thin,thinking,10.0322524537
mode,modeling,10.1176887628
strip,stripping,10.1209191
show,showing,10.1762576242
support,supporting,10.2248139916
stain,staining,10.2359249671
treat,treating,10.2695351909
dark,darkening,10.2715148611
seem,seeming,10.2933688633
help,helping,10.3668962955
lamp,lamping,10.3704033081
learn,learning,10.403554243
sleep,sleeping,10.4827984984
water,watering,10.5630425508
weight,weighting,10.7353952198
transport,transporting,10.7875862643
chart,charting,10.7989624616
deep,deepening,10.8162671678
peak,peaking,10.8260460179
work,working,10.8482533825
fast,fasting,10.9309018757
center,centering,10.9486407802
suggest,suggesting,10.9548661098
result,resulting,10.9851405838
affect,affecting,11.0068254837
stem,stemming,11.0380943944
heal,healing,11.0443794514
cent,centering,11.08552317
interest,interesting,11.0963758707
assay,assaying,11.0996422585
limit,limiting,11.1207938478
form,forming,11.1456359396
filter,filtering,11.163148036
respect,respecting,11.2281013681
design,designing,11.2762715375
point,pointing,11.3121417294
part,partitioning,11.3883664148
survey,surveying,11.4119712388
understand,understanding,11.4517752502
color,coloring,11.5946266157
tear,tearing,11.7709585919
thin,thinning,11.8303297706
cost,costing,11.9325865346
wound,wounding,11.9730866144
pattern,patterning,11.9795800431
regard,regarding,12.0058164223
undergo,undergoing,12.1150113233
block,blocking,12.1728260005
approach,approaching,12.2488659246
screen,screening,12.2967527918
test,testing,12.3396914005
hand,handling,12.3999184107
visit,visiting,12.4378043489
graft,grafting,12.4447882154
head,heading,12.4541394962
model,modeling,12.5308320663
flow,flowing,12.7511734795
need,needing,12.7947249949
actin,acting,13.0944387269
light,lighting,13.1229406675
drop,dropping,13.225684107
accord,according,13.4454846202
lead,leading,14.1833962701
gene,generating,14.8292983669
group,grouping,15.3238555869
found,founding,15.5317989144
need,needling,16.1966948511

