## group: nn_nns
stick,sticks,0.573307445555
onward,onwards,0.592841730352
obstetric,obstetrics,0.735221161182
wage,wages,0.809269878087
asset,assets,0.822855446193
scratch,scratches,0.880179514761
sport,sports,0.910502396548
caliper,calipers,0.9718869171
leech,leeches,0.976887498739
clip,clips,1.00428120403
effect,effects,1.02778484314
technic,technics,1.11240646823
stock,stocks,1.11455905574
surround,surroundings,1.15323417077
arch,arches,1.15841387828
button,buttons,1.2078188392
outdoor,outdoors,1.23913617
phase,phases,1.27754824993
remain,remains,1.3808566093
gain,gains,1.41099777336
ground,grounds,1.46979747976
scale,scales,1.47535506026
proceed,proceeds,1.49317504027
blink,blinks,1.49645499509
session,sessions,1.51150446203
damage,damages,1.54020692334
chip,chips,1.56585904295
size,sizes,1.61911754908
synapse,synapses,1.64709718796
syringe,syringes,1.65536455038
mechanic,mechanics,1.6579767725
street,streets,1.67968267999
need,needs,1.68887325558
spectacle,spectacles,1.78420659759
stay,stays,1.81312657286
backward,backwards,1.87866714323
quarter,quarters,1.88689015242
class,classes,1.89599183243
base,bases,1.8972934427
work,works,1.99921881001
content,contents,2.06588922822
sander,sanders,2.21593678927
link,links,2.3259904928
plastic,plastics,2.37334192451
table,tables,2.46706199819
harmonic,harmonics,2.46847140061
pharmacodynamic,pharmacodynamics,2.51376547742
brain,brains,2.61052708444
hydrodynamic,hydrodynamics,2.73827039662
color,colors,3.0323251318
diagnose,diagnoses,3.09555410844
turn,turns,3.12560580412
cone,cones,3.27795163757
analyse,analyses,3.33114824595
night,nights,3.34563047784
manner,manners,3.37300063828
become,becomes,3.51266512378
time,times,3.52229943582
geriatric,geriatrics,3.52984956261
test,testes,3.56646609365
pediatric,pediatrics,3.633601794
ellipse,ellipses,3.65153847004
glass,glasses,3.66805102164
term,terms,3.90144200251
needle,needles,3.96016230245
morning,mornings,3.98938369276
hemodynamic,hemodynamics,4.25172451199
wound,wounds,4.9299999024
side,sides,5.23704394601
biometric,biometrics,6.55759073165
heart,hearts,6.9392663996

## group: nn_vbg
unravel,unraveling,0.37188025353
ladder,laddering,0.429514050215
ripe,ripening,0.48492340705
afflict,afflicting,0.505827138507
stitch,stitching,0.506288432884
depress,depressing,0.507032200799
finish,finishing,0.519324328443
unlock,unlocking,0.553998162737
lift,lifting,0.59356647195
perturb,perturbing,0.618337096316
shrink,shrinking,0.619606740778
unravel,unravelling,0.630092956884
smart,smarting,0.637194848096
underpin,underpinning,0.652216638987
push,pushing,0.670742165642
multiply,multiplying,0.672505958976
forget,forgetting,0.681071804992
kill,killing,0.693586802906
farm,farming,0.738504991991
interrupt,interrupting,0.744501557614
sweat,sweating,0.755466197396
watch,watching,0.778724515377
void,voiding,0.825807943835
book,booking,0.826458977923
talk,talking,0.831962439085
wash,washing,0.837882763341
tailor,tailoring,0.838415338635
cast,casting,0.880939105279
knock,knocking,0.916154151004
hunt,hunting,0.939347704652
absorb,absorbing,0.942890568371
sprout,sprouting,0.949648403753
hatch,hatching,0.962102023654
weaken,weakening,0.970263648292
strengthen,strengthening,0.975842995587
reward,rewarding,1.00845016274
mold,molding,1.01330905363
wear,wearing,1.0421835888
resist,resisting,1.04459335836
shea,shearing,1.0704301456
weigh,weighing,1.07043562211
worry,worrying,1.08695968519
poison,poisoning,1.09103052873
travel,traveling,1.10286749822
join,joining,1.10799312992
scratch,scratching,1.11215906609
discern,discerning,1.11744776993
satisfy,satisfying,1.12818292537
alarm,alarming,1.13874214772
coat,coating,1.14689215474
trap,trapping,1.15900464014
warn,warning,1.16580808362
flush,flushing,1.17042775726
taper,tapering,1.17542494392
shea,sheathing,1.2097959841
shadow,shadowing,1.21016692976
counteract,counteracting,1.21368737699
seal,sealing,1.22151853278
mark,marking,1.2252596116
pick,pickering,1.2345177594
tattoo,tattooing,1.278231788
round,rounding,1.28626035324
press,pressing,1.29200240846
weigh,weighting,1.29651867284
crack,cracking,1.29946345678
govern,governing,1.33384102814
seek,seeking,1.33746152382
wick,wicking,1.33908366658
partition,partitioning,1.35401562155
feed,feeding,1.37502598064
counter,counteracting,1.38951959101
plug,plugging,1.39721035361
switch,switching,1.40474818119
retard,retarding,1.41316785285
delay,delaying,1.42487062464
disturb,disturbing,1.43010100473
scaffold,scaffolding,1.43750472043
speak,speaking,1.44212979205
path,pathfinding,1.45102085549
tape,tapering,1.45601473261
club,clubbing,1.46908626992
recur,recurring,1.50470971488
expand,expanding,1.50716785873
start,starting,1.51082097321
melt,melting,1.51479057673
auto,autografting,1.52177009725
grasp,grasping,1.5218484474
disappear,disappearing,1.53410707337
consult,consulting,1.53644408608
scatter,scattering,1.53805846756
sustain,sustaining,1.54845515328
autograft,autografting,1.5685616633
comb,combing,1.57427499777
sick,sickling,1.58049478346
mislead,misleading,1.58289449011
spark,sparkling,1.58764171212
creep,creeping,1.59985586365
chin,ching,1.60115714954
support,supporting,1.61702254411
scar,scarring,1.64001146749
appeal,appealing,1.65303627431
float,floating,1.65732106102
retain,retaining,1.67104395106
halt,halting,1.69057079032
shorten,shortening,1.69207642497
exam,examining,1.6946398972
cool,cooling,1.69887799152
convert,converting,1.70995968764
enter,entering,1.715553817
walk,walking,1.75334648432
resp,respecting,1.77284778744
deal,dealing,1.78621759824
tail,tailoring,1.79022244996
exceed,exceeding,1.79123072436
wait,waiting,1.79551830823
kiss,kissing,1.7961991671
genera,generating,1.80533571052
neighbor,neighboring,1.81386324413
model,modeling,1.82790417557
awake,awakening,1.83792954907
stiff,stiffening,1.84345273375
break,breaking,1.8437509445
protect,protecting,1.85087309589
dissect,dissecting,1.88524872129
test,testing,1.88611582656
justify,justifying,1.90942329784
proceed,proceeding,1.90960182012
demand,demanding,1.90996189136
screen,screening,1.91073203222
distress,distressing,1.91718763672
spread,spreading,1.91743740489
match,matching,1.92020405577
possess,possessing,1.92814141197
treat,treating,1.93075354704
distinguish,distinguishing,1.94189610853
shift,shifting,1.94452209755
thick,thickening,1.95131042843
gain,gaining,1.99949063958
wish,wishing,2.01339985036
char,charting,2.03118505963
miss,missing,2.03426714052
favor,favoring,2.03593811295
part,partitioning,2.04057701674
notch,notching,2.07344174876
render,rendering,2.08265964399
hold,holding,2.0996000789
list,listening,2.13155539131
call,calling,2.13292951119
agree,agreeing,2.15364600731
stiffen,stiffening,2.15378099036
shield,shielding,2.15451111435
respect,respecting,2.18551851346
cree,creeping,2.20133930649
crush,crushing,2.21617663726
result,resulting,2.21620537573
point,pointing,2.22025931464
sheath,sheathing,2.2484081694
mount,mounting,2.26444121681
look,looking,2.2812709585
correct,correcting,2.29486697457
load,loading,2.31001607477
carry,carrying,2.33391491567
fail,failing,2.349229927
draw,drawing,2.36408412567
ring,ringing,2.40550435188
touch,touching,2.44863646933
affect,affecting,2.47290676997
mode,modeling,2.50810542585
think,thinking,2.52514785108
form,forming,2.53402833226
arrest,arresting,2.56237258817
house,housekeeping,2.57046693912
persist,persisting,2.58177125434
thin,thinning,2.59225717125
conflict,conflicting,2.61624749397
show,showing,2.62409023047
lead,leading,2.63434492069
cluster,clustering,2.63580317683
stand,standing,2.65578711433
confirm,confirming,2.65863906392
compound,compounding,2.66567058513
weight,weighting,2.66808736338
flicker,flickering,2.68510338342
yellow,yellowing,2.68693723096
step,stepping,2.68819186767
dark,darkening,2.70100061208
fall,falling,2.72162395024
reach,reaching,2.75188057612
center,centering,2.75585726402
rest,resting,2.75701897915
drift,drifting,2.76389964478
fold,folding,2.77100059436
coup,coupling,2.77320306111
accord,according,2.79195311285
search,searching,2.79347440528
understand,understanding,2.80025471703
project,projecting,2.80178591675
group,grouping,2.80514595081
peel,peeling,2.81055575408
flank,flanking,2.81228807882
need,needing,2.8303289963
tend,tending,2.86004713677
cover,covering,2.88500552112
reflect,reflecting,2.88920367446
correspond,corresponding,2.90041868765
turn,turning,2.94131703451
extend,extending,2.95532396663
explain,explaining,2.95631914346
stain,staining,2.97051588439
begin,beginning,2.97100304758
pattern,patterning,2.99574360123
spot,spotting,3.00064657709
yield,yielding,3.00146409281
light,lighting,3.0132245601
pertain,pertaining,3.02731123701
interest,interesting,3.03596960192
rais,raising,3.04259214868
work,working,3.04801415865
depend,depending,3.06345799103
grow,growing,3.06543199752
strength,strengthening,3.12985916292
surround,surrounding,3.14793913387
shunt,shunting,3.15926193187
worsen,worsening,3.17122541698
carr,carrying,3.17267033965
record,recording,3.18099759153
approach,approaching,3.20285434041
suffer,suffering,3.26737730932
reveal,revealing,3.2790137774
color,coloring,3.29010522368
wild,wilding,3.30966436649
design,designing,3.32143193145
cross,crossing,3.38533819479
found,founding,3.38940331104
help,helping,3.41341411495
alter,alternating,3.42819452359
comb,combining,3.4430597676
count,counteracting,3.44826361465
transfer,transferring,3.46197104011
shear,shearing,3.49042922511
drop,dropping,3.539313858
feel,feeling,3.56699723764
tilt,tilting,3.58090366737
peak,peaking,3.606789335
consent,consenting,3.61606199224
deep,deepening,3.62721037104
school,schooling,3.65038574368
concern,concerning,3.70602524336
regard,regarding,3.73189234623
plot,plotting,3.74016232267
fast,fasting,3.74971251463
head,heading,3.76005552568
stop,stopping,3.76106508103
fill,filling,3.780592162
invest,investigating,3.78722204133
survey,surveying,3.7974999825
water,watering,3.81407192987
cloud,clouding,3.89234019023
tear,tearing,3.90596239664
cost,costing,3.91434009513
gene,generating,3.915683923
suggest,suggesting,3.91780201606
undergo,undergoing,3.93444384204
assay,assaying,4.08483122888
graft,grafting,4.14521798148
reason,reasoning,4.15596696783
learn,learning,4.16212762576
threat,threatening,4.1797202257
seem,seeming,4.26611892585
link,linking,4.27512305147
hand,handling,4.28967291502
teach,teaching,4.29508352035
sleep,sleeping,4.33830600412
nick,nicking,4.35254166237
thin,thinking,4.36502426749
transport,transporting,4.46730826246
need,needling,4.52278929457
visit,visiting,4.52988608151
smooth,smoothing,4.5662507721
limit,limiting,4.77770769468
tunnel,tunneling,4.80444735544
block,blocking,4.81370851259
foster,fostering,4.81471156193
transform,transforming,4.99715184574
flow,flowing,5.01942534914
vault,vaulting,5.13897958204
confound,confounding,5.27241458118
flash,flashing,5.34422346647
cent,centering,5.426111126
actin,acting,5.61437537466
chart,charting,5.62417821694
exact,exacting,5.74426369277
bloc,blocking,5.8281915361
filter,filtering,5.8552044764
deva,devastating,6.10212769881
wound,wounding,6.1565965998
heal,healing,6.23393361073
lamp,lamping,7.26447590225
stem,stemming,7.34109456595
strip,stripping,9.73073644559

## group: jj_jjr_jjs
high,highest,1.70614463429
high,higher,1.84295326218
young,younger,2.68337593381
small,smaller,2.748356528
great,greater,3.69306802432

## group: nn_vbd_vbn
fire,fired,0.404251547034
fade,faded,0.418225234476
enforce,enforced,0.450134681954
restrain,restrained,0.450408741644
precondition,preconditioned,0.506602890656
multinucleate,multinucleated,0.507795096764
lapse,lapsed,0.509779428975
hyper,hypertrophied,0.513046614935
concert,concerted,0.539692716304
conceal,concealed,0.559558415492
bevel,beveled,0.568686633655
convince,convinced,0.582621133739
articulate,articulated,0.641024915866
silence,silenced,0.666035646231
buck,buckled,0.666729768254
avert,averted,0.674360829194
plague,plagued,0.708949829621
traverse,traversed,0.728147212824
constrain,constrained,0.728434198545
tackle,tackled,0.746621243969
peel,peeled,0.751498038241
shea,sheathed,0.754648313721
gate,gated,0.80705723864
contract,contracted,0.830873642979
sort,sorted,0.853619332091
hyper,hyperpigmented,0.859497159921
sequester,sequestered,0.894664245263
book,booked,0.911962817601
defer,deferred,0.915056966813
digest,digested,0.91938283387
polis,polished,0.971920796637
title,titled,0.996303314848
bill,billed,1.00376123441
trap,trapped,1.00763780823
tint,tinted,1.01230320584
graduate,graduated,1.01324890773
decompose,decomposed,1.02877715638
tune,tuned,1.04002611239
engage,engaged,1.05444605203
erode,eroded,1.06197490741
assure,assured,1.08143083036
round,rounded,1.08545064518
forgot,forgotten,1.09368991103
illuminate,illuminated,1.09892824923
confound,confounded,1.10843269753
waste,wasted,1.11114627801
finish,finished,1.12232706397
deform,deformed,1.12857484014
serra,serrated,1.15413854215
agree,agreed,1.16932469516
taper,tapered,1.18255455763
arch,arched,1.20158861199
print,printed,1.2049189784
threat,threaten,1.25670162179
compress,compressed,1.266008268
ciliate,ciliated,1.27166640837
pick,picked,1.27944338156
saturate,saturated,1.27992755926
educate,educated,1.29056806409
wish,wished,1.29206286038
watch,watched,1.32049707078
bridge,bridged,1.33496981133
stream,streamlined,1.34621712301
retract,retracted,1.35294112915
refine,refined,1.35818895223
coil,coiled,1.37277413378
constrict,constricted,1.38112751849
flank,flanked,1.39760511802
belt,belted,1.40477005967
interrupt,interrupted,1.41014655543
favor,favored,1.41251063822
notch,notched,1.41633440294
conjugate,conjugated,1.41927543836
degrade,degraded,1.42519626327
travel,traveled,1.42800606107
ground,grounded,1.44522584009
devote,devoted,1.44869237256
expand,expanded,1.45611291843
smoke,smoked,1.46006972589
tape,tapered,1.46823693422
retard,retarded,1.47618317093
hope,hoped,1.47772628914
disperse,dispersed,1.4786553696
suspect,suspected,1.50781522652
mirror,mirrored,1.52347544331
restrict,restricted,1.53328001344
travel,travelled,1.53376213905
inspire,inspired,1.54020973319
crow,crowded,1.54409246352
trabecula,trabeculated,1.59453874444
license,licensed,1.62873333483
seal,sealed,1.63020405143
precipitate,precipitated,1.64827653645
distort,distorted,1.65662331446
accelerate,accelerated,1.66362057607
anchor,anchored,1.66669406822
dilute,diluted,1.67743443086
spark,sparked,1.69087554699
acknowledge,acknowledged,1.69362831832
scatter,scattered,1.69651146932
handle,handled,1.6968543092
brand,branded,1.69754524388
fuse,fused,1.72003259605
super,superimposed,1.7209737714
drain,drained,1.75090423768
seed,seeded,1.76142729584
wash,washed,1.76624174534
concentrate,concentrated,1.77446109229
force,forced,1.77831358307
sick,sickled,1.7924063965
part,partitioned,1.81454765184
reform,reformed,1.82601413694
bond,bonded,1.83492726202
advise,advised,1.85842484472
strip,stripped,1.8637090492
suppose,supposed,1.86418206689
merit,merited,1.8734850064
replicate,replicated,1.88693148052
afflict,afflicted,1.88930584205
compose,composed,1.89194706211
frost,frosted,1.90036915077
prefer,preferred,1.9253302354
compact,compacted,1.93807659325
standard,standardized,1.96469814013
hydrate,hydrated,1.9647142646
trigger,triggered,1.97973155771
decide,decided,1.97979819877
repeat,repeated,1.98265562758
produce,produced,1.98569719151
reconstruct,reconstructed,2.01325268052
pattern,patterned,2.02840608485
rupture,ruptured,2.03633138288
weigh,weighed,2.06458595624
plug,plugged,2.06823859619
handicap,handicapped,2.07638058152
warm,warmed,2.07837584402
crush,crushed,2.09176843943
fill,filled,2.09278633183
connect,connected,2.09387196538
culture,cultured,2.10371727153
shield,shielded,2.1041620131
track,tracked,2.11662793448
rest,restrained,2.1192354694
outline,outlined,2.12756362683
learn,learned,2.14576875189
cover,covered,2.15247769429
extend,extended,2.18796316003
suppress,suppressed,2.19090246371
distinguish,distinguished,2.21843596211
skill,skilled,2.25853030122
possess,possessed,2.26450301039
relieve,relieved,2.26554652963
involve,involved,2.26613643027
permit,permitted,2.27093498528
return,returned,2.28715089593
rotate,rotated,2.28999502302
cluster,clustered,2.30599579854
predispose,predisposed,2.31352652227
partition,partitioned,2.31596793216
mela,melamed,2.33509258266
perforate,perforated,2.35620191627
mail,mailed,2.36593554053
coup,coupled,2.36815381619
base,based,2.37167019021
line,lined,2.38873757093
resolve,resolved,2.39183890877
correlate,correlated,2.4038630651
target,targeted,2.41291492515
dilate,dilated,2.42828825155
puncture,punctured,2.4345810094
coat,coated,2.43821805811
convert,converted,2.44954585802
step,stepped,2.45534947617
accomplish,accomplished,2.46453176546
enlarge,enlarged,2.4693628197
glue,glued,2.47361100265
experiment,experimented,2.47614696277
rest,restricted,2.47761715277
plate,plated,2.49761299609
couple,coupled,2.53394970195
plot,plotted,2.54530949649
regulate,regulated,2.55721064879
oppose,opposed,2.56415663113
face,faced,2.566760655
enhance,enhanced,2.5743071093
elevate,elevated,2.58548071693
power,powered,2.60074511054
sustain,sustained,2.60244656932
desire,desired,2.60980567122
instruct,instructed,2.6168700587
bound,bounded,2.61975027048
provide,provided,2.63164353763
reverse,reversed,2.64584607647
raise,raised,2.65623566077
show,shown,2.65672355735
kind,kindred,2.65692135699
select,selected,2.66212856703
employ,employed,2.67239426355
list,listed,2.68006632004
size,sized,2.68336356779
melt,melted,2.6843649468
reveal,revealed,2.6929949565
decline,declined,2.71626177923
mount,mounted,2.72139093563
genera,generalized,2.72468454826
reflect,reflected,2.73356003639
center,centered,2.740228538
cannula,cannulated,2.75920775915
calculate,calculated,2.76186013543
peak,peaked,2.76439465965
striate,striated,2.78433119679
fold,folded,2.78482374071
attach,attached,2.7908991092
adopt,adopted,2.79784778893
inform,informed,2.81744755197
load,loaded,2.82870580807
stage,staged,2.83793479982
sheath,sheathed,2.84385028429
square,squared,2.84608742331
myelin,myelinated,2.84626856729
detach,detached,2.86021586598
check,checked,2.8624817386
blind,blinded,2.86279437023
stand,standardized,2.86384342126
scale,scaled,2.87326396843
color,colored,2.88915348725
range,ranged,2.89007342221
dissect,dissected,2.89321407127
time,timed,2.91394740707
train,trained,2.91674339704
substitute,substituted,2.92720333491
test,tested,2.92994117881
position,positioned,2.93976530411
price,priced,3.02520007619
touch,touched,3.02607076027
register,registered,3.03277217887
author,authorized,3.05014488874
fashion,fashioned,3.05758108581
feature,featured,3.06213919677
associate,associated,3.06954936088
define,defined,3.07952590051
link,linked,3.08191469982
screen,screened,3.08423261563
order,ordered,3.09639204743
confirm,confirmed,3.10331453429
absorb,absorbed,3.10609962807
discover,discovered,3.12136064782
fall,fallen,3.12161706819
guard,guarded,3.13077079706
diffuse,diffused,3.13698727943
score,scored,3.14045237293
derive,derived,3.14228023391
forme,formed,3.14964066612
subject,subjected,3.15304591612
band,banded,3.15896161532
grade,graded,3.17927936255
pair,paired,3.19713520095
seat,seated,3.19755121335
include,included,3.2047452196
block,blocked,3.22180865929
correct,corrected,3.22730384427
measure,measured,3.26133977067
perfect,perfected,3.26305892811
spot,spotted,3.28270022225
express,expressed,3.28914491156
intend,intended,3.28978916467
sickle,sickled,3.30372608289
value,valued,3.31126364945
need,needled,3.3246106936
admit,admitted,3.33160997292
atta,attached,3.33667673472
fear,feared,3.34689120926
combine,combined,3.37016872269
impact,impacted,3.37242044721
sector,sectored,3.3747373223
balance,balanced,3.38905391951
disease,diseased,3.42109988061
reserve,reserved,3.43740519494
extract,extracted,3.4906265323
sele,selected,3.4974176175
form,formed,3.50777057023
weigh,weighted,3.53858663589
incorporate,incorporated,3.55451941468
transport,transported,3.56553379422
note,noted,3.57661066958
mani,manifested,3.61271261555
hand,handed,3.64062794222
receive,received,3.64166632163
branch,branched,3.64709679951
warrant,warranted,3.65027981703
prove,proved,3.69711064296
stop,stopped,3.69876250343
work,worked,3.70961539019
burn,burned,3.71312050979
switch,switched,3.7475529048
course,coursed,3.75332037282
pain,painted,3.76484748136
comprise,comprised,3.77035888734
assess,assessed,3.78894257231
group,grouped,3.83308033748
class,classed,3.84259518854
turn,turned,3.86522164648
comb,combined,3.87886636566
augment,augmented,3.88865212526
scar,scarred,3.89271872724
rais,raised,3.89504322965
water,watershed,3.99889411972
state,stated,4.02547649042
slope,sloped,4.04151504645
rate,rated,4.0453073507
surround,surrounded,4.05216306142
cross,crossed,4.07248870291
collect,collected,4.07470968082
transfer,transferred,4.08994474862
complicate,complicated,4.10297015249
bloc,blocked,4.11449234364
border,bordered,4.17863273691
needle,needled,4.19226177226
hand,handled,4.21539716894
disorder,disordered,4.22439216218
determine,determined,4.23823930986
space,spaced,4.28122504643
point,pointed,4.30005875401
structure,structured,4.30337434154
organ,organized,4.30973007785
condition,conditioned,4.32980933324
buckle,buckled,4.33177584846
design,designed,4.387290998
abstract,abstracted,4.42954489643
shape,shaped,4.43339090995
valve,valved,4.46224651139
spike,spiked,4.49691249163
enroll,enrolled,4.50585214027
mark,marked,4.56169384471
insert,inserted,4.60677678001
fragment,fragmented,4.61987331861
practice,practiced,4.63456194167
weight,weighted,4.63605477476
post,posted,4.63730400662
blur,blurred,4.64306966142
vault,vaulted,4.88748695581
sight,sighted,4.89458188097
assign,assigned,4.90489434702
tunnel,tunneled,5.03441033506
gene,generalized,5.05627217204
coll,collected,5.08711078426
surface,surfaced,5.09041663096
wall,walled,5.12829609317
curve,curved,5.13374960861
cent,centered,5.16326967231
angle,angled,5.46165661006
class,classified,5.79327712812
layer,layered,5.84158722615
graft,grafted,5.84862756794
wound,wounded,5.96452991339
mask,masked,6.02090979792
divide,divided,6.14191370136
rank,ranked,6.39496943076
lamina,laminated,6.81449989194
segment,segmented,6.86447436374
carr,carried,7.12184319429
stem,stemmed,7.3494938639

## group: bigrams
and,in,1.41125000519
and,the,1.52122338076
number,of,1.90606061553
of,the,2.02130147491
intraocular,pressure,2.21755019119
for,the,2.33463833384
that,the,2.34626699368
in,the,2.41014753984
this,study,2.41104753429
at,the,2.73598345977
on,the,2.9569120669
glaucoma,and,2.9680881295
with,the,3.02667567585
from,the,3.05953095277
to,the,3.08537700753
visual,acuity,3.10104061298
to,determine,3.1431152676
with,glaucoma,3.18589718196
in,glaucoma,3.21452151546
glaucoma,in,3.21452151546
of,glaucoma,3.27566582256
of,this,3.3511433553
to,evaluate,3.46385599967
the,study,3.48936460204
the,mean,3.4925391454
by,the,3.50385193342
treatment,of,3.59720900789
in,this,3.65775079599
associated,with,3.68685325229
use,of,3.69718555788
between,the,3.82047962157
visual,field,3.88134334952
effect,of,3.96958551632
there,was,4.10658235739
purpose,to,4.56499886894
ocular,hypertension,4.69965581284
anterior,chamber,5.02588472004
optic,disc,5.09762014643
the,optic,5.23359076928
the,anterior,5.28943296963
may,be,6.4350234814
to,be,6.80896218699
optic,nerve,7.55730603478

