## group: nn_vbd_vbn
fade,faded,1.33325583698
plague,plagued,1.56020392214
constrain,constrained,1.56859185371
traverse,traversed,1.58333194789
precondition,preconditioned,1.67750176724
fire,fired,1.87570920132
tackle,tackled,1.88934462367
silence,silenced,1.91943820266
bill,billed,1.9232567944
enforce,enforced,1.92600178103
decompose,decomposed,1.93162883777
bevel,beveled,1.94672092783
avert,averted,1.95079740695
restrain,restrained,1.97326015361
multinucleate,multinucleated,2.01761712644
lapse,lapsed,2.03818012483
hyper,hypertrophied,2.04123569141
convince,convinced,2.04947968136
articulate,articulated,2.17181792736
concert,concerted,2.19162204756
sort,sorted,2.26970073517
erode,eroded,2.33743600205
tune,tuned,2.44259064203
peel,peeled,2.48489073425
serra,serrated,2.50662262572
tint,tinted,2.59841665408
shea,sheathed,2.61536576296
buck,buckled,2.67850808097
finish,finished,2.68829824377
assure,assured,2.76583864018
conceal,concealed,2.77749066444
hyper,hyperpigmented,2.79475344723
digest,digested,2.81985858395
sequester,sequestered,2.91713630777
engage,engaged,2.95294093597
waste,wasted,3.03622854451
merit,merited,3.04244989323
acknowledge,acknowledged,3.09940638396
graduate,graduated,3.10366940694
polis,polished,3.15696072218
belt,belted,3.18149736449
defer,deferred,3.27646636046
forgot,forgotten,3.30490412634
saturate,saturated,3.37347298189
stream,streamlined,3.37913313901
book,booked,3.38392929605
retract,retracted,3.4788241493
watch,watched,3.48920572711
flank,flanked,3.50084510679
deform,deformed,3.5062772025
confound,confounded,3.51564427298
pick,picked,3.59151792505
inspire,inspired,3.63770775349
license,licensed,3.69628863199
title,titled,3.79438956393
gate,gated,3.81708942792
spark,sparked,3.85141466365
constrict,constricted,3.87956057791
partition,partitioned,3.92822765313
devote,devoted,4.0244821227
reform,reformed,4.10940299213
anchor,anchored,4.17959569636
disperse,dispersed,4.19974993224
afflict,afflicted,4.26455413192
frost,frosted,4.26976483102
handle,handled,4.28102161074
tape,tapered,4.30762649965
print,printed,4.32741452405
weigh,weighed,4.34287520117
trap,trapped,4.34652844495
taper,tapered,4.38948621273
arch,arched,4.39524002998
distort,distorted,4.41267218873
warm,warmed,4.44653307519
retard,retarded,4.65498287025
conjugate,conjugated,4.69035414839
threat,threaten,4.72274083973
seal,sealed,4.76976651932
educate,educated,4.7704754439
seed,seeded,4.77748797128
melt,melted,4.82300951395
trabecula,trabeculated,4.84152372362
suppose,supposed,5.00465429566
wish,wished,5.04680585643
coil,coiled,5.08019167891
interrupt,interrupted,5.12898768804
hydrate,hydrated,5.19219152775
degrade,degraded,5.25252342531
crow,crowded,5.50812205581
contract,contracted,5.53730447973
compress,compressed,5.57947861433
bond,bonded,5.58431437379
super,superimposed,5.59004424151
favor,favored,5.6008599872
plug,plugged,5.69052306699
wash,washed,5.76077991819
learn,learned,5.83928311054
ground,grounded,5.92564281177
notch,notched,6.05468663651
mail,mailed,6.11971418093
mirror,mirrored,6.18365776657
track,tracked,6.19375433704
compact,compacted,6.31156558915
shield,shielded,6.35759326801
coat,coated,6.35819144831
strip,stripped,6.47916689101
skill,skilled,6.48034218739
refine,refined,6.49224763862
illuminate,illuminated,6.52814693731
smoke,smoked,6.53262894168
dilute,diluted,6.73988997821
drain,drained,6.76493101743
accomplish,accomplished,6.83503351919
replicate,replicated,6.8622852023
precipitate,precipitated,6.89332290772
advise,advised,6.89551014586
sick,sickled,6.92882063855
bridge,bridged,6.98227891496
perforate,perforated,7.12784770276
reconstruct,reconstructed,7.26930350702
rotate,rotated,7.39116348103
concentrate,concentrated,7.52976702844
instruct,instructed,7.53291527042
striate,striated,7.59152238734
brand,branded,7.66074301848
guard,guarded,7.74997456021
hope,hoped,7.75271399566
intend,intended,7.80984129067
fuse,fused,7.90407010356
list,listed,7.95924597947
ciliate,ciliated,8.01228880899
travel,traveled,8.0755208218
mela,melamed,8.0839255592
puncture,punctured,8.09523606711
travel,travelled,8.17540032625
decide,decided,8.24846804398
seat,seated,8.3932982269
restrict,restricted,8.45427217117
handicap,handicapped,8.48358798418
detach,detached,8.56789285197
relieve,relieved,8.59298969099
outline,outlined,8.70380858734
accelerate,accelerated,8.76584920016
possess,possessed,8.77022067664
kind,kindred,9.07007807295
glue,glued,9.19054905766
cannula,cannulated,9.28483501699
adopt,adopted,9.30606381498
substitute,substituted,9.34021724749
oppose,opposed,9.35142803515
expand,expanded,9.57608856279
desire,desired,9.73746034958
reserve,reserved,9.73866447097
surround,surrounded,9.97359044609
permit,permitted,9.99367883375
myelin,myelinated,10.1322127264
predispose,predisposed,10.4606483049
mount,mounted,10.6578052677
bound,bounded,10.8177428703
scatter,scattered,10.8539446625
round,rounded,11.0092707928
perfect,perfected,11.1047627747
mani,manifested,11.478129063
rest,restrained,11.557604927
incorporate,incorporated,11.5620766668
trigger,triggered,11.6373594285
agree,agreed,11.6870986996
absorb,absorbed,11.7756423995
convert,converted,12.2204607445
coup,coupled,12.3675850308
plot,plotted,12.4483765843
sheath,sheathed,12.6248558244
turn,turned,12.6647539463
fold,folded,12.7318616413
augment,augmented,12.8423791986
couple,coupled,12.8885833442
price,priced,13.0926161764
buckle,buckled,13.2233888023
stop,stopped,13.697374293
discover,discovered,13.7634955896
load,loaded,13.8362267934
touch,touched,13.9165247422
fill,filled,13.9365361569
rest,restricted,14.0064904946
burn,burned,14.136039597
fear,feared,14.1462190287
check,checked,14.4928225057
suppress,suppressed,14.5495374634
dissect,dissected,14.6754371626
compose,composed,14.7161985158
switch,switched,14.7799559042
square,squared,14.8442223013
organ,organized,15.0698668375
transfer,transferred,15.3502774715
vault,vaulted,15.5990257364
inform,informed,15.6810723405
rupture,ruptured,15.6962864099
spike,spiked,15.7227887934
reverse,reversed,15.7711620227
warrant,warranted,15.8136355253
connect,connected,15.8331520631
admit,admitted,15.8341984413
extend,extended,15.9531321807
attach,attached,16.1320978448
weigh,weighted,16.3219701812
decline,declined,16.4356607084
cover,covered,16.5825151166
fragment,fragmented,16.5951680656
sight,sighted,16.7192080593
sickle,sickled,16.9168999001
employ,employed,16.9697653297
fashion,fashioned,17.1922882057
atta,attached,17.2425520205
cross,crossed,17.3702091086
feature,featured,17.8914440798
enlarge,enlarged,17.8923878247
branch,branched,17.9416137755
register,registered,18.0057840898
tunnel,tunneled,18.0865386901
return,returned,18.2824550357
forme,formed,18.3567174414
post,posted,18.8375519568
distinguish,distinguished,19.0916146891
prefer,preferred,19.0965401657
abstract,abstracted,19.0995066827
step,stepped,19.1753348309
crush,crushed,19.2187050089
genera,generalized,19.2283701686
author,authorized,19.2381333409
fall,fallen,19.3540927871
experiment,experimented,19.363954305
train,trained,19.4131150666
scar,scarred,19.5978838
face,faced,19.6033817245
band,banded,19.7653531509
regulate,regulated,20.1634662374
suspect,suspected,20.2644405346
insert,inserted,20.341729939
shape,shaped,20.5863926838
rank,ranked,20.9423147453
class,classed,21.0641406766
force,forced,21.4537680244
culture,cultured,21.4771984323
border,bordered,21.5814751675
state,stated,21.7835214487
stand,standardized,22.1443353442
form,formed,22.2042953974
needle,needled,22.2873061248
pattern,patterned,22.3204643035
reflect,reflected,22.4922252308
cluster,clustered,22.6024685252
plate,plated,22.6258373928
bloc,blocked,22.6327994805
part,partitioned,22.8522173568
complicate,complicated,22.905505379
sustain,sustained,23.3732476008
spot,spotted,23.4231513772
dilate,dilated,23.4578271685
derive,derived,23.6850546509
link,linked,23.7536497572
line,lined,23.8322937193
raise,raised,23.9764879283
wall,walled,24.1681452113
blur,blurred,24.2692011464
slope,sloped,24.3999148015
mark,marked,24.7201516887
rais,raised,24.7237577146
comprise,comprised,24.8892009628
diffuse,diffused,24.932740032
resolve,resolved,25.0763520152
balance,balanced,25.4010467855
screen,screened,25.6547913682
work,worked,25.6632204945
course,coursed,26.1118051242
extract,extracted,26.3845929577
structure,structured,26.4231562296
sector,sectored,26.4968487717
enhance,enhanced,26.5792471276
select,selected,26.582536416
point,pointed,26.6469228874
receive,received,26.6476035867
combine,combined,26.823184702
correct,corrected,26.8949914658
repeat,repeated,27.0301026329
confirm,confirmed,27.0963181348
color,colored,27.1588546436
comb,combined,27.2666963183
order,ordered,27.5025140776
peak,peaked,27.5472037757
grade,graded,27.5646728942
involve,involved,27.6075084769
transport,transported,27.6173011149
power,powered,27.707703502
target,targeted,27.747850049
condition,conditioned,28.1847890681
sele,selected,28.4231970324
standard,standardized,28.8283253184
size,sized,28.8622691093
produce,produced,28.9269639657
valve,valved,28.9719616837
note,noted,29.1526915065
center,centered,29.1955437821
disorder,disordered,29.2541771145
express,expressed,29.353806912
score,scored,29.6740106755
pair,paired,29.8850523056
position,positioned,29.9983121632
cent,centered,30.2280132154
time,timed,30.3443152347
need,needled,30.4521242149
scale,scaled,30.7661239511
wound,wounded,30.8716060194
value,valued,30.9065795437
layer,layered,31.2546767733
practice,practiced,31.2959346711
assign,assigned,31.6538638231
weight,weighted,32.0838013874
subject,subjected,32.3043863075
space,spaced,32.6750895675
disease,diseased,32.691742204
curve,curved,32.8872548337
stage,staged,33.1387623041
calculate,calculated,33.1693527282
mask,masked,33.3708714134
hand,handled,33.5809211082
water,watershed,33.8054681834
rate,rated,33.8516836922
blind,blinded,34.0251060942
graft,grafted,34.1847455113
hand,handed,34.3538005028
collect,collected,34.3549808645
elevate,elevated,34.4791725488
surface,surfaced,35.1896818101
stem,stemmed,35.2781956987
block,blocked,35.2804284903
provide,provided,35.6677737901
coll,collected,36.0648356136
lamina,laminated,36.5157938345
pain,painted,36.609542112
test,tested,37.1339161655
group,grouped,37.2354679299
impact,impacted,37.727087824
range,ranged,38.204826209
prove,proved,38.258179624
associate,associated,38.9903505181
measure,measured,39.4453654588
correlate,correlated,39.5703687128
enroll,enrolled,39.5788866626
gene,generalized,39.6998662959
show,shown,40.3591786179
reveal,revealed,42.5697624625
design,designed,43.3655628202
divide,divided,43.4364776318
base,based,44.6111406047
carr,carried,46.2640719263
include,included,46.2887121296
class,classified,46.8841354394
assess,assessed,47.1408310074
define,defined,54.3214306335
determine,determined,56.5320486536
segment,segmented,58.8754302295
angle,angled,60.9104961921

