## group: nn_nns
obstetric,obstetrics,0.999219440838
stick,sticks,1.24957972361
asset,assets,1.36877086784
leech,leeches,1.38109861911
scratch,scratches,1.45085828025
caliper,calipers,1.62818481566
stock,stocks,1.70942953998
sport,sports,1.71930411404
technic,technics,1.81831988363
onward,onwards,1.84945246167
surround,surroundings,1.8576222824
wage,wages,2.05192571326
proceed,proceeds,2.21305435289
chip,chips,2.26280709098
mechanic,mechanics,2.7517152263
blink,blinks,2.89929166874
clip,clips,3.06513999397
arch,arches,3.13886454458
outdoor,outdoors,3.13915277848
sander,sanders,3.49101092606
syringe,syringes,3.50345797859
pharmacodynamic,pharmacodynamics,3.55252321493
synapse,synapses,3.59509270315
backward,backwards,3.67008300477
button,buttons,3.7812277317
street,streets,4.04234515795
spectacle,spectacles,4.11994646522
quarter,quarters,4.24269005025
ground,grounds,4.25618522133
plastic,plastics,5.58861340986
hydrodynamic,hydrodynamics,5.76512850463
stay,stays,5.81037985698
harmonic,harmonics,5.91398898627
geriatric,geriatrics,6.27040495445
table,tables,6.40086061866
ellipse,ellipses,7.47674201324
link,links,7.62951080762
turn,turns,7.7746464838
gain,gains,7.83409013325
glass,glasses,7.84463749464
cone,cones,8.30833110408
base,bases,9.74636549562
session,sessions,10.2504348356
class,classes,10.4288728456
content,contents,10.4468268063
hemodynamic,hemodynamics,11.253478762
needle,needles,12.0169722649
biometric,biometrics,12.1258428839
size,sizes,12.3224413961
night,nights,12.3578491
work,works,12.727555226
phase,phases,12.8467529999
pediatric,pediatrics,12.93114703
remain,remains,13.1327414802
manner,manners,13.2651755995
effect,effects,13.311818576
morning,mornings,13.4047085312
scale,scales,13.5299062913
wound,wounds,14.6001298018
brain,brains,15.1859670438
color,colors,15.3193655103
diagnose,diagnoses,15.36658366
need,needs,15.9330233413
become,becomes,16.2726234188
damage,damages,16.5436084873
term,terms,17.6327546769
side,sides,18.8488707703
heart,hearts,18.9419552639
analyse,analyses,20.283129241
test,testes,20.4587385101
time,times,21.4012123876

## group: nn_vbg
stitch,stitching,0.961994240409
perturb,perturbing,0.972654080558
finish,finishing,0.977265506141
void,voiding,0.980453581438
unlock,unlocking,1.03919485539
afflict,afflicting,1.07564636148
ripe,ripening,1.08907013168
depress,depressing,1.10436310453
ladder,laddering,1.18434214585
farm,farming,1.18888390843
underpin,underpinning,1.19533906116
sweat,sweating,1.21449203336
unravel,unravelling,1.22174523439
sprout,sprouting,1.24903080283
unravel,unraveling,1.25860020557
shrink,shrinking,1.28191232551
lift,lifting,1.29412918834
weaken,weakening,1.33313913581
smart,smarting,1.38616825958
push,pushing,1.38993351313
reward,rewarding,1.41245170951
forget,forgetting,1.42425419484
scratch,scratching,1.46412090774
talk,talking,1.4857929234
interrupt,interrupting,1.49625929652
hunt,hunting,1.54339028212
multiply,multiplying,1.5544523759
knock,knocking,1.55791131175
discern,discerning,1.58062308763
tattoo,tattooing,1.67623467347
mold,molding,1.70671639316
shea,sheathing,1.70966663645
hatch,hatching,1.72813927032
comb,combing,1.73289721456
watch,watching,1.79654018847
flush,flushing,1.8126689481
strengthen,strengthening,1.81963858808
shadow,shadowing,1.82250441364
trap,trapping,1.82584469684
absorb,absorbing,1.83068021133
speak,speaking,1.83530614457
resist,resisting,1.88536736343
kill,killing,1.90331193407
seal,sealing,1.92677710749
spark,sparkling,1.93521622486
join,joining,1.94604705709
wick,wicking,1.95912782058
warn,warning,1.96133947663
appeal,appealing,2.01604277284
tailor,tailoring,2.03082021427
poison,poisoning,2.05310914412
satisfy,satisfying,2.07614381188
weigh,weighting,2.08894509164
book,booking,2.12898556371
govern,governing,2.13606580196
crack,cracking,2.15799054681
grasp,grasping,2.18971482286
cast,casting,2.23453368518
shea,shearing,2.23756460135
weigh,weighing,2.24230813645
pick,pickering,2.26657815309
float,floating,2.33093889035
wash,washing,2.35055792344
worry,worrying,2.35359291453
kiss,kissing,2.42120256042
retard,retarding,2.46207007732
club,clubbing,2.46738565836
disappear,disappearing,2.51191443856
disturb,disturbing,2.54594936843
char,charting,2.54917075919
feed,feeding,2.55504296618
wish,wishing,2.56274934433
mislead,misleading,2.5657167245
press,pressing,2.60043804142
creep,creeping,2.65131060337
partition,partitioning,2.66137151025
sustain,sustaining,2.74804199085
cool,cooling,2.76209132428
auto,autografting,2.77297815282
cree,creeping,2.79788365026
coat,coating,2.80019139978
dissect,dissecting,2.82103874099
alarm,alarming,2.84652078064
recur,recurring,2.90876747719
resp,respecting,2.9290227818
path,pathfinding,2.95100051342
justify,justifying,2.95501224261
distress,distressing,3.05394370647
taper,tapering,3.084197497
sick,sickling,3.18154633692
chin,ching,3.19087027294
mount,mounting,3.22928882084
plug,plugging,3.24621113788
tape,tapering,3.26453070297
proceed,proceeding,3.27366404184
consult,consulting,3.34245084976
counter,counteracting,3.34284393598
counteract,counteracting,3.39481344183
melt,melting,3.50961029947
neighbor,neighboring,3.57856981514
house,housekeeping,3.65235033457
genera,generating,3.77542217752
autograft,autografting,3.78248653896
shorten,shortening,3.84026789397
tail,tailoring,3.8504954495
halt,halting,3.87792547204
stiff,stiffening,3.89751736907
favor,favoring,3.90701180919
scaffold,scaffolding,3.96702639918
stiffen,stiffening,4.00148069664
walk,walking,4.00920195514
render,rendering,4.1223058584
travel,traveling,4.13532921879
hold,holding,4.16897301327
mark,marking,4.18185643547
convert,converting,4.253681021
agree,agreeing,4.25930811345
seek,seeking,4.35857694435
retain,retaining,4.36428683716
wear,wearing,4.4981266522
shield,shielding,4.62139905759
enter,entering,4.62829280207
deal,dealing,4.63498801706
drift,drifting,4.68081334567
notch,notching,4.75332767317
possess,possessing,4.78426103281
draw,drawing,4.78447333679
spread,spreading,4.94177451736
awake,awakening,5.06975726718
flank,flanking,5.26038879126
coup,coupling,5.26647113262
expand,expanding,5.288513736
match,matching,5.29272480152
think,thinking,5.34962115692
call,calling,5.40075009744
scatter,scattering,5.42935064863
nick,nicking,5.54877261483
persist,persisting,5.60654502821
stand,standing,5.64828773286
rais,raising,5.68066635471
arrest,arresting,5.73665669924
sheath,sheathing,5.76749155556
pertain,pertaining,5.77053845996
round,rounding,5.8971674348
conflict,conflicting,5.98250908326
exceed,exceeding,6.08188608697
demand,demanding,6.11487794784
wait,waiting,6.12108310349
list,listening,6.16733385715
peel,peeling,6.19082940829
feel,feeling,6.31706956489
look,looking,6.35358792986
break,breaking,6.8051676274
load,loading,6.93216655495
cover,covering,6.94524856499
cloud,clouding,6.99851643201
switch,switching,7.01703792844
shear,shearing,7.04599325844
fold,folding,7.20852592907
carry,carrying,7.28247783614
stop,stopping,7.34980001183
rest,resting,7.38708274298
miss,missing,7.6440240534
turn,turning,7.74206354527
yield,yielding,7.97129980366
invest,investigating,8.00477546317
threat,threatening,8.08126096809
start,starting,8.09138582027
extend,extending,8.17089723492
touch,touching,8.23746375775
carr,carrying,8.45472104236
plot,plotting,8.45778442844
fail,failing,8.48638594054
teach,teaching,8.57161957411
vault,vaulting,8.70136512782
comb,combining,8.80016447058
gain,gaining,8.92729449237
grow,growing,8.93774882709
deva,devastating,9.2404672828
consent,consenting,9.25014283121
wild,wilding,9.43218597979
yellow,yellowing,9.44739265518
tend,tending,9.50826834987
crush,crushing,9.62736972546
reach,reaching,9.91583116311
cross,crossing,10.0766930925
project,projecting,10.2223834435
transfer,transferring,10.2555477458
distinguish,distinguishing,10.3454226214
reflect,reflecting,10.3885921831
exam,examining,10.4054536058
foster,fostering,10.5913741203
strength,strengthening,10.6419912845
depend,depending,10.6646696921
confound,confounding,10.6875742128
worsen,worsening,10.7353643769
flash,flashing,10.7967910687
thick,thickening,10.8967672508
link,linking,10.9410479833
surround,surrounding,10.9660007095
smooth,smoothing,10.9836447326
fall,falling,11.005389937
tunnel,tunneling,11.0059441818
begin,beginning,11.0428252986
cluster,clustering,11.0783589518
suffer,suffering,11.1636330325
protect,protecting,11.2052643567
reveal,revealing,11.2246957177
delay,delaying,11.2378739258
scar,scarring,11.3396192864
flicker,flickering,11.3611132818
school,schooling,11.3893829949
ring,ringing,11.570949622
bloc,blocking,11.6045973936
shift,shifting,11.6323237378
exact,exacting,11.6550793999
correct,correcting,11.7114242573
strip,stripping,11.8753150064
concern,concerning,11.8861558874
compound,compounding,12.0790723629
count,counteracting,12.1186324179
tilt,tilting,12.4014660317
transform,transforming,12.4064849933
fill,filling,12.5335187767
spot,spotting,12.5535151684
step,stepping,12.6064255583
record,recording,12.8336622064
confirm,confirming,12.9243823032
reason,reasoning,12.9399443008
shunt,shunting,13.0465557518
alter,alternating,13.0581965544
mode,modeling,13.5006985283
thin,thinking,13.5352286015
explain,explaining,13.5778417988
correspond,corresponding,13.6385689881
search,searching,13.7921628068
limit,limiting,13.8065649838
form,forming,13.9055289051
interest,interesting,13.9579768221
chart,charting,14.0561083408
work,working,14.2258799899
help,helping,14.31900172
show,showing,14.3768075658
sleep,sleeping,14.3874990411
deep,deepening,14.4372406609
support,supporting,14.438495898
seem,seeming,14.4412800941
lamp,lamping,14.4921727197
stain,staining,14.7027369088
fast,fasting,14.7366667409
treat,treating,14.7707273357
peak,peaking,14.8335991326
pattern,patterning,14.8930404531
dark,darkening,14.8978694488
learn,learning,14.9789288883
weight,weighting,14.9830258902
transport,transporting,15.0134258714
part,partitioning,15.0984555976
result,resulting,15.1770177041
water,watering,15.2496848784
respect,respecting,15.394061146
head,heading,15.4246444091
heal,healing,15.6810816128
point,pointing,15.6949483822
design,designing,15.7088002978
regard,regarding,15.7626634549
filter,filtering,15.8275849833
test,testing,15.8639274497
affect,affecting,15.9955307699
understand,understanding,16.0147636867
tear,tearing,16.0534377228
stem,stemming,16.0932635779
screen,screening,16.2309918584
model,modeling,16.3074821245
color,coloring,16.3327908321
cent,centering,16.4367936351
center,centering,16.56116341
undergo,undergoing,16.5642863886
wound,wounding,16.7378538718
block,blocking,16.7841689273
suggest,suggesting,16.8275593967
assay,assaying,16.8584965676
approach,approaching,16.8752637722
thin,thinning,17.096441949
survey,surveying,17.0977077731
light,lighting,17.1947496841
graft,grafting,17.2690235828
actin,acting,17.4121747216
cost,costing,17.5547962451
need,needing,18.1744067829
visit,visiting,18.2758385488
drop,dropping,18.279607637
hand,handling,18.4374979609
flow,flowing,19.5487531241
gene,generating,20.1134171543
accord,according,20.1260453556
group,grouping,20.4733824285
lead,leading,21.0052013914
need,needling,22.050166906
found,founding,22.5805519618

## group: jj_jjr_jjs
young,younger,14.6891280545
high,highest,17.1588483364
small,smaller,17.2893614399
high,higher,17.8329160944
great,greater,20.2857089549

## group: nn_vbd_vbn
enforce,enforced,0.847112018109
hyper,hypertrophied,0.864393248973
multinucleate,multinucleated,0.892393795753
shea,sheathed,0.95280512314
fade,faded,0.971402001184
convince,convinced,1.0193677989
precondition,preconditioned,1.02915064633
restrain,restrained,1.04454066502
lapse,lapsed,1.0468754856
traverse,traversed,1.06261680955
concert,concerted,1.14577400807
bill,billed,1.14781613964
conceal,concealed,1.15505574783
buck,buckled,1.17362225654
bevel,beveled,1.17515393789
constrain,constrained,1.17585972377
articulate,articulated,1.1938072204
plague,plagued,1.21188060577
fire,fired,1.26885133047
avert,averted,1.27181677281
tune,tuned,1.27322769753
silence,silenced,1.32377512285
sort,sorted,1.39047508511
tackle,tackled,1.46430833157
forgot,forgotten,1.49538905725
peel,peeled,1.53470949455
erode,eroded,1.54122315662
graduate,graduated,1.55428600112
polis,polished,1.5607914103
watch,watched,1.57840270774
decompose,decomposed,1.58538681747
hyper,hyperpigmented,1.59698014824
finish,finished,1.62699305491
serra,serrated,1.64909654218
waste,wasted,1.68035311369
digest,digested,1.68133329105
sequester,sequestered,1.73908061357
engage,engaged,1.73963085633
title,titled,1.74836801429
acknowledge,acknowledged,1.80279508877
retract,retracted,1.82640547672
assure,assured,1.85634515329
saturate,saturated,1.91704816906
pick,picked,1.97285650643
book,booked,2.01388162034
belt,belted,2.03064748656
spark,sparked,2.03103213931
tint,tinted,2.05443558315
defer,deferred,2.06369267043
trap,trapped,2.0670688127
deform,deformed,2.13135194417
license,licensed,2.25857892234
flank,flanked,2.27899901376
gate,gated,2.30488502278
reform,reformed,2.38764894846
seal,sealed,2.42400512499
taper,tapered,2.4733831489
constrict,constricted,2.48894153875
coil,coiled,2.51347659818
inspire,inspired,2.54655728743
disperse,dispersed,2.5512365749
conjugate,conjugated,2.63435562278
tape,tapered,2.63778174
trabecula,trabeculated,2.64347622923
stream,streamlined,2.65845985836
merit,merited,2.66849435081
seed,seeded,2.6825790079
anchor,anchored,2.71954946754
afflict,afflicted,2.76244794448
devote,devoted,2.77860430141
print,printed,2.81111202516
contract,contracted,2.82885436508
degrade,degraded,2.84485373072
confound,confounded,2.8551702874
frost,frosted,2.92269209121
warm,warmed,2.94826299727
handle,handled,2.95912538841
notch,notched,2.98590291559
ciliate,ciliated,3.0628880244
weigh,weighed,3.10308240296
wish,wished,3.11242333551
hydrate,hydrated,3.13524782336
brand,branded,3.15660084905
bond,bonded,3.16090684253
compress,compressed,3.23496875568
crow,crowded,3.26015838736
smoke,smoked,3.29692847438
educate,educated,3.29972529185
arch,arched,3.31653760218
retard,retarded,3.41060634636
distort,distorted,3.46769790984
threat,threaten,3.50157579255
bridge,bridged,3.51911956656
dilute,diluted,3.53569932687
plug,plugged,3.58477342083
interrupt,interrupted,3.58934722523
ground,grounded,3.65189687794
super,superimposed,3.67046494875
partition,partitioned,3.68095397164
mirror,mirrored,3.70228146468
skill,skilled,3.70630922227
perforate,perforated,3.79023382694
striate,striated,3.8204546811
strip,stripped,3.82146355694
rotate,rotated,3.84341930672
illuminate,illuminated,3.85733898816
track,tracked,3.86260384445
mail,mailed,3.91167638685
coat,coated,3.94914829692
melt,melted,3.99914002776
sick,sickled,4.01574867244
compact,compacted,4.05568331106
suppose,supposed,4.08818886569
reconstruct,reconstructed,4.14165723753
travel,traveled,4.31803907542
favor,favored,4.36280175382
refine,refined,4.36978868354
travel,travelled,4.4385646239
wash,washed,4.44714811571
instruct,instructed,4.56783589758
concentrate,concentrated,4.64508397824
fuse,fused,4.68106638126
shield,shielded,4.68997541733
learn,learned,4.71734584556
advise,advised,4.77395194688
replicate,replicated,4.77612298659
puncture,punctured,4.89858605379
hope,hoped,4.91641604235
myelin,myelinated,5.09572584566
accomplish,accomplished,5.09641243115
accelerate,accelerated,5.16272161446
drain,drained,5.25501669844
decide,decided,5.33649609897
possess,possessed,5.37230225063
seat,seated,5.41290771967
detach,detached,5.42298344503
guard,guarded,5.5087519258
agree,agreed,5.60158265711
desire,desired,5.63915365095
round,rounded,5.65570291388
relieve,relieved,5.68838860522
precipitate,precipitated,5.71616218413
glue,glued,5.74255445288
cannula,cannulated,5.74489049458
scatter,scattered,5.75556559975
mela,melamed,5.83888437636
sheath,sheathed,5.89991378717
list,listed,5.93447802537
handicap,handicapped,6.03040315377
bound,bounded,6.12919811222
intend,intended,6.25564786105
mount,mounted,6.30339122514
outline,outlined,6.46629723609
restrict,restricted,6.55112630679
adopt,adopted,6.62691793049
expand,expanded,6.67545576128
substitute,substituted,6.67834504393
surround,surrounded,6.70581352655
kind,kindred,6.90388880292
permit,permitted,6.95487617412
fold,folded,7.02460158223
rest,restrained,7.20301806432
fill,filled,7.21266669785
oppose,opposed,7.33379772169
abstract,abstracted,7.40006932405
couple,coupled,7.43056140541
coup,coupled,7.47097454802
perfect,perfected,7.49424666234
predispose,predisposed,7.50448090966
fear,feared,7.55091454731
incorporate,incorporated,7.55180552638
price,priced,7.55865265558
absorb,absorbed,7.63297017894
burn,burned,7.81670857293
load,loaded,7.88494140362
convert,converted,7.97818740631
reserve,reserved,7.99807483184
buckle,buckled,8.05538770623
augment,augmented,8.07176558386
trigger,triggered,8.1692415204
rupture,ruptured,8.1694769235
dissect,dissected,8.17273010108
mani,manifested,8.19946610413
square,squared,8.23833324088
force,forced,8.29124257138
plot,plotted,8.40436985932
connect,connected,8.52873052497
suppress,suppressed,8.59103453992
weigh,weighted,8.60823667537
fragment,fragmented,8.75158066109
turn,turned,8.76666163991
touch,touched,8.77125295394
vault,vaulted,8.84882931536
enlarge,enlarged,8.97810064109
stop,stopped,9.08679672739
check,checked,9.09888107223
sickle,sickled,9.38129353052
extend,extended,9.42540353573
spike,spiked,9.42699121431
genera,generalized,9.47481411408
crush,crushed,9.49031767646
compose,composed,9.49922411953
experiment,experimented,9.54276626491
inform,informed,9.56253606239
warrant,warranted,9.73130123507
rest,restricted,9.73339139226
transfer,transferred,9.8474568876
admit,admitted,10.0628574588
register,registered,10.3943876646
branch,branched,10.4109751408
fall,fallen,10.5157489415
reverse,reversed,10.5888136008
rank,ranked,10.6677313994
plate,plated,10.6737453861
discover,discovered,10.692178531
band,banded,10.7073485989
face,faced,10.7513801189
attach,attached,10.8051595462
tunnel,tunneled,10.936660121
sight,sighted,10.9684635366
organ,organized,11.028577188
feature,featured,11.0521504244
cluster,clustered,11.0599095485
prefer,preferred,11.0770800084
train,trained,11.0873696486
distinguish,distinguished,11.1568734188
fashion,fashioned,11.1662008051
return,returned,11.2797027154
forme,formed,11.449104637
atta,attached,11.4777625768
stand,standardized,11.6156721853
bloc,blocked,11.6347750985
insert,inserted,11.644259685
employ,employed,11.6611958547
raise,raised,11.7704193796
switch,switched,11.7749806133
reflect,reflected,11.8826725298
cover,covered,11.9301378058
border,bordered,12.1042517338
scar,scarred,12.1503821247
cross,crossed,12.229790648
spot,spotted,12.234866143
decline,declined,12.2838358807
slope,sloped,12.2912879615
regulate,regulated,12.3944450431
comprise,comprised,12.4144234306
author,authorized,12.4413298933
class,classed,12.5380200858
suspect,suspected,12.5680817345
balance,balanced,12.5776255381
step,stepped,12.6187925732
sustain,sustained,12.6998490209
dilate,dilated,12.7620434392
repeat,repeated,12.7712172677
needle,needled,12.9262562861
shape,shaped,12.9614037065
blur,blurred,12.9926761325
culture,cultured,13.0291045546
state,stated,13.187210201
rais,raised,13.199062398
post,posted,13.4957568111
derive,derived,13.7564091014
transport,transported,13.8628133195
pair,paired,13.9925138362
resolve,resolved,14.0169622525
line,lined,14.3462241686
prove,proved,14.4088812142
sector,sectored,14.4139708572
diffuse,diffused,14.419090293
pattern,patterned,14.464290974
screen,screened,14.55389349
grade,graded,14.593913899
extract,extracted,14.5973464177
wall,walled,14.6388178943
work,worked,14.7934244124
peak,peaked,14.8238961409
target,targeted,14.8589609533
complicate,complicated,14.9122612758
part,partitioned,14.9198783235
enhance,enhanced,14.9615434449
position,positioned,14.9793408882
valve,valved,14.9809741783
mark,marked,15.1160419264
color,colored,15.1338717883
combine,combined,15.2475326238
water,watershed,15.5552787336
select,selected,15.6086553902
scale,scaled,15.6171974607
comb,combined,15.6286591634
standard,standardized,15.7098789763
structure,structured,15.730891897
score,scored,15.8471814499
produce,produced,15.8946776262
power,powered,16.0797846328
stem,stemmed,16.1411808764
course,coursed,16.1650524775
correct,corrected,16.2447625754
point,pointed,16.3114082606
sele,selected,16.374005233
form,formed,16.4036649488
involve,involved,16.4070585708
size,sized,16.5046735984
practice,practiced,16.5477909788
assign,assigned,16.5708628804
weight,weighted,16.5821224627
wound,wounded,16.6095248748
space,spaced,16.6678717424
value,valued,16.6850074003
center,centered,16.7325497554
link,linked,17.0471129791
disorder,disordered,17.1421313383
impact,impacted,17.1699173711
elevate,elevated,17.2211072576
express,expressed,17.2484835516
confirm,confirmed,17.2613225744
note,noted,17.28161888
collect,collected,17.3636909974
pain,painted,17.3983129607
curve,curved,17.4159538151
order,ordered,17.4484189343
blind,blinded,17.4741791906
surface,surfaced,17.5910880386
condition,conditioned,17.7305414677
layer,layered,17.7612790031
stage,staged,17.8412899176
receive,received,18.0524584111
hand,handed,18.171006608
subject,subjected,18.2064617854
mask,masked,18.2421150754
hand,handled,18.2785885016
coll,collected,18.339572619
reveal,revealed,18.3525680563
provide,provided,18.469118711
divide,divided,18.5379672715
block,blocked,18.5954621274
cent,centered,18.9570663252
segment,segmented,18.9641626687
correlate,correlated,19.1123336596
need,needled,19.198748824
calculate,calculated,19.3646873109
graft,grafted,19.4414024557
lamina,laminated,19.5908012464
range,ranged,19.6273397872
design,designed,19.7075276755
enroll,enrolled,19.7575079041
base,based,19.8056858741
time,timed,20.2312083256
carr,carried,20.3150431471
angle,angled,21.0540593007
test,tested,21.1143151722
rate,rated,21.2593771995
group,grouped,21.7039551126
show,shown,21.8350457989
disease,diseased,21.8929884956
include,included,21.9842965984
measure,measured,22.1153916508
gene,generalized,22.2658824506
define,defined,22.5939859112
assess,assessed,23.2898489102
class,classified,23.3842365861
associate,associated,24.9168119972
determine,determined,26.2023156048

## group: bigrams
of,the,11.6896141527
and,the,11.9978659172
in,the,13.5226184939
and,in,13.8153995736
for,the,16.2505165454
with,the,16.7308852956
of,glaucoma,17.4809581668
glaucoma,and,17.6382011323
in,glaucoma,18.0574831649
glaucoma,in,18.0574831649
to,the,18.1457369337
with,glaucoma,19.0029112012
on,the,19.3001134796
of,this,20.1183047679
that,the,20.3901067342
by,the,20.6073932928
from,the,20.7371804748
at,the,20.7373562806
in,this,21.7032202615
the,anterior,22.0197403154
the,optic,22.6035272964
use,of,22.8877652107
the,mean,23.1761609407
treatment,of,23.326442427
number,of,23.4084675233
the,study,23.8426486942
between,the,23.9021295393
effect,of,26.4206928938
intraocular,pressure,26.9770870195
anterior,chamber,27.6239431693
optic,disc,28.3392375191
this,study,28.3925129468
optic,nerve,28.4293167689
visual,field,28.8325987645
visual,acuity,29.0965198836
ocular,hypertension,30.8172898721
associated,with,31.0535782525
to,be,31.4311891318
to,determine,33.2286940363
there,was,33.5047637982
to,evaluate,34.569819939
may,be,37.120116143
purpose,to,37.2566154921

