## group: nn_nns
scratch,scratches,0.300109040283
surround,surroundings,0.516027146645
obstetric,obstetrics,0.628611563602
onward,onwards,0.711386498041
stick,sticks,0.760854993236
asset,assets,0.848158771681
sport,sports,0.863428136002
proceed,proceeds,0.947222883437
stock,stocks,1.09797745627
caliper,calipers,1.19921224779
technic,technics,1.25995685007
outdoor,outdoors,1.31509711888
blink,blinks,1.33509680692
leech,leeches,1.35330761691
wage,wages,1.50038867167
mechanic,mechanics,1.54512580849
hydrodynamic,hydrodynamics,1.55658718742
chip,chips,1.60632872843
arch,arches,1.68217620789
synapse,synapses,1.84153086234
button,buttons,1.89451744992
backward,backwards,2.06706743306
clip,clips,2.30697842236
ground,grounds,2.35565049938
spectacle,spectacles,2.42609299656
quarter,quarters,2.43002860856
pharmacodynamic,pharmacodynamics,2.44603179694
street,streets,2.93450276683
stay,stays,3.07987310423
sander,sanders,3.21284168149
syringe,syringes,3.23044896752
harmonic,harmonics,3.49449784042
table,tables,3.74696307013
phase,phases,3.76652009817
gain,gains,3.97348250744
plastic,plastics,3.97745823739
session,sessions,4.28855489289
hemodynamic,hemodynamics,4.38186313373
remain,remains,4.6012908061
class,classes,5.23536714178
link,links,5.2411386804
geriatric,geriatrics,5.46548993002
cone,cones,5.77798157086
size,sizes,6.00305237176
base,bases,6.07612490434
effect,effects,6.18910374885
ellipse,ellipses,6.27987855526
turn,turns,6.60294979015
content,contents,6.89607115082
scale,scales,6.94327579162
work,works,7.30937822797
night,nights,7.45732089311
need,needs,7.68844495347
glass,glasses,7.95143891938
term,terms,9.16529274181
diagnose,diagnoses,9.24294849489
manner,manners,9.74431559383
biometric,biometrics,9.86252034825
time,times,10.1617825576
become,becomes,10.291998616
color,colors,10.4707866206
pediatric,pediatrics,11.1855789344
needle,needles,11.2086687001
brain,brains,11.2851684456
damage,damages,11.2868003633
morning,mornings,11.3867688742
analyse,analyses,12.4937847473
wound,wounds,12.8735888861
heart,hearts,13.4121244895
test,testes,14.1572632104
side,sides,14.9052037305

