## group: nn_nns
asset,assets,1.47648492551
obstetric,obstetrics,1.69183974044
scratch,scratches,1.89514446555
stick,sticks,1.90324725275
leech,leeches,1.93677692716
onward,onwards,2.5902808737
surround,surroundings,2.67207316629
technic,technics,2.73129675006
stock,stocks,3.01434960913
proceed,proceeds,3.03282141944
sport,sports,3.35541942833
blink,blinks,3.37039329707
caliper,calipers,3.45020905338
pharmacodynamic,pharmacodynamics,3.85821730216
arch,arches,4.08173381822
chip,chips,4.31394471634
synapse,synapses,4.50142438529
hydrodynamic,hydrodynamics,4.86626990639
sander,sanders,4.9478744729
backward,backwards,5.14819936085
mechanic,mechanics,5.40657385613
outdoor,outdoors,5.80184111977
button,buttons,5.9898258295
ground,grounds,6.09327268172
wage,wages,6.36377628252
quarter,quarters,6.43131185409
syringe,syringes,6.70749730546
spectacle,spectacles,6.75813625057
clip,clips,7.08809898532
harmonic,harmonics,7.38214552013
stay,stays,7.81646856633
table,tables,8.03003347192
street,streets,9.03377691876
class,classes,9.14036138046
link,links,9.27850075433
gain,gains,9.64727090728
ellipse,ellipses,9.89932260825
hemodynamic,hemodynamics,9.93720585454
remain,remains,9.97255375149
turn,turns,10.3962474268
plastic,plastics,10.5687370754
session,sessions,10.6318330947
work,works,12.6927786662
become,becomes,12.7045510902
size,sizes,13.1085044456
base,bases,13.5043634769
geriatric,geriatrics,14.1276131607
glass,glasses,14.2659746943
cone,cones,14.2692991661
phase,phases,15.0615223936
need,needs,16.2003046354
effect,effects,16.9249646506
scale,scales,17.4466803599
wound,wounds,17.4491969426
needle,needles,17.6341636502
content,contents,17.9570889208
night,nights,18.8731483998
time,times,19.8761709262
manner,manners,20.176402876
biometric,biometrics,20.9702972324
diagnose,diagnoses,21.5083484896
damage,damages,22.5308032986
term,terms,23.2003354469
morning,mornings,23.2612969194
color,colors,23.7006525782
side,sides,25.6065114104
pediatric,pediatrics,27.3649126395
analyse,analyses,27.4045670217
test,testes,29.7720403345
brain,brains,32.3082424691
heart,hearts,32.4898722889

