## group: nn_vbd_vbn
fade,faded,0.316720237393
constrain,constrained,0.418157128772
precondition,preconditioned,0.462229138592
graduate,graduated,0.525263438245
convince,convinced,0.547961765184
enforce,enforced,0.549509686583
traverse,traversed,0.549857717264
hyper,hypertrophied,0.581836277618
decompose,decomposed,0.634979773603
avert,averted,0.661315291536
silence,silenced,0.68428777916
finish,finished,0.686211942204
bevel,beveled,0.693918684181
assure,assured,0.70317699454
conceal,concealed,0.716280176315
bill,billed,0.729693808811
erode,eroded,0.737062541791
peel,peeled,0.76606686828
acknowledge,acknowledged,0.766763364662
lapse,lapsed,0.766858538799
fire,fired,0.774033083459
digest,digested,0.788578093531
tackle,tackled,0.79689363659
engage,engaged,0.800546509984
deform,deformed,0.80417463316
multinucleate,multinucleated,0.810986767693
stream,streamlined,0.815856692811
restrain,restrained,0.822720995544
pick,picked,0.830618016349
buck,buckled,0.854757311504
concert,concerted,0.901125036178
sort,sorted,0.903015020842
tint,tinted,0.905692924058
confound,confounded,0.913064615968
plague,plagued,0.917354824349
articulate,articulated,0.926760770362
defer,deferred,0.943879404859
tune,tuned,0.949809422784
shea,sheathed,1.02964457295
sequester,sequestered,1.11967637903
waste,wasted,1.13363827699
watch,watched,1.13575696667
spark,sparked,1.18558528705
forgot,forgotten,1.21263339219
anchor,anchored,1.21599412818
license,licensed,1.24534402786
hyper,hyperpigmented,1.25413762647
print,printed,1.26243662078
contract,contracted,1.26573688783
retract,retracted,1.29096260015
seal,sealed,1.29924450124
title,titled,1.34194105188
taper,tapered,1.37663780642
arch,arched,1.37803360072
belt,belted,1.40468627808
weigh,weighed,1.41123539055
saturate,saturated,1.44628577253
handle,handled,1.45358267665
flank,flanked,1.47953723263
book,booked,1.4900912537
inspire,inspired,1.54010779682
merit,merited,1.54635092054
serra,serrated,1.55921642495
warm,warmed,1.56996060624
trabecula,trabeculated,1.61681101356
wish,wished,1.62018280119
gate,gated,1.65930607098
trap,trapped,1.65955104015
educate,educated,1.67147247734
degrade,degraded,1.68838943248
partition,partitioned,1.70728371171
tape,tapered,1.70778425333
constrict,constricted,1.72021556746
distort,distorted,1.7268041524
polis,polished,1.78083605016
suppose,supposed,1.80312416336
ground,grounded,1.83881221586
disperse,dispersed,1.8501423019
afflict,afflicted,1.86400694748
devote,devoted,1.87888432673
mail,mailed,1.88064358932
threat,threaten,1.92480111269
reform,reformed,1.94440513778
refine,refined,1.95273130035
striate,striated,1.95447141816
super,superimposed,1.95923608275
seed,seeded,1.99720677233
precipitate,precipitated,2.01303488571
retard,retarded,2.04570997157
track,tracked,2.07574984811
outline,outlined,2.09885345279
favor,favored,2.13468442259
frost,frosted,2.13636568236
coil,coiled,2.14047781225
compress,compressed,2.17131270602
decide,decided,2.17140089006
accelerate,accelerated,2.17835449933
coat,coated,2.20632806566
oppose,opposed,2.27925921902
melt,melted,2.28657099257
learn,learned,2.30068516497
advise,advised,2.32080282236
crow,crowded,2.3224631166
conjugate,conjugated,2.38011873346
strip,stripped,2.38878798769
smoke,smoked,2.40963351746
handicap,handicapped,2.43819687652
hydrate,hydrated,2.43825403215
skill,skilled,2.44648662663
relieve,relieved,2.50158414861
replicate,replicated,2.5685260006
notch,notched,2.59295264015
reconstruct,reconstructed,2.63189983671
interrupt,interrupted,2.68403122773
sick,sickled,2.76415504242
permit,permitted,2.80041973127
concentrate,concentrated,2.809189454
drain,drained,2.83964199306
bridge,bridged,2.91668817539
hope,hoped,2.92465949986
instruct,instructed,2.93020933114
wash,washed,2.94317117108
accomplish,accomplished,2.95428231547
travel,traveled,3.00764121818
restrict,restricted,3.06485467928
dilute,diluted,3.08140947385
plug,plugged,3.09680441081
travel,travelled,3.10453888526
perforate,perforated,3.11954366887
ciliate,ciliated,3.12746132119
mirror,mirrored,3.16572307052
illuminate,illuminated,3.17086169937
list,listed,3.22643043884
compact,compacted,3.26343892773
bond,bonded,3.28554368291
rotate,rotated,3.35174738331
scatter,scattered,3.5142936271
brand,branded,3.52321073308
expand,expanded,3.53734223737
trigger,triggered,3.53841090338
detach,detached,3.54731538933
shield,shielded,3.59866743335
convert,converted,3.63145896033
cover,covered,3.66519145393
puncture,punctured,3.71180975975
myelin,myelinated,3.76183384273
glue,glued,3.84559592113
extend,extended,3.94406108791
rest,restrained,4.02027099643
adopt,adopted,4.263967368
guard,guarded,4.27138503408
desire,desired,4.31401616419
agree,agreed,4.32596100797
cannula,cannulated,4.36221618301
intend,intended,4.37611650237
plot,plotted,4.37772956991
rest,restricted,4.46450031825
seat,seated,4.54510281472
possess,possessed,4.54688117412
fuse,fused,4.66444478368
round,rounded,4.68571852442
organ,organized,4.76770769965
employ,employed,4.83172002277
connect,connected,4.8665256019
mani,manifested,4.90706339495
substitute,substituted,4.94942442241
kind,kindred,5.0151857887
surround,surrounded,5.04972871587
incorporate,incorporated,5.06533888058
burn,burned,5.12368474634
suspect,suspected,5.15381352945
sickle,sickled,5.28397525091
mount,mounted,5.34789261649
range,ranged,5.37832584292
absorb,absorbed,5.3784190016
fear,feared,5.38202282045
force,forced,5.39774288926
warrant,warranted,5.47355735244
return,returned,5.48682164951
check,checked,5.49472925301
link,linked,5.51600639852
reserve,reserved,5.53954794131
perfect,perfected,5.78909677265
fold,folded,5.82951571214
predispose,predisposed,5.90816452561
stop,stopped,5.94719690726
fill,filled,5.94800537251
register,registered,5.95197156289
discover,discovered,5.96315532421
genera,generalized,5.9644848962
bound,bounded,6.00102692223
part,partitioned,6.01035425643
mela,melamed,6.0730545972
prefer,preferred,6.17138909056
load,loaded,6.29161091101
reflect,reflected,6.29540295576
coup,coupled,6.2986073886
sheath,sheathed,6.32550032429
couple,coupled,6.41532568658
turn,turned,6.44627185134
suppress,suppressed,6.64676634037
distinguish,distinguished,6.66720404791
state,stated,6.68830889787
buckle,buckled,6.76011620067
reverse,reversed,6.7606343681
decline,declined,6.76253357466
switch,switched,6.76418589809
culture,cultured,6.79729230652
feature,featured,6.82187676531
enlarge,enlarged,6.88325311265
transfer,transferred,6.92596178506
derive,derived,6.96797617853
fashion,fashioned,7.01259175334
spike,spiked,7.06724589504
fall,fallen,7.1539626473
experiment,experimented,7.17069183842
vault,vaulted,7.17186332405
compose,composed,7.2094606916
repeat,repeated,7.21200837777
augment,augmented,7.27408883822
inform,informed,7.29467376378
touch,touched,7.44655765781
price,priced,7.45871558654
rupture,ruptured,7.50680906804
course,coursed,7.73223833344
face,faced,7.9319412528
sight,sighted,7.98245367479
attach,attached,7.98291299595
calculate,calculated,8.02088453769
involve,involved,8.06374540198
order,ordered,8.16308808759
cross,crossed,8.18586955626
target,targeted,8.21346349085
square,squared,8.22925322258
admit,admitted,8.23922075488
weigh,weighted,8.24712514656
dissect,dissected,8.28536943034
hand,handled,8.36943152591
band,banded,8.42422672197
dilate,dilated,8.43192793425
confirm,confirmed,8.44452463156
receive,received,8.48546975738
author,authorized,8.515178772
size,sized,8.5476595013
forme,formed,8.64481382251
raise,raised,8.69674519369
atta,attached,8.74010812666
crush,crushed,8.74662894349
sustain,sustained,8.80247467552
surface,surfaced,8.80838790763
grade,graded,8.84210839823
produce,produced,8.85820501498
select,selected,8.89894904195
step,stepped,8.90999500189
stage,staged,8.99365647212
spot,spotted,9.00917178357
hand,handed,9.06601039337
regulate,regulated,9.11564681153
stand,standardized,9.11852935692
line,lined,9.19417425863
post,posted,9.28413550492
plate,plated,9.31968688465
abstract,abstracted,9.32830986592
form,formed,9.34307284341
fragment,fragmented,9.35437459339
power,powered,9.43774145616
cluster,clustered,9.46577970269
point,pointed,9.48327162462
standard,standardized,9.51776422574
shape,shaped,9.52513577658
correlate,correlated,9.53856774287
position,positioned,9.68273680911
provide,provided,9.79815428915
impact,impacted,9.80481466271
scar,scarred,9.84909165347
test,tested,10.0211838919
enhance,enhanced,10.0783940651
resolve,resolved,10.1104609001
base,based,10.1255521303
rank,ranked,10.2614715285
color,colored,10.2979933125
show,shown,10.3304352903
subject,subjected,10.3316476062
tunnel,tunneled,10.3352301202
work,worked,10.3427557144
class,classed,10.3700408856
prove,proved,10.4362983655
note,noted,10.4531013432
comprise,comprised,10.4542773076
weight,weighted,10.4585086775
border,bordered,10.46966813
train,trained,10.4816742831
value,valued,10.5334593727
rais,raised,10.5925610202
pattern,patterned,10.6399122353
correct,corrected,10.8486928329
insert,inserted,10.9415616166
define,defined,10.963296395
screen,screened,10.9688203843
peak,peaked,11.0043446128
blur,blurred,11.1790467263
branch,branched,11.2345939113
complicate,complicated,11.2527199613
combine,combined,11.2616874503
comb,combined,11.3901230281
sele,selected,11.451472479
pair,paired,11.5558897928
extract,extracted,11.6389124217
collect,collected,11.6822960683
rate,rated,11.873532876
slope,sloped,11.8828136721
bloc,blocked,11.8974422124
scale,scaled,11.897690013
reveal,revealed,11.9727249518
transport,transported,11.9902534781
valve,valved,12.0867903214
mark,marked,12.1313610169
express,expressed,12.1976858788
diffuse,diffused,12.2346412618
time,timed,12.2648526572
balance,balanced,12.2984226861
wall,walled,12.4035580193
needle,needled,12.4918384418
assess,assessed,12.5233071628
structure,structured,12.5330360386
score,scored,12.7032308664
space,spaced,12.7801529524
coll,collected,12.7846330939
carr,carried,12.8491287967
center,centered,13.0843686221
design,designed,13.2628057672
water,watershed,13.2741691563
elevate,elevated,13.3208850465
assign,assigned,13.4736717201
associate,associated,13.5450027176
condition,conditioned,13.5928574878
sector,sectored,13.6750850325
cent,centered,13.6843322737
practice,practiced,13.7525355448
measure,measured,13.7814498756
pain,painted,13.8375835094
determine,determined,14.1106658856
need,needled,14.6097630588
disease,diseased,14.8487377947
block,blocked,14.8591597235
group,grouped,15.1878192091
wound,wounded,15.3573715868
mask,masked,15.4234084889
layer,layered,15.475350589
disorder,disordered,15.5162796089
curve,curved,15.6156163257
divide,divided,15.9616900631
blind,blinded,15.9770873297
stem,stemmed,16.4779439656
graft,grafted,16.7188860497
enroll,enrolled,16.8994068578
segment,segmented,17.6201668374
include,included,18.2223357893
gene,generalized,19.4604883171
lamina,laminated,19.9857962923
class,classified,20.7594235648
angle,angled,22.9737334751

