## group: nn_nns
obstetric,obstetrics,0.81214968243
stick,sticks,0.98752544966
surround,surroundings,1.08904161251
scratch,scratches,1.15303745643
asset,assets,1.18245106785
onward,onwards,1.28019719048
leech,leeches,1.34414802853
stock,stocks,1.4479856455
caliper,calipers,1.69639648105
technic,technics,1.76217746768
sport,sports,1.77022490704
chip,chips,1.77893099092
blink,blinks,1.89272748992
proceed,proceeds,2.03577641009
mechanic,mechanics,2.06740983427
wage,wages,2.16375349938
arch,arches,2.43807748007
outdoor,outdoors,2.58118594244
synapse,synapses,2.6004597902
clip,clips,2.66454745781
pharmacodynamic,pharmacodynamics,3.10654422753
ground,grounds,3.29696070199
quarter,quarters,3.30547921963
backward,backwards,3.33340322831
sander,sanders,3.3604870821
button,buttons,3.4660790713
syringe,syringes,4.04903912407
hydrodynamic,hydrodynamics,4.20423759663
street,streets,4.25372578785
spectacle,spectacles,4.45677829001
stay,stays,4.92399561562
harmonic,harmonics,5.08752788921
plastic,plastics,5.56993876315
table,tables,6.04611838489
geriatric,geriatrics,6.40182859933
turn,turns,7.1090638405
gain,gains,7.28847992804
session,sessions,7.47086295259
ellipse,ellipses,7.98172109815
cone,cones,8.24643492444
class,classes,8.75332317183
link,links,9.05898278691
glass,glasses,9.06097654904
base,bases,9.40441292326
phase,phases,10.5979735049
content,contents,11.4748228244
size,sizes,12.1371492592
remain,remains,12.1642154045
hemodynamic,hemodynamics,12.1763634312
night,nights,12.7273519409
effect,effects,12.9425235863
work,works,13.1441530227
needle,needles,13.3294274387
manner,manners,13.5889502491
morning,mornings,14.0443871711
scale,scales,14.2745396086
pediatric,pediatrics,14.4203337355
biometric,biometrics,14.4685785004
color,colors,14.7972481998
need,needs,14.8065592505
diagnose,diagnoses,16.5448143888
damage,damages,17.1512602296
brain,brains,17.6748354782
wound,wounds,17.9615126409
become,becomes,18.4002355737
time,times,19.1755815011
term,terms,19.4319061033
heart,hearts,21.1769155968
analyse,analyses,21.5404855943
test,testes,23.1300339093
side,sides,26.111185713

## group: nn_vbg
finish,finishing,0.65876645157
unlock,unlocking,0.702759608143
stitch,stitching,0.736697551723
underpin,underpinning,0.743536026233
void,voiding,0.775465914946
perturb,perturbing,0.791590389179
depress,depressing,0.808336271344
unravel,unravelling,0.856277714003
lift,lifting,0.864990476347
ladder,laddering,0.878915441377
afflict,afflicting,0.919697500717
weaken,weakening,0.940380830619
sprout,sprouting,0.986581580472
sweat,sweating,0.995754794794
mold,molding,1.01777155394
shrink,shrinking,1.06177161552
scratch,scratching,1.10055462137
unravel,unraveling,1.1328208897
farm,farming,1.14952456538
push,pushing,1.17642551546
forget,forgetting,1.18873785997
knock,knocking,1.18913335302
discern,discerning,1.19589641245
interrupt,interrupting,1.20630499696
multiply,multiplying,1.21355675885
reward,rewarding,1.22823308511
join,joining,1.26179376781
talk,talking,1.29371042415
smart,smarting,1.29596561864
ripe,ripening,1.3194440264
watch,watching,1.32733826419
absorb,absorbing,1.43642442239
appeal,appealing,1.44163137158
strengthen,strengthening,1.44504228927
tattoo,tattooing,1.4550754783
kill,killing,1.45518590095
worry,worrying,1.46395042748
spark,sparkling,1.47049234864
shadow,shadowing,1.47062101216
shea,sheathing,1.48385305887
grasp,grasping,1.4862396464
hunt,hunting,1.52442539613
warn,warning,1.56494600042
resist,resisting,1.57911248085
flush,flushing,1.59942723542
tailor,tailoring,1.65277503282
pick,pickering,1.72366154613
satisfy,satisfying,1.7242981115
book,booking,1.73237595018
govern,governing,1.74284374944
disturb,disturbing,1.75206828187
seal,sealing,1.77858450124
trap,trapping,1.79197254485
weigh,weighing,1.79306345778
crack,cracking,1.8078695016
weigh,weighting,1.80805091086
wick,wicking,1.81526449596
cast,casting,1.81831675331
speak,speaking,1.83386929385
hatch,hatching,1.84411012065
wash,washing,1.86878056982
press,pressing,1.8917263924
feed,feeding,1.95623112066
float,floating,1.96242704965
comb,combing,2.00911561995
poison,poisoning,2.08384398161
cool,cooling,2.11045413916
retard,retarding,2.12951289021
sustain,sustaining,2.17730267582
mislead,misleading,2.18826092616
sick,sickling,2.22447735842
recur,recurring,2.2262179586
disappear,disappearing,2.22991915891
shea,shearing,2.31827448841
club,clubbing,2.318528581
alarm,alarming,2.32883506661
cree,creeping,2.36375581175
creep,creeping,2.3730116563
auto,autografting,2.38193940692
coat,coating,2.43868087899
wish,wishing,2.44878184369
consult,consulting,2.46190332448
counteract,counteracting,2.53237364986
kiss,kissing,2.55513119635
partition,partitioning,2.55716566939
proceed,proceeding,2.56504446123
taper,tapering,2.61507066546
dissect,dissecting,2.70773472632
justify,justifying,2.75131407439
mount,mounting,2.79007005105
path,pathfinding,2.88574243217
convert,converting,2.89659058793
chin,ching,2.94678378515
tape,tapering,2.96030734173
counter,counteracting,2.98408362412
enter,entering,3.06391501874
neighbor,neighboring,3.06421088345
resp,respecting,3.07074634636
char,charting,3.10005246793
distress,distressing,3.10382278305
favor,favoring,3.10599779218
melt,melting,3.20485452371
plug,plugging,3.23693345787
halt,halting,3.27795918694
render,rendering,3.2942708551
retain,retaining,3.35404165126
shorten,shortening,3.36115577206
wear,wearing,3.48319496807
autograft,autografting,3.48331322886
seek,seeking,3.50982775475
stiff,stiffening,3.67898217002
stiffen,stiffening,3.69583626829
walk,walking,3.7204359567
drift,drifting,3.77991425239
genera,generating,3.79813399612
travel,traveling,3.81545160395
hold,holding,3.8439674807
tail,tailoring,3.84522838711
deal,dealing,3.87247531189
house,housekeeping,3.87291333004
draw,drawing,4.03269029111
call,calling,4.08416564629
agree,agreeing,4.12377995481
mark,marking,4.15207555948
shield,shielding,4.23913005481
possess,possessing,4.35199979672
expand,expanding,4.39819424423
stand,standing,4.40053905166
awake,awakening,4.47301596271
match,matching,4.5436218608
notch,notching,4.60544923052
scatter,scattering,4.61445531297
scaffold,scaffolding,4.64706251271
persist,persisting,4.75379732479
think,thinking,4.76485293324
spread,spreading,4.8295392331
demand,demanding,4.97890479169
rais,raising,5.17241856154
feel,feeling,5.21527654245
conflict,conflicting,5.23738694657
exceed,exceeding,5.29112173153
coup,coupling,5.30801103824
arrest,arresting,5.42687525344
look,looking,5.4286114053
pertain,pertaining,5.42892040109
cover,covering,5.67270028824
sheath,sheathing,5.72756996068
wait,waiting,5.74370820443
flank,flanking,5.75397265341
break,breaking,5.8278841222
stop,stopping,5.84060078826
round,rounding,5.93131887057
nick,nicking,6.03988877001
load,loading,6.35162893322
start,starting,6.42230877191
list,listening,6.4343877177
miss,missing,6.70205765697
carry,carrying,6.70707382741
turn,turning,6.86423143002
fold,folding,6.91415626441
shear,shearing,6.98973225968
rest,resting,7.07561094518
fail,failing,7.08143417268
peel,peeling,7.18083325159
threat,threatening,7.20774572915
switch,switching,7.27932678421
cloud,clouding,7.37636867199
extend,extending,7.61986346331
touch,touching,7.76934326341
gain,gaining,8.01356974683
invest,investigating,8.20278563676
yield,yielding,8.35290592186
comb,combining,8.40674927227
carr,carrying,8.80071180848
wild,wilding,8.85127596452
deva,devastating,8.86712729734
scar,scarring,8.9262349832
consent,consenting,9.09813290432
teach,teaching,9.09933250521
grow,growing,9.17366180857
plot,plotting,9.27262142452
cross,crossing,9.4526794516
correct,correcting,9.59892341391
shift,shifting,9.64913133471
depend,depending,9.69181548
transfer,transferring,9.75618626012
reach,reaching,9.8657101225
exam,examining,9.90297918813
delay,delaying,9.9956891345
begin,beginning,10.0224009142
worsen,worsening,10.0445641051
distinguish,distinguishing,10.0645313438
vault,vaulting,10.1242225064
tend,tending,10.4367133319
concern,concerning,10.527994558
yellow,yellowing,10.7034983717
reason,reasoning,10.8432269972
confound,confounding,11.3176408806
crush,crushing,11.3628238965
surround,surrounding,11.7591111367
project,projecting,11.7964341044
link,linking,11.822704976
fall,falling,11.8766686997
strength,strengthening,11.9160611854
thick,thickening,11.9729942319
flicker,flickering,12.0124087927
tilt,tilting,12.0742983963
school,schooling,12.1862025352
exact,exacting,12.2934609451
tunnel,tunneling,12.4015180986
foster,fostering,12.4189358104
cluster,clustering,12.5126606601
record,recording,12.6087979195
protect,protecting,12.6659761871
smooth,smoothing,12.6695919171
step,stepping,12.7688899616
bloc,blocking,12.8533927357
flash,flashing,12.9291557674
count,counteracting,12.9433106951
confirm,confirming,13.0061065386
treat,treating,13.0278676901
reveal,revealing,13.0749460968
ring,ringing,13.2430349659
compound,compounding,13.3822701083
support,supporting,13.415570267
interest,interesting,13.5361789677
limit,limiting,13.5970628673
part,partitioning,13.6178132785
thin,thinking,13.6337515126
spot,spotting,13.7196559647
form,forming,13.7918714385
reflect,reflecting,13.8408336564
correspond,corresponding,13.8800710103
mode,modeling,13.9682617311
head,heading,14.0717410266
fill,filling,14.0813694691
suffer,suffering,14.2181463262
respect,respecting,14.2338600318
weight,weighting,14.3036108772
search,searching,14.3625728334
alter,alternating,14.4702299949
understand,understanding,14.5392116638
work,working,14.803901813
model,modeling,15.083527417
regard,regarding,15.2171069844
undergo,undergoing,15.4690785319
pattern,patterning,15.5124003711
strip,stripping,15.943784529
color,coloring,16.0177418211
learn,learning,16.2504014718
result,resulting,16.2871526386
point,pointing,16.3286281828
light,lighting,16.3395294501
seem,seeming,16.7032278859
test,testing,16.7243690655
explain,explaining,16.841649002
screen,screening,16.8660686495
show,showing,17.1085348935
chart,charting,17.1252720556
transform,transforming,17.1441448836
shunt,shunting,17.2445016804
lamp,lamping,17.3328676975
sleep,sleeping,17.4912324236
stain,staining,17.513795844
transport,transporting,17.5304566217
peak,peaking,17.5397768302
need,needing,17.588415732
tear,tearing,17.6179113985
approach,approaching,17.8857299777
water,watering,18.0193855366
dark,darkening,18.0978712132
fast,fasting,18.281194078
help,helping,18.3103378945
hand,handling,18.3176992224
thin,thinning,18.4511814193
deep,deepening,18.6178953618
heal,healing,18.9777323552
cent,centering,19.2489625036
actin,acting,19.2503293995
drop,dropping,19.3437317429
center,centering,19.6040393096
design,designing,19.6043944329
filter,filtering,19.6532431881
block,blocking,19.6625140864
affect,affecting,19.8238932713
suggest,suggesting,19.9243384297
visit,visiting,20.1291567952
survey,surveying,20.5790115248
wound,wounding,20.9318387294
graft,grafting,21.2045736211
cost,costing,21.2556462921
stem,stemming,21.5146810934
accord,according,21.6313841908
need,needling,21.8221914427
assay,assaying,22.5257020486
group,grouping,22.6813577461
gene,generating,23.499977616
found,founding,28.7870528588
lead,leading,29.2083328738
flow,flowing,29.2633719794

## group: jj_jjr_jjs
high,highest,14.8658067711
young,younger,15.1582950061
small,smaller,17.4284481408
high,higher,19.5690165033
great,greater,27.2344585918

## group: nn_vbd_vbn
convince,convinced,0.618154201567
fade,faded,0.705605937377
enforce,enforced,0.725623451616
precondition,preconditioned,0.78162948615
bevel,beveled,0.789782370176
avert,averted,0.79192132525
hyper,hypertrophied,0.795327390511
traverse,traversed,0.807332823869
multinucleate,multinucleated,0.96243091669
lapse,lapsed,0.974819417546
shea,sheathed,0.981658120046
conceal,concealed,0.992653611708
fire,fired,0.994213795273
restrain,restrained,1.00776590515
bill,billed,1.01088134562
sort,sorted,1.01481743655
articulate,articulated,1.02349684447
constrain,constrained,1.0525735963
decompose,decomposed,1.05547629829
silence,silenced,1.09535795206
tackle,tackled,1.10504358531
plague,plagued,1.12461778277
tune,tuned,1.14740325638
concert,concerted,1.16931547544
finish,finished,1.22995687768
waste,wasted,1.2515263262
buck,buckled,1.25430731665
sequester,sequestered,1.2590016203
erode,eroded,1.27138396758
peel,peeled,1.28941638226
graduate,graduated,1.30473012523
pick,picked,1.30576289649
digest,digested,1.31628449106
forgot,forgotten,1.33570149826
deform,deformed,1.36147024883
tint,tinted,1.36593463612
acknowledge,acknowledged,1.38516481662
engage,engaged,1.40703100149
spark,sparked,1.45060435144
serra,serrated,1.47456374776
hyper,hyperpigmented,1.4957502353
retract,retracted,1.51739152248
defer,deferred,1.58734351874
assure,assured,1.5920117512
stream,streamlined,1.6036930865
book,booked,1.65195004249
seal,sealed,1.75328824166
flank,flanked,1.77128815652
saturate,saturated,1.77604692905
watch,watched,1.78775677425
polis,polished,1.82340121532
belt,belted,1.85617328109
confound,confounded,1.8769807488
license,licensed,1.91825515143
inspire,inspired,1.97678837161
handle,handled,1.98599751627
merit,merited,2.0037502564
reform,reformed,2.04692460621
gate,gated,2.04789639356
trap,trapped,2.06087110436
title,titled,2.08739433179
print,printed,2.13174991928
arch,arched,2.14276331323
taper,tapered,2.15951409865
constrict,constricted,2.22076917819
coil,coiled,2.27392737154
devote,devoted,2.33472313209
anchor,anchored,2.33820436933
seed,seeded,2.34272124395
disperse,dispersed,2.34879236398
trabecula,trabeculated,2.40723925454
partition,partitioned,2.4245824687
degrade,degraded,2.4693227269
hydrate,hydrated,2.47536437966
frost,frosted,2.49761487332
warm,warmed,2.51791954286
tape,tapered,2.518976661
conjugate,conjugated,2.58628260525
wish,wished,2.6657304718
weigh,weighed,2.66854537685
contract,contracted,2.71286836136
afflict,afflicted,2.71940712556
retard,retarded,2.732883045
threat,threaten,2.74808520736
mail,mailed,2.79525151188
track,tracked,2.96830873708
distort,distorted,2.96939473799
compress,compressed,2.96942325932
educate,educated,2.9963806074
notch,notched,3.0039312784
crow,crowded,3.00695374484
ground,grounded,3.01836415353
super,superimposed,3.02145023197
smoke,smoked,3.11977724268
sick,sickled,3.15043002544
interrupt,interrupted,3.22137764551
melt,melted,3.24484478943
ciliate,ciliated,3.25198946042
bond,bonded,3.2600601492
strip,stripped,3.34192736601
skill,skilled,3.42588356402
suppose,supposed,3.50031589615
mirror,mirrored,3.53509463563
coat,coated,3.53536137475
wash,washed,3.55926586388
striate,striated,3.56465899419
plug,plugged,3.60883442889
illuminate,illuminated,3.62009717119
favor,favored,3.63027431102
dilute,diluted,3.68440825248
travel,traveled,3.72133534221
refine,refined,3.73380915382
perforate,perforated,3.73394706379
compact,compacted,3.86940330786
reconstruct,reconstructed,3.888095891
replicate,replicated,3.92630856535
travel,travelled,3.97086078337
advise,advised,3.98081023105
brand,branded,3.99652120173
rotate,rotated,4.07469414367
shield,shielded,4.08840954242
bridge,bridged,4.0997995504
learn,learned,4.15713371999
hope,hoped,4.16325446936
scatter,scattered,4.22548654057
accelerate,accelerated,4.36591580479
puncture,punctured,4.46038606941
concentrate,concentrated,4.46174124981
drain,drained,4.49253019599
precipitate,precipitated,4.61220415379
decide,decided,4.64760712893
accomplish,accomplished,4.67476163899
instruct,instructed,4.8461103215
list,listed,4.97786794168
expand,expanded,4.98687922233
detach,detached,4.99802471471
outline,outlined,5.15262525421
glue,glued,5.1752898435
guard,guarded,5.18772388501
myelin,myelinated,5.1969407063
possess,possessed,5.21953041338
relieve,relieved,5.23239261013
handicap,handicapped,5.25961898176
fuse,fused,5.27767881764
seat,seated,5.2905627207
desire,desired,5.30845147736
agree,agreed,5.48126329319
cannula,cannulated,5.59253375333
restrict,restricted,5.61224001355
round,rounded,5.61485336192
substitute,substituted,5.86107868086
kind,kindred,5.99626758619
surround,surrounded,6.06679448754
sheath,sheathed,6.10103759985
intend,intended,6.193528624
oppose,opposed,6.22841280322
adopt,adopted,6.37593297042
mela,melamed,6.52685364371
fold,folded,6.68987244674
bound,bounded,6.8141830262
rest,restrained,6.83479622981
permit,permitted,6.8508795418
mount,mounted,6.86951375613
fear,feared,6.92039300724
convert,converted,6.97261179987
perfect,perfected,6.98458598139
reserve,reserved,7.11156404479
incorporate,incorporated,7.44213431568
burn,burned,7.46023608889
absorb,absorbed,7.5060865188
couple,coupled,7.50983439384
coup,coupled,7.5739612426
fill,filled,7.64384665158
predispose,predisposed,7.74489264266
trigger,triggered,7.75796605636
extend,extended,7.89039790811
turn,turned,7.92697697156
mani,manifested,7.98769645909
plot,plotted,8.02936121969
augment,augmented,8.22914678212
buckle,buckled,8.23181465371
load,loaded,8.27014974427
stop,stopped,8.29527224865
check,checked,8.35217333
connect,connected,8.39726973853
price,priced,8.40385878033
force,forced,8.41157497161
rest,restricted,8.42493069833
touch,touched,8.71588172261
cover,covered,8.90307808251
suppress,suppressed,8.91141189221
enlarge,enlarged,9.01008160196
transfer,transferred,9.07342119793
organ,organized,9.1328132988
spike,spiked,9.27547160975
rupture,ruptured,9.37052329926
dissect,dissected,9.41733137618
abstract,abstracted,9.55398890985
square,squared,9.60021815974
fall,fallen,9.63622406062
weigh,weighted,9.64392934132
sickle,sickled,9.66779040359
compose,composed,9.70368652935
inform,informed,9.7714885476
suspect,suspected,9.86723013079
return,returned,9.91678461815
genera,generalized,10.2992604533
vault,vaulted,10.4052312974
experiment,experimented,10.4377836327
warrant,warranted,10.4455741718
feature,featured,10.5294517162
attach,attached,10.6019804835
band,banded,10.706926076
prefer,preferred,10.7430348895
admit,admitted,10.772299929
reverse,reversed,10.8326213568
discover,discovered,10.8541801217
sight,sighted,10.9596541269
decline,declined,10.963416886
fashion,fashioned,11.076367144
fragment,fragmented,11.1208640176
crush,crushed,11.1272489806
atta,attached,11.1468218516
culture,cultured,11.3162935857
register,registered,11.3493875382
switch,switched,11.4205073008
rank,ranked,11.5714382716
forme,formed,11.9111234549
cross,crossed,11.9681121989
dilate,dilated,12.2077085468
face,faced,12.2383987204
author,authorized,12.414613721
raise,raised,12.5089038232
tunnel,tunneled,12.5284061227
employ,employed,12.5825354943
step,stepped,12.7458698701
plate,plated,12.7531715815
regulate,regulated,12.7728088292
state,stated,12.7852225108
train,trained,12.8099442573
cluster,clustered,12.8137299639
branch,branched,12.8175551875
scar,scarred,12.838974387
line,lined,12.9467909891
stand,standardized,13.0264262519
insert,inserted,13.0317923367
distinguish,distinguished,13.0773213408
part,partitioned,13.1380738544
sustain,sustained,13.4659159934
shape,shaped,13.478426933
spot,spotted,13.4828138963
class,classed,13.5095597882
bloc,blocked,13.5746053474
border,bordered,13.656444117
post,posted,13.8088070467
repeat,repeated,14.0247068832
slope,sloped,14.0562195237
comprise,comprised,14.1684507094
color,colored,14.3588338313
reflect,reflected,14.3704131836
target,targeted,14.4015391144
blur,blurred,14.5882117828
balance,balanced,14.5931858099
rais,raised,14.6478761365
needle,needled,14.7001483479
pattern,patterned,15.0150035798
correct,corrected,15.2375361548
position,positioned,15.3898869138
structure,structured,15.488638306
diffuse,diffused,15.5361727702
work,worked,15.5368897487
comb,combined,15.5755201704
grade,graded,15.5817796678
form,formed,15.5886841585
derive,derived,15.5956539466
power,powered,15.604942276
combine,combined,15.7035781303
order,ordered,15.7937655554
mark,marked,15.8091131537
standard,standardized,15.9125478546
size,sized,15.9272154948
resolve,resolved,15.9442180133
screen,screened,15.9712047402
transport,transported,16.0377901767
value,valued,16.0395685927
complicate,complicated,16.1840280952
enhance,enhanced,16.2501555107
course,coursed,16.2513309602
weight,weighted,16.4571862012
point,pointed,16.4824718809
pair,paired,16.5446693436
sector,sectored,16.5837109245
link,linked,16.6118234549
peak,peaked,16.6204814271
select,selected,16.712600625
wall,walled,16.9473902212
layer,layered,17.2234448747
score,scored,17.2316939222
extract,extracted,17.2762086523
involve,involved,17.5524536499
center,centered,17.9358327651
scale,scaled,18.1629620796
water,watershed,18.2061371916
express,expressed,18.3942348642
valve,valved,18.4115414419
practice,practiced,18.4469402049
stage,staged,18.6868096829
hand,handed,18.6985077367
hand,handled,18.7005623598
confirm,confirmed,18.7351661671
sele,selected,18.8311817311
produce,produced,18.8597127518
rate,rated,19.1063223243
need,needled,19.1289819879
cent,centered,19.2854770605
space,spaced,19.3170944581
condition,conditioned,19.3668277844
time,timed,19.4500000359
receive,received,19.5073838177
surface,surfaced,19.6193558613
impact,impacted,19.8418365148
elevate,elevated,20.0315680119
blind,blinded,20.3489438884
note,noted,20.5664036837
wound,wounded,20.730764459
assign,assigned,20.7548572725
pain,painted,20.9059256417
disorder,disordered,20.9170206341
subject,subjected,21.0419741122
curve,curved,21.2786907145
mask,masked,21.3890862529
design,designed,21.6096605709
base,based,21.6253830741
stem,stemmed,21.7778002908
collect,collected,22.1570194336
calculate,calculated,22.2283871168
disease,diseased,22.5923568469
group,grouped,22.6293236836
block,blocked,22.7319776504
prove,proved,22.8382808674
range,ranged,23.1927012597
provide,provided,23.3841543667
coll,collected,23.5583451346
test,tested,24.0177934581
enroll,enrolled,24.0986076877
correlate,correlated,24.6692230322
measure,measured,24.7823108361
graft,grafted,24.8286862238
reveal,revealed,24.9167874131
divide,divided,25.3502348889
associate,associated,25.3991981776
gene,generalized,25.5747040192
lamina,laminated,26.3235298741
show,shown,27.2993918709
define,defined,27.5053963914
include,included,27.7779708867
assess,assessed,27.7818559689
carr,carried,27.9014607308
class,classified,28.9615545933
determine,determined,31.1172515381
segment,segmented,33.0076302794
angle,angled,34.4781240143

## group: bigrams
of,the,6.68444211961
and,the,9.94709373355
in,the,10.8518206611
and,in,11.1855541983
for,the,13.8094223112
with,the,14.776502724
of,glaucoma,15.9048717492
with,glaucoma,16.0599323259
to,the,16.2118227249
glaucoma,and,16.9884589193
in,glaucoma,17.5634254501
glaucoma,in,17.5634254501
by,the,18.7287116414
on,the,18.9203262623
of,this,18.9421129468
from,the,19.9763727597
that,the,20.7849836882
number,of,20.8616873141
in,this,20.8964964536
at,the,21.2111123442
treatment,of,21.3720965276
use,of,23.3629140308
the,mean,24.5239077428
between,the,24.9907643209
the,study,26.3110526065
associated,with,29.6398213548
this,study,31.069571975
effect,of,33.4224166034
the,anterior,36.9923542248
the,optic,38.1301778005
to,determine,38.7216352241
there,was,41.7331914728
to,be,42.6391838364
to,evaluate,43.2917586252
purpose,to,44.8631760476
intraocular,pressure,52.5694427694
ocular,hypertension,53.7374354652
visual,acuity,54.8874593592
visual,field,55.2866792503
optic,disc,57.8026170639
anterior,chamber,60.2702181523
may,be,60.8111499004
optic,nerve,66.0461801061

