## group: nn_vbd_vbn
fade,faded,1.76063782616
plague,plagued,1.90736267946
restrain,restrained,1.95618697359
decompose,decomposed,2.37870856718
convince,convinced,2.50263293417
tackle,tackled,2.5175511992
precondition,preconditioned,2.52224249448
fire,fired,2.52298384973
avert,averted,2.60051242651
lapse,lapsed,2.68800005123
constrain,constrained,2.69040383121
silence,silenced,2.72208101993
traverse,traversed,2.7331595135
bill,billed,2.77702608268
enforce,enforced,2.78402417086
articulate,articulated,2.88657719119
sort,sorted,2.89694471788
concert,concerted,2.91536191166
multinucleate,multinucleated,2.94326315478
erode,eroded,2.99861694965
hyper,hypertrophied,3.05065312928
bevel,beveled,3.10931314861
tune,tuned,3.27815526145
assure,assured,3.35265294532
peel,peeled,3.41974256983
shea,sheathed,3.42783229766
acknowledge,acknowledged,3.43420026363
finish,finished,3.67102085987
serra,serrated,3.88517688748
tint,tinted,3.93184582008
engage,engaged,3.98715159764
defer,deferred,4.0252856624
digest,digested,4.02640685142
confound,confounded,4.0408669721
polis,polished,4.05348666839
hyper,hyperpigmented,4.06485898748
sequester,sequestered,4.09391066492
waste,wasted,4.11000372137
merit,merited,4.17371919193
watch,watched,4.25294664809
buck,buckled,4.40101581972
belt,belted,4.46949803022
forgot,forgotten,4.4888446521
title,titled,4.50035473107
conceal,concealed,4.52810262669
flank,flanked,4.64974541274
deform,deformed,4.66332000764
stream,streamlined,4.68040276748
saturate,saturated,4.70896267548
constrict,constricted,4.72636823924
pick,picked,4.7976818082
partition,partitioned,4.8016128143
book,booked,4.82371140338
retract,retracted,4.86051351445
weigh,weighed,4.97474837614
inspire,inspired,5.06030599544
handle,handled,5.16743251787
license,licensed,5.18733096296
disperse,dispersed,5.22262520365
gate,gated,5.30545695441
graduate,graduated,5.3796811421
distort,distorted,5.41112811729
tape,tapered,5.59323129544
conjugate,conjugated,5.63919557232
reform,reformed,5.65445456315
afflict,afflicted,5.73534673736
arch,arched,5.74130972809
frost,frosted,5.7537596027
wish,wished,5.76584094551
devote,devoted,5.77354327722
warm,warmed,5.90031912137
taper,tapered,5.90256403046
suppose,supposed,5.90560984228
trap,trapped,5.90684322305
anchor,anchored,5.91445004843
retard,retarded,5.94446527527
seal,sealed,5.95764916999
print,printed,6.04010212997
coil,coiled,6.14324960991
interrupt,interrupted,6.23253709251
educate,educated,6.30186725967
melt,melted,6.33998490363
threat,threaten,6.36441740437
crow,crowded,6.4048182339
degrade,degraded,6.40724167532
spark,sparked,6.48518490744
super,superimposed,6.52152655178
seed,seeded,6.53287826435
trabecula,trabeculated,6.7247129367
bond,bonded,6.81672721092
hydrate,hydrated,7.08894558265
compress,compressed,7.2039660614
wash,washed,7.24077789114
mail,mailed,7.32623780412
mirror,mirrored,7.54894191234
favor,favored,7.56184140976
strip,stripped,7.57679703055
contract,contracted,7.59454837212
accomplish,accomplished,7.65211920584
learn,learned,7.78534020243
plug,plugged,7.79047778815
track,tracked,7.84994296518
bridge,bridged,7.90853803406
advise,advised,7.98188028391
precipitate,precipitated,8.01545503488
illuminate,illuminated,8.27871246186
dilute,diluted,8.33354958919
handicap,handicapped,8.37265376476
ground,grounded,8.44917931527
notch,notched,8.52196311196
refine,refined,8.55466844661
compact,compacted,8.5827470063
drain,drained,8.7313525265
coat,coated,8.83611085692
reconstruct,reconstructed,8.921517939
skill,skilled,9.04612802778
sick,sickled,9.05812362898
concentrate,concentrated,9.10279231499
hope,hoped,9.1145515453
perforate,perforated,9.13709798877
instruct,instructed,9.1403523864
intend,intended,9.1527622426
replicate,replicated,9.16703122553
mela,melamed,9.23061934819
decide,decided,9.25769700144
rotate,rotated,9.4136198697
shield,shielded,9.56971467405
fuse,fused,9.58931494438
guard,guarded,9.60130370133
oppose,opposed,9.68992993863
smoke,smoked,9.70471846226
striate,striated,9.83411448589
brand,branded,9.85158795368
relieve,relieved,9.95168492681
detach,detached,10.2610503255
seat,seated,10.4672573346
travel,traveled,10.4806169796
travel,travelled,10.59862846
restrict,restricted,10.5986782876
accelerate,accelerated,10.7294786826
list,listed,10.7694772098
substitute,substituted,11.0400273567
adopt,adopted,11.2031577352
puncture,punctured,11.2517424505
kind,kindred,11.2721595865
permit,permitted,11.5020639438
outline,outlined,11.5363932508
possess,possessed,11.5394481879
ciliate,ciliated,11.5410786848
surround,surrounded,11.7251158539
mount,mounted,11.7484937406
desire,desired,11.9094640469
reserve,reserved,11.9373898593
mani,manifested,12.0402623029
incorporate,incorporated,12.2941381583
expand,expanded,12.3632251054
cannula,cannulated,12.5262385688
perfect,perfected,12.6225335279
predispose,predisposed,13.0480058534
bound,bounded,13.0719511293
glue,glued,13.1683500452
scatter,scattered,13.1808723574
myelin,myelinated,13.6990211694
absorb,absorbed,13.7781830459
rest,restrained,14.2389737743
round,rounded,14.3326641146
agree,agreed,14.4202823316
convert,converted,15.2421204456
turn,turned,15.2885122861
coup,coupled,15.2987282483
trigger,triggered,15.3816032273
plot,plotted,15.848782934
fold,folded,15.8555941709
couple,coupled,15.9712175995
discover,discovered,16.0245381337
burn,burned,16.2601046039
load,loaded,16.4022016709
price,priced,16.5109041994
switch,switched,16.6273097709
touch,touched,16.8157808701
compose,composed,16.9167524423
buckle,buckled,16.9334334928
check,checked,16.9341109421
sheath,sheathed,17.0268828597
fill,filled,17.180232846
stop,stopped,17.4936371468
dissect,dissected,17.5597857778
rest,restricted,17.5728456426
suppress,suppressed,17.597511706
augment,augmented,17.8248208179
square,squared,17.8839216593
fragment,fragmented,17.9720785443
connect,connected,18.0733095467
admit,admitted,18.1800442087
sight,sighted,18.3826056303
extend,extended,18.4891758909
attach,attached,18.6131510141
fashion,fashioned,19.163052174
weigh,weighted,19.420909593
warrant,warranted,19.4209592728
employ,employed,19.4971819702
fear,feared,19.620059695
inform,informed,19.6672612388
decline,declined,19.6845458945
atta,attached,19.7961813914
reverse,reversed,19.8905367021
feature,featured,20.2049888969
rupture,ruptured,20.2232067771
cover,covered,20.2391102487
vault,vaulted,20.3491510222
distinguish,distinguished,20.4097329787
sickle,sickled,20.4615654801
organ,organized,20.5480221249
spike,spiked,20.5673809986
transfer,transferred,20.8003904342
branch,branched,20.9771332863
enlarge,enlarged,21.6088829521
regulate,regulated,21.6895878351
train,trained,22.0471550546
step,stepped,22.1533100875
scar,scarred,22.1857907274
return,returned,22.2606135837
tunnel,tunneled,22.3695076396
forme,formed,22.5375342845
genera,generalized,22.7518981973
cross,crossed,22.9079533011
insert,inserted,23.0589004998
abstract,abstracted,23.3937930906
suspect,suspected,23.7640696871
prefer,preferred,24.1700558353
crush,crushed,24.339335401
register,registered,24.3633426184
derive,derived,24.3967081236
post,posted,24.6375008652
fall,fallen,24.8031050178
face,faced,25.0220459636
author,authorized,25.1093459125
spot,spotted,25.2834710081
band,banded,25.4071211904
class,classed,25.4970924167
complicate,complicated,25.5208614452
experiment,experimented,25.5329889338
wall,walled,25.8402024205
border,bordered,25.8573713497
reflect,reflected,25.9181663201
state,stated,25.9610843204
shape,shaped,26.024880226
link,linked,26.483505818
pattern,patterned,26.5232720204
blur,blurred,26.5655868996
bloc,blocked,26.6470769581
part,partitioned,26.671271799
stand,standardized,26.8613033881
plate,plated,27.3852463297
force,forced,27.4143784149
form,formed,27.5663881758
needle,needled,27.6194158655
comprise,comprised,27.7830295105
resolve,resolved,27.8195106499
culture,cultured,28.1044496365
extract,extracted,28.3306225949
rank,ranked,28.4502604654
sustain,sustained,28.492404661
diffuse,diffused,28.5118028516
work,worked,28.5371518455
cluster,clustered,28.5959421067
dilate,dilated,28.6401207116
receive,received,28.8304925392
slope,sloped,28.9533163458
line,lined,28.9967111549
mark,marked,29.224292012
sector,sectored,29.3896450949
select,selected,29.4486377959
raise,raised,29.4491328908
point,pointed,29.5526947137
rais,raised,29.7121882456
course,coursed,29.8166158528
power,powered,30.0558196375
order,ordered,30.5698674425
balance,balanced,30.5707800087
screen,screened,31.0082566334
sele,selected,31.0183215868
condition,conditioned,31.1765979609
enhance,enhanced,31.4100317695
transport,transported,31.6671139597
comb,combined,31.7177933686
combine,combined,31.7224622541
need,needled,32.0327689225
involve,involved,32.1400555515
size,sized,32.2430538571
confirm,confirmed,32.5245032797
disorder,disordered,32.5540604247
target,targeted,32.928673604
note,noted,33.1992897233
standard,standardized,33.2061711338
valve,valved,33.3152037193
structure,structured,33.5216774932
value,valued,33.5654754602
time,timed,33.6337460096
position,positioned,33.8181399887
layer,layered,33.8907826646
grade,graded,34.1161404126
repeat,repeated,34.1601824861
center,centered,34.2672942571
correct,corrected,34.3105780483
express,expressed,34.4387118416
wound,wounded,34.5782039682
score,scored,34.5965416342
hand,handled,34.6780948878
color,colored,34.9699399258
graft,grafted,35.1592374088
assign,assigned,35.3595628091
hand,handed,35.4006078559
subject,subjected,35.7339013962
disease,diseased,35.801358569
space,spaced,35.8756218067
peak,peaked,36.1305052997
scale,scaled,36.1355399783
practice,practiced,36.3910215676
cent,centered,36.4994337401
produce,produced,36.5657558701
elevate,elevated,37.1219940124
pair,paired,37.4840647667
surface,surfaced,37.9549404117
lamina,laminated,38.4301158208
block,blocked,38.8324929538
rate,rated,39.097298463
collect,collected,39.0989120794
calculate,calculated,39.1049470599
stage,staged,39.4203589339
weight,weighted,39.4278928216
blind,blinded,39.4766178448
curve,curved,39.5718537939
stem,stemmed,39.7546025418
water,watershed,40.0732302074
test,tested,40.0853124451
associate,associated,40.3712521889
coll,collected,40.8019157947
pain,painted,40.9044609937
measure,measured,40.9945040669
impact,impacted,41.1371594828
mask,masked,42.039850575
group,grouped,42.5981801115
prove,proved,43.3460061361
enroll,enrolled,43.3467177808
correlate,correlated,44.037527835
gene,generalized,44.0446444351
provide,provided,44.2706285561
range,ranged,44.422906454
carr,carried,46.314405732
show,shown,47.8812431517
reveal,revealed,48.1985267917
base,based,49.8652610087
divide,divided,49.8958172196
include,included,51.7110534582
assess,assessed,53.8025167889
class,classified,54.1853503043
design,designed,55.9258860703
define,defined,62.8780398699
determine,determined,65.6408341219
segment,segmented,66.8734277637
angle,angled,69.9084548866

