## group: nn_nns
obstetric,obstetrics,1.18759023541
scratch,scratches,1.46827567212
surround,surroundings,1.50399773057
leech,leeches,1.59455023468
asset,assets,1.72877822102
stick,sticks,1.83249156405
technic,technics,2.14995564682
proceed,proceeds,2.30261906951
onward,onwards,2.55877515496
sport,sports,2.66392131681
pharmacodynamic,pharmacodynamics,2.69817558062
caliper,calipers,2.93877724074
chip,chips,2.93964687462
stock,stocks,2.99233438214
blink,blinks,3.22400366713
mechanic,mechanics,3.55943987943
hydrodynamic,hydrodynamics,3.75384963913
outdoor,outdoors,3.89664756239
sander,sanders,3.93552318138
arch,arches,4.04923268198
backward,backwards,4.26547767043
synapse,synapses,4.57046152081
session,sessions,4.75749568404
clip,clips,5.01734700483
wage,wages,5.06612167118
ground,grounds,5.19641302528
quarter,quarters,5.37441116299
button,buttons,5.44672232442
syringe,syringes,5.82276834078
class,classes,5.98735770508
spectacle,spectacles,6.07694777343
harmonic,harmonics,6.25177929901
stay,stays,6.39947104132
street,streets,6.54133126957
gain,gains,6.63815608144
table,tables,6.98787909976
hemodynamic,hemodynamics,7.43534993108
remain,remains,7.65214908404
link,links,8.25119241791
ellipse,ellipses,8.46696403275
size,sizes,8.60450254164
turn,turns,8.94797932551
become,becomes,9.58041742916
plastic,plastics,9.87505036313
time,times,10.3580031867
cone,cones,10.3766831727
effect,effects,10.5367825717
work,works,10.8921998404
content,contents,11.7558570104
base,bases,11.8246703039
geriatric,geriatrics,12.1910762325
phase,phases,12.4047981335
scale,scales,12.8571381254
needle,needles,14.1850290578
need,needs,14.6520686341
glass,glasses,15.0504980331
term,terms,15.0886447387
wound,wounds,15.554574834
damage,damages,17.0629608938
night,nights,17.4782866784
manner,manners,18.0352751085
pediatric,pediatrics,18.1178682204
analyse,analyses,18.5207605341
biometric,biometrics,19.7672637843
diagnose,diagnoses,19.8922663325
color,colors,20.0797561546
morning,mornings,20.2774879615
side,sides,20.4942007105
test,testes,21.6735150258
brain,brains,26.4556951439
heart,hearts,27.4356434276

