## group: bigrams
of,the,24.6102215293
and,the,26.1276129359
in,the,26.2290097209
and,in,29.0408315636
for,the,32.8567069499
of,glaucoma,32.8835689297
with,the,33.1470192099
glaucoma,and,35.5832040398
in,glaucoma,35.850304505
glaucoma,in,35.850304505
to,the,36.1566406438
with,glaucoma,37.4076247501
by,the,40.7172647367
at,the,42.3659241727
treatment,of,43.2161349759
use,of,43.2702345439
from,the,43.3066588718
that,the,43.6569902325
of,this,44.7252632449
in,this,45.9513931396
on,the,46.0675661351
number,of,47.8116661283
the,mean,49.7274198054
between,the,53.5251832942
effect,of,55.5683554149
the,study,56.240861786
associated,with,56.4705677028
the,anterior,62.9800561491
the,optic,63.638633687
there,was,69.2424918962
this,study,71.8311875627
to,be,73.1296892059
to,determine,74.4429309995
ocular,hypertension,76.0284912601
to,evaluate,77.7806292208
visual,field,85.2313180138
intraocular,pressure,89.2736111915
visual,acuity,91.2386047124
may,be,96.0443728684
purpose,to,96.5260085104
optic,disc,98.0279909284
anterior,chamber,105.461885685
optic,nerve,110.104667843

