## group: nn_vbd_vbn
smoke,smoked,0.0611649030266
order,ordered,0.0694633088229
require,required,0.0839209415372
agree,agreed,0.101866672301
increase,increased,0.103346299974
receive,received,0.130746102982
decide,decided,0.131041285431
state,stated,0.13114250347
stop,stopped,0.134188036679
form,formed,0.189561839419
check,checked,0.193155550094
provide,provided,0.19677952716
outline,outlined,0.198730087853
suspect,suspected,0.200689641539
return,returned,0.245966602919
repeat,repeated,0.254131978144
involve,involved,0.269984257385
inform,informed,0.276695480959
work,worked,0.296318775631
stage,staged,0.311995467692
extend,extended,0.315006883904
assess,assessed,0.319914968427
reveal,revealed,0.343303275402
note,noted,0.346882239156
determine,determined,0.484697715849
base,based,0.853985312657
confirm,confirmed,1.3004855712
include,included,1.42287524535

