## group: nn_nns
stick,sticks,1.54805373476
obstetric,obstetrics,1.6766886185
asset,assets,1.9251854521
scratch,scratches,1.92668121982
stock,stocks,2.39101886442
leech,leeches,2.47737898349
surround,surroundings,2.51390955449
proceed,proceeds,2.66436454164
caliper,calipers,2.79692829087
onward,onwards,2.84008377897
sport,sports,2.89565761558
blink,blinks,3.13343306534
wage,wages,3.24569809446
technic,technics,3.28794269626
chip,chips,3.91406658642
arch,arches,4.04517558061
mechanic,mechanics,4.24187488408
sander,sanders,4.48029881498
backward,backwards,4.60410980119
synapse,synapses,4.68919392976
outdoor,outdoors,4.90322304144
pharmacodynamic,pharmacodynamics,5.13447962842
clip,clips,5.20710554087
quarter,quarters,5.85236021335
button,buttons,5.99199101757
ground,grounds,6.09963262216
syringe,syringes,6.28744451159
street,streets,6.52165503248
hydrodynamic,hydrodynamics,7.36830808198
spectacle,spectacles,7.58502742294
harmonic,harmonics,7.58965270719
stay,stays,7.98273721818
plastic,plastics,9.05497329749
geriatric,geriatrics,10.2093348526
ellipse,ellipses,10.4569105704
table,tables,10.6359593011
turn,turns,11.3426852578
gain,gains,12.0359930828
glass,glasses,12.6971485549
link,links,13.5595967585
cone,cones,14.3140802808
base,bases,14.4149764872
class,classes,16.0091178816
session,sessions,16.2982204005
hemodynamic,hemodynamics,18.0345615503
content,contents,18.1089411653
needle,needles,19.7197755008
remain,remains,20.2009336171
size,sizes,20.5150998627
work,works,20.5536308692
manner,manners,21.0082057603
biometric,biometrics,21.1238175106
night,nights,21.1914151832
morning,mornings,21.312745646
phase,phases,21.5933544058
scale,scales,22.1435680054
pediatric,pediatrics,23.6701989007
diagnose,diagnoses,23.7687491103
color,colors,24.8489379533
wound,wounds,26.1366085525
effect,effects,26.1984165349
need,needs,27.2921535693
damage,damages,27.3444759008
brain,brains,28.3724031643
become,becomes,28.7961893468
test,testes,32.590063688
term,terms,32.6886466741
time,times,35.2030164432
analyse,analyses,35.980736153
side,sides,37.4773815758
heart,hearts,37.4896048344

## group: nn_vbg
unlock,unlocking,1.35586136458
stitch,stitching,1.37467485311
perturb,perturbing,1.39109765312
underpin,underpinning,1.41869665522
void,voiding,1.45329342185
depress,depressing,1.45563095272
ladder,laddering,1.55682599482
afflict,afflicting,1.64894289319
weaken,weakening,1.72632652941
finish,finishing,1.73969117975
unravel,unravelling,1.79841044609
shrink,shrinking,1.83145754367
sweat,sweating,1.89784320786
ripe,ripening,1.91768081778
farm,farming,1.94401194718
sprout,sprouting,1.97015927802
scratch,scratching,1.99354998974
forget,forgetting,1.99593968206
unravel,unraveling,2.09353710072
knock,knocking,2.09822862746
push,pushing,2.13741217929
lift,lifting,2.1496223855
interrupt,interrupting,2.20119184539
talk,talking,2.21694109105
smart,smarting,2.21712955927
reward,rewarding,2.25398412149
resist,resisting,2.27777113971
shea,sheathing,2.34163200252
absorb,absorbing,2.34779483268
mold,molding,2.38670221757
hunt,hunting,2.39345912649
join,joining,2.50889602902
discern,discerning,2.52433815766
strengthen,strengthening,2.61037277642
shadow,shadowing,2.62328801884
grasp,grasping,2.64523466792
kill,killing,2.68040578538
flush,flushing,2.6994883513
wick,wicking,2.70306271591
speak,speaking,2.72185703653
appeal,appealing,2.83183160552
warn,warning,2.88249444216
watch,watching,2.9160562577
tattoo,tattooing,2.94893310504
tailor,tailoring,2.95429037733
weigh,weighing,2.98496668585
comb,combing,2.99120698747
crack,cracking,2.99960334326
pick,pickering,3.00699694317
trap,trapping,3.04168381939
multiply,multiplying,3.10184902117
spark,sparkling,3.12038434432
poison,poisoning,3.12072083915
hatch,hatching,3.12600923117
satisfy,satisfying,3.1632725559
float,floating,3.17373476621
worry,worrying,3.17840796494
cast,casting,3.18988524297
book,booking,3.27159751637
shea,shearing,3.29773718313
weigh,weighting,3.33023881631
wish,wishing,3.33050235243
retard,retarding,3.37225280706
wash,washing,3.39956908824
kiss,kissing,3.42902610375
disturb,disturbing,3.4442537997
cree,creeping,3.49113325422
mislead,misleading,3.50426272216
govern,governing,3.52697378418
disappear,disappearing,3.66798165329
alarm,alarming,3.69623631191
feed,feeding,3.74009384152
partition,partitioning,3.79503601207
char,charting,3.82798541358
seal,sealing,3.8848156964
press,pressing,3.90611038497
taper,tapering,3.9274421029
creep,creeping,3.93365113048
recur,recurring,3.94410115479
justify,justifying,3.96263739255
sustain,sustaining,4.00054760088
auto,autografting,4.01758245517
mount,mounting,4.03285609249
tape,tapering,4.06004211054
cool,cooling,4.06625371763
consult,consulting,4.14329428077
club,clubbing,4.1928070951
counter,counteracting,4.20141292574
distress,distressing,4.21923645777
dissect,dissecting,4.26985673484
sick,sickling,4.32614558793
counteract,counteracting,4.40797321313
chin,ching,4.41642677577
path,pathfinding,4.55317631724
proceed,proceeding,4.58580536423
resp,respecting,4.67187899714
shorten,shortening,4.75776403564
convert,converting,4.89678949609
coat,coating,5.01270659241
retain,retaining,5.34413514909
neighbor,neighboring,5.34944299965
halt,halting,5.3563628103
autograft,autografting,5.41744340411
house,housekeeping,5.42493810411
favor,favoring,5.43407450417
plug,plugging,5.46540064344
genera,generating,5.58754015347
melt,melting,5.7127314861
drift,drifting,5.72778555382
render,rendering,5.77129633255
tail,tailoring,5.90726855146
hold,holding,6.03091506979
seek,seeking,6.1246693907
enter,entering,6.17485372094
shield,shielding,6.22846296458
travel,traveling,6.23273377988
draw,drawing,6.23617147033
mark,marking,6.36595076862
deal,dealing,6.38980419192
agree,agreeing,6.51761928019
call,calling,6.54242754627
awake,awakening,6.55009991986
stiffen,stiffening,6.6331375896
walk,walking,6.70098114382
stiff,stiffening,6.72088577772
possess,possessing,6.80346129421
flank,flanking,6.9370836882
expand,expanding,6.95198107325
wear,wearing,6.96051120859
pertain,pertaining,7.02859501341
persist,persisting,7.12254562619
scaffold,scaffolding,7.29486982543
notch,notching,7.38116096829
demand,demanding,7.47275998935
nick,nicking,7.49770206492
think,thinking,7.61418001755
coup,coupling,7.68568766592
spread,spreading,7.78490606017
feel,feeling,7.86359932663
rais,raising,7.91898860425
match,matching,8.01035003731
arrest,arresting,8.18740070334
conflict,conflicting,8.23659714799
stand,standing,8.318714594
break,breaking,8.46462269766
list,listening,8.69002549854
stop,stopping,8.87338009164
exceed,exceeding,9.03981707888
sheath,sheathing,9.10410954035
look,looking,9.12389550642
scatter,scattering,9.63577017651
wait,waiting,9.67683087422
round,rounding,9.67762904748
cover,covering,9.93878991499
peel,peeling,10.0232792133
threat,threatening,10.412670358
rest,resting,10.4315895754
carry,carrying,10.6959085601
turn,turning,10.7439816612
load,loading,10.7578988823
invest,investigating,10.7672933124
shear,shearing,10.785851326
cloud,clouding,10.855424013
extend,extending,11.10755094
yield,yielding,11.1535096277
fold,folding,11.1536073284
switch,switching,11.473599927
miss,missing,11.4808198691
touch,touching,11.6315243309
carr,carrying,11.8628395927
start,starting,12.2667097983
deva,devastating,12.3376636061
fail,failing,12.4354249664
gain,gaining,12.4461313049
teach,teaching,12.7941132517
wild,wilding,12.8065035412
grow,growing,12.8195835902
plot,plotting,12.9553044582
consent,consenting,13.7339278968
comb,combining,13.8401814996
vault,vaulting,13.9702092546
cross,crossing,14.0623413704
tend,tending,14.4184566138
distinguish,distinguishing,15.004192735
transfer,transferring,15.0146696087
worsen,worsening,15.051167389
yellow,yellowing,15.6071824929
reach,reaching,15.6214387507
confound,confounding,15.6748797362
exam,examining,15.8779321783
foster,fostering,16.0346118003
school,schooling,16.1284288489
surround,surrounding,16.1949723038
correct,correcting,16.293239967
delay,delaying,16.3047189098
begin,beginning,16.3566831361
strip,stripping,16.5388892605
crush,crushing,16.5564383163
tunnel,tunneling,16.8558454129
reveal,revealing,16.9436324261
strength,strengthening,17.068402904
project,projecting,17.1409795052
bloc,blocking,17.2727116231
shift,shifting,17.3118766931
flash,flashing,17.6303648583
reason,reasoning,17.8206064155
link,linking,18.0060985252
depend,depending,18.0638164665
smooth,smoothing,18.1381537292
fall,falling,18.2039708551
scar,scarring,18.2054432025
concern,concerning,18.3614263132
thick,thickening,18.5336721006
step,stepping,18.5489659859
protect,protecting,18.7813417035
flicker,flickering,18.9841956729
cluster,clustering,19.1426080918
reflect,reflecting,19.3577591395
ring,ringing,19.6287935969
exact,exacting,19.7145477503
thin,thinking,19.8219663607
record,recording,20.1771899355
alter,alternating,20.2428995816
spot,spotting,20.5201979676
compound,compounding,20.8965392799
fill,filling,21.2165840293
form,forming,21.2222062999
confirm,confirming,21.2996067332
correspond,corresponding,21.3749395354
count,counteracting,21.6437678157
limit,limiting,21.6568548217
tilt,tilting,21.8150269846
interest,interesting,21.9252197553
transform,transforming,22.4027214374
mode,modeling,22.4047990648
suffer,suffering,22.4505246759
respect,respecting,22.4925720208
work,working,22.7582690104
lamp,lamping,23.1731962826
pattern,patterning,23.5780264816
part,partitioning,23.5900856312
search,searching,23.6990430733
treat,treating,24.0397946297
explain,explaining,24.0467792504
undergo,undergoing,24.582025733
fast,fasting,24.6761377429
support,supporting,24.7810232412
shunt,shunting,24.8605792564
help,helping,24.9752909042
seem,seeming,25.1471682619
regard,regarding,25.1814648257
weight,weighting,25.3703288235
result,resulting,25.3815285411
chart,charting,25.4919687918
show,showing,25.7234753214
peak,peaking,25.7262984476
point,pointing,25.8126504779
transport,transporting,26.2566649874
learn,learning,26.5670447023
sleep,sleeping,26.700285271
model,modeling,26.7380850887
approach,approaching,26.9090935976
color,coloring,26.9528840943
head,heading,26.9660021193
light,lighting,27.0973233622
stain,staining,27.8225014286
actin,acting,27.9105159547
water,watering,27.9434929019
thin,thinning,27.9962048133
screen,screening,28.0280093005
understand,understanding,28.0981456927
cent,centering,28.1812651968
dark,darkening,28.1837646855
heal,healing,28.212164555
affect,affecting,28.2719850656
deep,deepening,28.3427192769
center,centering,28.7534538041
test,testing,28.8297010159
drop,dropping,29.0793866147
block,blocking,29.1341020544
tear,tearing,29.2389411489
wound,wounding,29.993805018
need,needing,30.0400744738
graft,grafting,30.2409751984
stem,stemming,30.3211055438
filter,filtering,30.8516065712
visit,visiting,30.9270440392
assay,assaying,31.4580207534
gene,generating,31.6019907093
cost,costing,31.723753199
survey,surveying,31.9829647458
group,grouping,33.4975953185
accord,according,34.1433372346
hand,handling,34.3747991493
suggest,suggesting,34.9078108996
need,needling,36.1809378989
design,designing,37.0492463995
found,founding,38.3298646882
lead,leading,39.3087144606
flow,flowing,39.8718469752

## group: jj_jjr_jjs
young,younger,27.2402360891
small,smaller,31.0001809188
high,highest,31.8830004673
high,higher,35.1032270586
great,greater,38.2129350337

## group: nn_vbd_vbn
fade,faded,1.27085836236
hyper,hypertrophied,1.44990049064
traverse,traversed,1.48851161747
precondition,preconditioned,1.49861837758
bevel,beveled,1.5288833488
plague,plagued,1.59520254686
enforce,enforced,1.59937974844
bill,billed,1.66973457612
fire,fired,1.6846036552
multinucleate,multinucleated,1.68790073657
avert,averted,1.70199899383
convince,convinced,1.76240639254
lapse,lapsed,1.76421628337
constrain,constrained,1.78054219204
articulate,articulated,1.79138959558
silence,silenced,1.87372814095
concert,concerted,1.93997736173
peel,peeled,1.98153193818
sort,sorted,2.02016428064
tackle,tackled,2.06149455755
decompose,decomposed,2.07569932515
shea,sheathed,2.11238141844
conceal,concealed,2.12992598958
tune,tuned,2.15795454855
restrain,restrained,2.18767963258
buck,buckled,2.19136873188
graduate,graduated,2.23535657126
serra,serrated,2.28799551349
erode,eroded,2.30172346312
digest,digested,2.39756754659
forgot,forgotten,2.44268545336
sequester,sequestered,2.48152890855
tint,tinted,2.51168447304
acknowledge,acknowledged,2.53713549499
finish,finished,2.55958086996
engage,engaged,2.57689508575
polis,polished,2.62931247514
hyper,hyperpigmented,2.63527740858
flank,flanked,2.64780587288
retract,retracted,2.68412176983
belt,belted,2.69834327139
pick,picked,2.70487515535
assure,assured,2.77645660889
waste,wasted,2.79212281721
watch,watched,2.91257483689
book,booked,2.95206018712
saturate,saturated,2.97674804648
deform,deformed,2.99002486987
merit,merited,3.0424545374
stream,streamlined,3.21727952443
confound,confounded,3.23128403962
inspire,inspired,3.28533151402
title,titled,3.29294542825
defer,deferred,3.32839268785
spark,sparked,3.32892951084
license,licensed,3.35049458762
gate,gated,3.41289987371
trap,trapped,3.42961621914
constrict,constricted,3.54315461683
seal,sealed,3.54342083592
disperse,dispersed,3.7276367321
devote,devoted,3.72948674887
reform,reformed,3.73344017261
trabecula,trabeculated,3.82635129333
partition,partitioned,3.85998748763
anchor,anchored,3.88227343197
arch,arched,3.90409125088
print,printed,3.9438605611
tape,tapered,3.96792046955
frost,frosted,3.97327213987
taper,tapered,4.00240172285
coil,coiled,4.05218337503
seed,seeded,4.10174079007
handle,handled,4.11196295353
warm,warmed,4.16507987268
retard,retarded,4.26490095533
degrade,degraded,4.30399511502
distort,distorted,4.31949153008
contract,contracted,4.32084702147
afflict,afflicted,4.33066363088
weigh,weighed,4.38637565513
mail,mailed,4.39078057267
hydrate,hydrated,4.39611593434
conjugate,conjugated,4.48000072181
educate,educated,4.53304971223
threat,threaten,4.67879245256
melt,melted,4.7343895408
compress,compressed,4.7430966939
crow,crowded,4.75518226466
wish,wished,4.78622083445
notch,notched,4.84177135749
bond,bonded,4.89198475531
mirror,mirrored,4.97729159799
plug,plugged,4.99332336922
interrupt,interrupted,5.06651964841
smoke,smoked,5.12993673627
strip,stripped,5.18736994817
ground,grounded,5.25111945998
skill,skilled,5.28514046099
super,superimposed,5.29673453036
suppose,supposed,5.37321463628
illuminate,illuminated,5.39812915874
favor,favored,5.49615146281
track,tracked,5.49979657221
compact,compacted,5.54944951535
ciliate,ciliated,5.66247412385
dilute,diluted,5.78281796637
wash,washed,5.78907483232
perforate,perforated,5.80256891264
sick,sickled,5.81547833251
travel,traveled,5.83622654339
striate,striated,5.84746196995
coat,coated,5.86262877594
bridge,bridged,5.88799502241
rotate,rotated,5.93105477933
learn,learned,5.95696806639
travel,travelled,6.13926611872
refine,refined,6.14624754408
brand,branded,6.20536556056
shield,shielded,6.29682539895
advise,advised,6.37909457906
concentrate,concentrated,6.51962799092
replicate,replicated,6.53669736133
instruct,instructed,6.65902582467
reconstruct,reconstructed,6.66527509087
drain,drained,6.69084908166
accomplish,accomplished,6.7276405284
puncture,punctured,6.73285526926
decide,decided,6.96916153012
seat,seated,7.14746430296
fuse,fused,7.289773885
hope,hoped,7.31826201154
precipitate,precipitated,7.5248216358
mela,melamed,7.64122917782
possess,possessed,7.66254085112
detach,detached,7.78602511025
accelerate,accelerated,7.91963732902
guard,guarded,7.93556812804
cannula,cannulated,8.01865435582
relieve,relieved,8.10012413195
outline,outlined,8.10060280895
glue,glued,8.15164392187
desire,desired,8.3381457512
restrict,restricted,8.35681039637
list,listed,8.45073311479
handicap,handicapped,8.54047732775
intend,intended,8.59082074057
substitute,substituted,8.62999008875
scatter,scattered,8.74610395107
expand,expanded,9.08515514324
myelin,myelinated,9.0991186819
reserve,reserved,9.20993613941
mount,mounted,9.2139715653
surround,surrounded,9.24000983935
kind,kindred,9.28639187597
permit,permitted,9.32849782299
round,rounded,9.39017456601
sheath,sheathed,9.44061228539
adopt,adopted,9.64764285175
bound,bounded,9.78878971772
agree,agreed,9.80744936545
coup,coupled,9.93043426938
couple,coupled,10.0992104784
oppose,opposed,10.1600699996
perfect,perfected,10.1923104516
rest,restrained,10.2090231187
predispose,predisposed,10.3561810358
absorb,absorbed,10.8236819046
augment,augmented,11.1068275106
incorporate,incorporated,11.1211150085
trigger,triggered,11.2060120355
mani,manifested,11.2649258909
fold,folded,11.2918978781
convert,converted,11.3215350146
fear,feared,11.4182403782
price,priced,11.6933420453
buckle,buckled,11.815761987
load,loaded,12.045372898
touch,touched,12.1170645648
fill,filled,12.1318970307
burn,burned,12.1662675014
dissect,dissected,12.2713510083
plot,plotted,12.3897911976
rest,restricted,12.573793891
turn,turned,12.5842528234
suppress,suppressed,12.7398900597
stop,stopped,12.8937896313
rupture,ruptured,12.971158899
compose,composed,13.2578183105
connect,connected,13.3108696411
square,squared,13.5458362503
transfer,transferred,13.7169810545
weigh,weighted,13.7358547726
check,checked,13.8257809743
fragment,fragmented,13.9379945022
vault,vaulted,14.1333788172
abstract,abstracted,14.2291557444
spike,spiked,14.2335960299
discover,discovered,14.2803653595
organ,organized,14.3102488986
inform,informed,14.6480186948
extend,extended,14.6484068102
switch,switched,14.7843967564
warrant,warranted,14.8821523638
attach,attached,15.038478738
admit,admitted,15.1173675388
enlarge,enlarged,15.1613715484
reverse,reversed,15.2431060129
experiment,experimented,15.5029379312
branch,branched,15.5926324779
genera,generalized,15.7721050415
atta,attached,15.8467314801
register,registered,15.9395075426
cover,covered,16.1061305913
sickle,sickled,16.2375316481
sight,sighted,16.3046041282
crush,crushed,16.3540204822
fashion,fashioned,16.3732712145
cross,crossed,16.3775696853
tunnel,tunneled,16.6233435747
fall,fallen,16.676177385
feature,featured,16.7815085445
forme,formed,16.8729088616
prefer,preferred,16.9201950744
decline,declined,16.9596359943
employ,employed,17.0138116335
band,banded,17.0442057431
rank,ranked,17.4108952978
train,trained,17.5813693438
insert,inserted,17.6653095282
author,authorized,17.8501450921
force,forced,17.8938540246
face,faced,17.9994167476
return,returned,18.3819017725
stand,standardized,18.5179187095
step,stepped,18.5242059168
bloc,blocked,18.6544090878
distinguish,distinguished,18.6599081979
plate,plated,18.7616456053
post,posted,18.8628886086
class,classed,19.1081054096
regulate,regulated,19.2883955515
border,bordered,19.3598847726
cluster,clustered,19.4084412744
state,stated,19.4180189253
scar,scarred,19.5402935881
suspect,suspected,20.1910426133
reflect,reflected,20.2031932389
dilate,dilated,20.2426961853
shape,shaped,20.2739746406
spot,spotted,20.3331236301
raise,raised,20.5411688191
needle,needled,20.7355864177
slope,sloped,21.1039986179
sustain,sustained,21.5092372484
rais,raised,21.6528880146
culture,cultured,21.7565079872
comprise,comprised,21.8674920476
balance,balanced,22.67604342
mark,marked,22.8335680797
screen,screened,22.8955928378
blur,blurred,22.945731285
pattern,patterned,23.1041039277
line,lined,23.1322280275
extract,extracted,23.1492084091
work,worked,23.164755784
form,formed,23.4161707276
part,partitioned,23.4396538405
sector,sectored,23.5465424281
diffuse,diffused,23.5740383532
derive,derived,23.7118142796
grade,graded,23.7278113387
complicate,complicated,23.7291478744
resolve,resolved,23.7913780177
link,linked,24.061278269
wall,walled,24.1711678079
repeat,repeated,24.2225496468
transport,transported,24.4503634696
combine,combined,24.9266010386
structure,structured,24.9981118402
enhance,enhanced,25.0000583725
color,colored,25.0714692268
comb,combined,25.222474297
power,powered,25.3245912911
peak,peaked,25.3756621545
select,selected,25.6768450918
correct,corrected,25.9440086619
point,pointed,26.225904966
target,targeted,26.2972016086
pair,paired,26.3873135374
confirm,confirmed,26.4072906117
condition,conditioned,26.7816397561
size,sized,26.7906330125
order,ordered,26.8396430858
disorder,disordered,26.9166912394
involve,involved,26.9388528138
score,scored,26.9550773916
scale,scaled,27.1470012781
value,valued,27.1754500508
sele,selected,27.2456654901
valve,valved,27.3002176889
position,positioned,27.383475941
express,expressed,27.5550744234
course,coursed,27.5886471924
produce,produced,27.6568529657
note,noted,28.1290540378
weight,weighted,28.1320786019
water,watershed,28.1805265201
center,centered,28.2361916362
receive,received,28.3675625482
assign,assigned,28.3704527123
standard,standardized,29.3515690097
wound,wounded,29.4925303521
stage,staged,29.5255376755
subject,subjected,29.5473269695
space,spaced,29.7056000905
layer,layered,30.1761703011
elevate,elevated,30.3785581409
cent,centered,30.3998108765
practice,practiced,30.4698835687
stem,stemmed,30.6094217663
blind,blinded,30.8774905253
collect,collected,30.9414081245
curve,curved,30.9536819205
calculate,calculated,30.9659025889
mask,masked,31.3866240663
need,needled,31.5768919956
prove,proved,31.7958179959
block,blocked,31.926106757
provide,provided,32.1992763557
impact,impacted,32.3983376274
pain,painted,32.6170807875
time,timed,32.6958941212
graft,grafted,32.7952002807
coll,collected,32.8808754166
hand,handled,33.3159684057
hand,handed,33.7635259486
surface,surfaced,34.1040083356
group,grouped,34.4850415685
correlate,correlated,34.5307055344
rate,rated,34.7034010787
lamina,laminated,35.0393670656
test,tested,35.3206799479
disease,diseased,35.3233411261
enroll,enrolled,35.4010961909
range,ranged,35.8615401321
reveal,revealed,35.9108900261
divide,divided,36.506156232
gene,generalized,36.5134159912
base,based,37.1460088971
measure,measured,37.5804626982
show,shown,37.6622714207
associate,associated,38.0319415795
carr,carried,39.7087859806
design,designed,40.3957095693
include,included,40.5976235289
class,classified,40.9712879551
assess,assessed,41.3283491978
segment,segmented,42.3234909564
angle,angled,43.0097113708
define,defined,43.6313305502
determine,determined,48.3429437985

## group: bigrams
of,the,17.7040322516
and,the,18.4214190673
in,the,20.4046327951
and,in,21.8946258746
for,the,24.8269696193
with,the,26.7430252114
of,glaucoma,27.7138844565
to,the,28.9198053515
glaucoma,and,28.9264598256
in,glaucoma,29.4298061254
glaucoma,in,29.4298061254
with,glaucoma,29.9688896799
by,the,31.9511730098
from,the,34.3769593338
that,the,34.3834764924
at,the,34.8198084618
treatment,of,35.0411623571
of,this,35.2096035839
use,of,35.3570338848
on,the,35.8267640614
in,this,36.6941973821
number,of,38.4423105935
the,mean,39.1578454847
between,the,42.6473629128
effect,of,45.2984068579
the,study,45.3058751742
the,anterior,46.2405910809
the,optic,47.0770355426
associated,with,48.534961497
there,was,57.0499352633
to,be,58.5243801916
this,study,59.0174652209
to,determine,60.0128855373
to,evaluate,62.5361669491
ocular,hypertension,63.8394204877
visual,field,67.2681041289
intraocular,pressure,68.4159491937
visual,acuity,69.1676184071
optic,disc,69.2268979316
may,be,75.1469750833
purpose,to,75.6861905926
anterior,chamber,76.1462615017
optic,nerve,76.9996757644

