## group: nn_nns
stick,sticks,1.03634934567
leech,leeches,1.15272124431
asset,assets,1.19796723555
obstetric,obstetrics,1.26967341253
caliper,calipers,1.35530695964
scratch,scratches,1.39006726501
wage,wages,1.53111060823
stock,stocks,1.55604653167
onward,onwards,1.6027087976
sport,sports,1.66178518477
proceed,proceeds,1.70790082933
technic,technics,1.76958967178
surround,surroundings,1.9070550244
arch,arches,2.16211730328
outdoor,outdoors,2.2153987212
syringe,syringes,2.29136853142
mechanic,mechanics,2.35393027778
chip,chips,2.3663626106
clip,clips,2.3903449839
button,buttons,2.70425710153
blink,blinks,2.71430448689
sander,sanders,2.71812180406
synapse,synapses,2.81409414297
backward,backwards,2.85348672602
pharmacodynamic,pharmacodynamics,2.92634846426
stay,stays,2.95483977608
street,streets,3.06964765485
spectacle,spectacles,3.21122447506
ground,grounds,3.3297146999
quarter,quarters,3.60032747054
hydrodynamic,hydrodynamics,3.67539542231
table,tables,3.75125618953
link,links,3.82311371844
harmonic,harmonics,4.05850341539
plastic,plastics,4.05940420844
geriatric,geriatrics,4.66507134278
gain,gains,4.90572920136
ellipse,ellipses,4.91813210339
session,sessions,5.29043411483
content,contents,5.30483949687
size,sizes,5.33387896463
turn,turns,5.34520414861
class,classes,5.37474882891
hemodynamic,hemodynamics,5.55595742168
effect,effects,5.56305682374
glass,glasses,5.58609428756
damage,damages,5.67905320944
cone,cones,5.85454904086
needle,needles,6.06740387293
phase,phases,6.19974386898
work,works,6.28203116323
pediatric,pediatrics,6.28350067277
base,bases,6.36575463881
manner,manners,6.37962999074
night,nights,6.39387417014
remain,remains,6.44135030522
scale,scales,6.5339871097
biometric,biometrics,6.67481429723
brain,brains,7.0091256568
morning,mornings,7.26702066828
need,needs,7.46907010356
diagnose,diagnoses,7.60249572733
wound,wounds,7.60485118474
color,colors,7.74918048961
become,becomes,7.95922569328
term,terms,8.6783245168
analyse,analyses,8.95400065419
side,sides,8.97731857313
heart,hearts,9.10827448141
test,testes,9.69282221541
time,times,9.74945909072

## group: nn_vbg
stitch,stitching,0.859442189328
finish,finishing,0.865310969371
depress,depressing,0.872026175874
unlock,unlocking,0.915815146233
underpin,underpinning,0.93370641322
ripe,ripening,0.955311674484
ladder,laddering,0.991747284308
multiply,multiplying,0.992865036879
afflict,afflicting,1.00431777167
void,voiding,1.07178345496
perturb,perturbing,1.07938878148
smart,smarting,1.13984460512
lift,lifting,1.14582783912
sweat,sweating,1.17279281967
unravel,unraveling,1.1873686416
farm,farming,1.18968088446
shrink,shrinking,1.21497784465
hatch,hatching,1.23565904477
tattoo,tattooing,1.25700980503
weaken,weakening,1.29785958628
push,pushing,1.31104677769
interrupt,interrupting,1.31810524039
hunt,hunting,1.32951158543
unravel,unravelling,1.33762374513
forget,forgetting,1.33889931605
watch,watching,1.3745041509
absorb,absorbing,1.42123478012
reward,rewarding,1.43060577821
mold,molding,1.46559061296
talk,talking,1.48652202362
sprout,sprouting,1.53682824748
scratch,scratching,1.55170593484
trap,trapping,1.56386382937
weigh,weighing,1.5793850595
knock,knocking,1.58000542637
comb,combing,1.58600639916
shea,sheathing,1.59663980337
resist,resisting,1.60962306259
book,booking,1.61063264905
flush,flushing,1.6405713381
kill,killing,1.6874449538
poison,poisoning,1.71210052502
discern,discerning,1.72332824228
shea,shearing,1.78084468009
govern,governing,1.79096835181
worry,worrying,1.87677753739
shadow,shadowing,1.89096762888
warn,warning,1.89127692446
strengthen,strengthening,1.89283416755
wick,wicking,1.90887509136
crack,cracking,1.91605071623
tailor,tailoring,1.91952510786
cast,casting,1.92133481279
join,joining,1.98359384374
kiss,kissing,1.9850125991
spark,sparkling,1.99967725257
float,floating,2.01446174339
grasp,grasping,2.02246105826
wash,washing,2.0235026112
club,clubbing,2.04385081079
speak,speaking,2.0692516424
appeal,appealing,2.08099030087
seal,sealing,2.1334000124
pick,pickering,2.1702154317
partition,partitioning,2.17134128037
chin,ching,2.19727799516
mislead,misleading,2.20911172464
press,pressing,2.20973667428
creep,creeping,2.21823655124
char,charting,2.23740598383
plug,plugging,2.24269149688
auto,autografting,2.24611799974
satisfy,satisfying,2.276506044
weigh,weighting,2.28013571027
disappear,disappearing,2.28481359162
resp,respecting,2.31371515425
recur,recurring,2.31399157734
taper,tapering,2.3415829534
scaffold,scaffolding,2.34449073589
alarm,alarming,2.39644342751
coat,coating,2.40992656216
cool,cooling,2.4311016978
wish,wishing,2.43470257574
feed,feeding,2.43825325579
retard,retarding,2.44181556995
sick,sickling,2.45287002896
disturb,disturbing,2.4564663659
autograft,autografting,2.51434180787
path,pathfinding,2.52876035219
cree,creeping,2.53293589412
proceed,proceeding,2.59762901898
justify,justifying,2.61563545837
sustain,sustaining,2.68171891572
tape,tapering,2.69651317732
melt,melting,2.81472219679
stiff,stiffening,2.84204128354
dissect,dissecting,2.85731247427
distress,distressing,2.85813593063
mark,marking,2.87775930266
halt,halting,2.88264943396
consult,consulting,2.91331415675
stiffen,stiffening,2.9244516186
render,rendering,2.9326361898
house,housekeeping,2.94372209873
travel,traveling,2.97061166749
shorten,shortening,2.97147445445
counteract,counteracting,2.99830024437
tail,tailoring,3.02623546266
walk,walking,3.06115969202
possess,possessing,3.07026339582
hold,holding,3.09409775402
mount,mounting,3.1170414599
counter,counteracting,3.16539791314
genera,generating,3.2107717133
think,thinking,3.27369762705
seek,seeking,3.29432244029
neighbor,neighboring,3.3195195944
convert,converting,3.3374878185
shield,shielding,3.37669414004
drift,drifting,3.38889015863
retain,retaining,3.44906052549
agree,agreeing,3.47194503323
notch,notching,3.50071186983
favor,favoring,3.50362584567
wear,wearing,3.57779803388
enter,entering,3.62016275018
call,calling,3.67057627276
scatter,scattering,3.69478766876
nick,nicking,3.70889748606
spread,spreading,3.76933838903
awake,awakening,3.81483975873
expand,expanding,3.83816761144
persist,persisting,3.85584493574
feel,feeling,3.85776172601
draw,drawing,3.91862932631
load,loading,3.95891776088
wait,waiting,3.96760141897
coup,coupling,3.97083534219
deal,dealing,3.98284005984
look,looking,4.00084344999
flank,flanking,4.00765882145
conflict,conflicting,4.02106413465
sheath,sheathing,4.03455892973
peel,peeling,4.04645547878
round,rounding,4.06812499135
pertain,pertaining,4.07915253456
cloud,clouding,4.09791973412
exceed,exceeding,4.13173026862
match,matching,4.14585170143
list,listening,4.20782231053
switch,switching,4.24001920306
rais,raising,4.25749096198
arrest,arresting,4.28660982423
stand,standing,4.41705762399
break,breaking,4.43563160489
carry,carrying,4.4357559336
demand,demanding,4.44170731172
yield,yielding,4.52880962637
tend,tending,4.58646764077
fail,failing,4.61347101011
extend,extending,4.6166186666
distinguish,distinguishing,4.63450596027
consent,consenting,4.64415865972
reflect,reflecting,4.64522065947
miss,missing,4.6793168508
shear,shearing,4.7723240561
touch,touching,4.80213218997
cover,covering,4.85907913004
wild,wilding,4.96588917479
vault,vaulting,4.99454840655
invest,investigating,5.01770973896
rest,resting,5.06155035744
plot,plotting,5.08131402587
fold,folding,5.27697236323
yellow,yellowing,5.32169923435
comb,combining,5.32565349233
foster,fostering,5.34058711587
project,projecting,5.34781464968
carr,carrying,5.3599095018
reveal,revealing,5.37135087189
protect,protecting,5.38967756948
suffer,suffering,5.39286065002
scar,scarring,5.39323719915
threat,threatening,5.39747834705
confirm,confirming,5.40324847917
depend,depending,5.40758370862
grow,growing,5.41620242222
turn,turning,5.46099482181
stop,stopping,5.53397212666
gain,gaining,5.63095221635
worsen,worsening,5.64120657694
crush,crushing,5.69236602491
explain,explaining,5.70406176824
teach,teaching,5.77452556015
reach,reaching,5.78575180689
fall,falling,5.79178108744
link,linking,5.82400237685
start,starting,5.90510462364
count,counteracting,5.91309993378
delay,delaying,5.91523012306
surround,surrounding,5.92107553554
strength,strengthening,5.93673637342
cluster,clustering,5.94546367927
begin,beginning,5.95008925143
thick,thickening,5.96207107787
confound,confounding,5.97759289607
transfer,transferring,5.99232487443
correspond,corresponding,6.01723434169
cross,crossing,6.06219543339
correct,correcting,6.14392972029
tilt,tilting,6.15661587401
suggest,suggesting,6.15867471032
alter,alternating,6.16170890948
reason,reasoning,6.16649937998
shift,shifting,6.24663192462
spot,spotting,6.26075864497
smooth,smoothing,6.28872209814
compound,compounding,6.3452215432
show,showing,6.34913522123
affect,affecting,6.3629520537
tunnel,tunneling,6.43454836849
deva,devastating,6.43737978435
support,supporting,6.43796331336
treat,treating,6.46196876012
search,searching,6.53230270495
exam,examining,6.59359871287
respect,respecting,6.60417380048
flash,flashing,6.6461927747
transform,transforming,6.65108697669
school,schooling,6.6646311726
result,resulting,6.67254701421
ring,ringing,6.68613747586
shunt,shunting,6.79946826322
seem,seeming,6.83582279694
thin,thinking,6.86453991592
concern,concerning,6.91174270458
fill,filling,6.92145345269
record,recording,6.93807836652
step,stepping,6.95482584673
peak,peaking,6.97133378914
design,designing,6.98935174916
flicker,flickering,7.03404047026
help,helping,7.07135556217
understand,understanding,7.10517982594
regard,regarding,7.13738851336
found,founding,7.13900340781
point,pointing,7.20709640761
learn,learning,7.21852708659
cent,centering,7.22144554309
visit,visiting,7.25552069585
stain,staining,7.26158623715
mode,modeling,7.26979601366
bloc,blocking,7.31476219293
weight,weighting,7.34441173506
dark,darkening,7.38225548385
work,working,7.39248952386
sleep,sleeping,7.39639633975
test,testing,7.43124077836
strip,stripping,7.43658864893
survey,surveying,7.4452709341
center,centering,7.45657151324
limit,limiting,7.53636460388
lamp,lamping,7.58234662
thin,thinning,7.62351152249
hand,handling,7.62605414491
stem,stemming,7.64887324898
model,modeling,7.66312681275
heal,healing,7.68283364702
lead,leading,7.75659801931
part,partitioning,7.76359328269
fast,fasting,7.77391838513
assay,assaying,7.77847750729
water,watering,7.8485405838
pattern,patterning,7.91480237122
transport,transporting,7.91574345985
exact,exacting,7.94641579952
cost,costing,7.94842822149
form,forming,7.95874818607
approach,approaching,7.96924371005
interest,interesting,8.05108702988
need,needing,8.05427840422
screen,screening,8.10059376297
undergo,undergoing,8.17833242539
chart,charting,8.18637259819
color,coloring,8.20104024361
deep,deepening,8.22518014107
accord,according,8.26645247068
flow,flowing,8.32616501525
graft,grafting,8.39576754448
tear,tearing,8.41088964898
filter,filtering,8.45585221261
drop,dropping,8.47143050364
wound,wounding,8.60665424778
head,heading,8.8899192817
block,blocking,8.99192263535
group,grouping,9.1077789174
light,lighting,9.29777666277
actin,acting,9.57589756133
need,needling,10.1961307217
gene,generating,10.9858872071

## group: jj_jjr_jjs
young,younger,6.35817194143
small,smaller,6.99120656608
high,higher,7.0300413341
high,highest,7.31035886914
great,greater,8.02203573324

## group: nn_vbd_vbn
hyper,hypertrophied,0.679341401546
enforce,enforced,0.756818976913
multinucleate,multinucleated,0.758511894767
restrain,restrained,0.764870483787
fade,faded,0.792778475054
shea,sheathed,0.871574271884
avert,averted,0.905123144293
buck,buckled,0.91728091482
lapse,lapsed,0.969089977761
articulate,articulated,1.00414501381
bevel,beveled,1.00740580762
precondition,preconditioned,1.00973781453
traverse,traversed,1.02163915315
fire,fired,1.0296898546
conceal,concealed,1.03322854026
convince,convinced,1.05450718375
polis,polished,1.13424266487
concert,concerted,1.14160475816
constrain,constrained,1.14527316364
plague,plagued,1.21966119189
silence,silenced,1.24242212552
bill,billed,1.24408636581
serra,serrated,1.29126304379
tackle,tackled,1.33417463215
tune,tuned,1.39106056326
peel,peeled,1.39748056985
tint,tinted,1.42654224639
graduate,graduated,1.43502818323
erode,eroded,1.44708331429
waste,wasted,1.45255532602
watch,watched,1.46337168708
gate,gated,1.46341940103
sort,sorted,1.46916477619
hyper,hyperpigmented,1.47476043694
finish,finished,1.54899994116
decompose,decomposed,1.57705105026
book,booked,1.58015440197
sequester,sequestered,1.58326244458
digest,digested,1.58979487221
title,titled,1.6331417574
saturate,saturated,1.63662101776
defer,deferred,1.63721681211
trap,trapped,1.65541666569
forgot,forgotten,1.67735970534
pick,picked,1.72659797478
engage,engaged,1.73380822816
wish,wished,1.73900764536
contract,contracted,1.80812999015
conjugate,conjugated,1.83270355323
deform,deformed,1.93767294841
retract,retracted,1.94654984653
assure,assured,1.95039973981
spark,sparked,1.96640549892
acknowledge,acknowledged,1.97895315899
coil,coiled,2.0021285299
taper,tapered,2.10868498659
disperse,dispersed,2.11549079864
belt,belted,2.12775025234
ciliate,ciliated,2.16509081809
stream,streamlined,2.1664292541
frost,frosted,2.20017709181
arch,arched,2.22213482712
trabecula,trabeculated,2.22229266226
tape,tapered,2.25767546732
threat,threaten,2.2662873068
flank,flanked,2.27118416373
devote,devoted,2.27899557621
license,licensed,2.30008129102
crow,crowded,2.30676176622
confound,confounded,2.33475148486
bridge,bridged,2.33569181753
notch,notched,2.36101702768
seal,sealed,2.3921149877
suppose,supposed,2.40834118633
reform,reformed,2.41985151779
inspire,inspired,2.44682454349
print,printed,2.45755723232
hydrate,hydrated,2.4588783713
merit,merited,2.46058961198
fuse,fused,2.47050050945
bond,bonded,2.4808969801
handle,handled,2.48898222255
constrict,constricted,2.49936372186
distort,distorted,2.55243833316
compress,compressed,2.5619279945
smoke,smoked,2.5986275618
wash,washed,2.60902187071
afflict,afflicted,2.61147476335
degrade,degraded,2.62480311557
dilute,diluted,2.65309405587
sick,sickled,2.66101775013
brand,branded,2.68049679769
warm,warmed,2.71302359406
anchor,anchored,2.74240959521
educate,educated,2.75133123952
retard,retarded,2.76213838952
seed,seeded,2.86424768012
partition,partitioned,2.88848851993
mela,melamed,2.89524959445
weigh,weighed,2.89786733624
decide,decided,2.90823566469
plug,plugged,2.91171247272
melt,melted,2.92960247233
interrupt,interrupted,2.93148562401
mirror,mirrored,3.01494142856
hope,hoped,3.07527690233
super,superimposed,3.08003841505
illuminate,illuminated,3.11020431971
travel,traveled,3.11120132324
refine,refined,3.14887571067
advise,advised,3.15345751454
compact,compacted,3.1679504587
perforate,perforated,3.17492792523
learn,learned,3.18337230988
reconstruct,reconstructed,3.21544764373
strip,stripped,3.23214414889
striate,striated,3.26321402828
travel,travelled,3.30070110566
concentrate,concentrated,3.30541822483
handicap,handicapped,3.34608767598
coat,coated,3.34823651861
ground,grounded,3.35584034314
rotate,rotated,3.36773105944
replicate,replicated,3.37350753212
possess,possessed,3.3860648837
instruct,instructed,3.41014800227
track,tracked,3.41735554426
accomplish,accomplished,3.44937608966
precipitate,precipitated,3.52103485095
shield,shielded,3.55123344608
mail,mailed,3.5811879061
puncture,punctured,3.58369870039
favor,favored,3.63229546917
restrict,restricted,3.78743544689
agree,agreed,3.79948932255
mount,mounted,3.82009082953
skill,skilled,3.83420242012
predispose,predisposed,3.86301070921
glue,glued,3.8919969709
drain,drained,3.89330429321
accelerate,accelerated,3.89878368772
cannula,cannulated,3.95616606363
surround,surrounded,3.97821600461
scatter,scattered,3.99981939804
outline,outlined,4.01580129387
permit,permitted,4.04065185993
guard,guarded,4.07574593368
round,rounded,4.09186818833
detach,detached,4.14203403601
oppose,opposed,4.15161922632
seat,seated,4.17774849381
adopt,adopted,4.24503823203
bound,bounded,4.24726019526
sheath,sheathed,4.31543681608
myelin,myelinated,4.34964693451
intend,intended,4.39411924978
rupture,ruptured,4.41600192684
expand,expanded,4.44352066909
convert,converted,4.48865018378
price,priced,4.49653453182
relieve,relieved,4.50133026111
incorporate,incorporated,4.57274923483
dissect,dissected,4.59615246091
desire,desired,4.59710652136
fragment,fragmented,4.66028716213
buckle,buckled,4.67189904367
rest,restrained,4.68533938449
connect,connected,4.68982864034
trigger,triggered,4.70340386099
list,listed,4.73886090625
couple,coupled,4.74922321936
coup,coupled,4.75623583314
kind,kindred,4.77156729507
suppress,suppressed,4.81131654248
sickle,sickled,4.87472994702
load,loaded,4.9088947289
absorb,absorbed,4.94519164704
square,squared,4.9625032971
plot,plotted,4.97905121482
touch,touched,4.98109925981
distinguish,distinguished,4.98865773171
vault,vaulted,4.99616232231
admit,admitted,5.00336680112
enlarge,enlarged,5.06234098449
weigh,weighted,5.06803507226
mani,manifested,5.07052375566
prefer,preferred,5.14113336569
warrant,warranted,5.17014690867
fear,feared,5.18840861353
reserve,reserved,5.21307391557
perfect,perfected,5.2610008272
burn,burned,5.26370156777
fill,filled,5.27320057097
spike,spiked,5.29185207926
raise,raised,5.30223928298
substitute,substituted,5.30679680711
abstract,abstracted,5.35096655548
fold,folded,5.35882604612
discover,discovered,5.37641607973
attach,attached,5.3783401017
stop,stopped,5.39767435323
genera,generalized,5.45013021611
turn,turned,5.46123103445
crush,crushed,5.51352791162
augment,augmented,5.58352971239
employ,employed,5.62503915568
fall,fallen,5.67304341923
check,checked,5.70790584811
register,registered,5.71935756673
bloc,blocked,5.73296242182
extend,extended,5.74087383729
rest,restricted,5.79450320571
prove,proved,5.80718402814
reverse,reversed,5.81528221883
insert,inserted,5.82588588663
experiment,experimented,5.83174298918
compose,composed,5.83432387512
inform,informed,5.84072440292
plate,plated,5.8756651818
cluster,clustered,5.92376221599
border,bordered,5.93624791547
switch,switched,5.94911331664
rais,raised,5.9927211869
face,faced,6.03876969447
atta,attached,6.06200114214
regulate,regulated,6.08293677814
fashion,fashioned,6.08671066787
suspect,suspected,6.10773189596
blur,blurred,6.11739004529
stand,standardized,6.12298850832
spot,spotted,6.16098083538
repeat,repeated,6.2170072791
scar,scarred,6.21812985967
force,forced,6.22477703634
screen,screened,6.23099887245
reflect,reflected,6.25906703786
return,returned,6.28306719594
resolve,resolved,6.31847470213
transfer,transferred,6.33676328059
band,banded,6.34167806713
feature,featured,6.35239557808
sight,sighted,6.36889127356
sustain,sustained,6.37925528524
select,selected,6.38178165548
comprise,comprised,6.38606040487
slope,sloped,6.41006271541
train,trained,6.4292487744
extract,extracted,6.4504208375
branch,branched,6.46588499867
diffuse,diffused,6.4723666365
forme,formed,6.49587635881
balance,balanced,6.51946886937
elevate,elevated,6.53318480573
correlate,correlated,6.54666339638
tunnel,tunneled,6.58270910096
cross,crossed,6.60434960018
needle,needled,6.61295462099
assign,assigned,6.69609247481
derive,derived,6.71550834625
decline,declined,6.73516602473
class,classed,6.7499230537
enhance,enhanced,6.77621223678
peak,peaked,6.77772272699
complicate,complicated,6.80953595193
cover,covered,6.8169849974
sele,selected,6.83634334056
impact,impacted,6.86538407277
provide,provided,6.88830885103
note,noted,6.8975385647
confirm,confirmed,6.92638939117
dilate,dilated,6.94343875707
rank,ranked,6.99487234958
step,stepped,7.01277265872
author,authorized,7.05272184282
work,worked,7.0642916102
shape,shaped,7.07049429409
grade,graded,7.07971846854
combine,combined,7.12054919796
course,coursed,7.16654228632
sector,sectored,7.18629305168
collect,collected,7.2282844236
comb,combined,7.22972388193
produce,produced,7.25300244981
calculate,calculated,7.26446399224
involve,involved,7.27880752055
enroll,enrolled,7.30013658796
hand,handed,7.33381064255
scale,scaled,7.34110738415
reveal,revealed,7.3585977608
disorder,disordered,7.36374347173
condition,conditioned,7.36582116946
receive,received,7.40524334119
pair,paired,7.4431972886
mark,marked,7.45618056113
culture,cultured,7.46194003874
hand,handled,7.46416617696
divide,divided,7.46732778095
position,positioned,7.49454201343
measure,measured,7.50374277763
organ,organized,7.5301225812
include,included,7.5317241566
target,targeted,7.53309547724
color,colored,7.56299856588
practice,practiced,7.57169678039
wall,walled,7.57659121209
point,pointed,7.58647931328
value,valued,7.60947492279
express,expressed,7.61161176604
standard,standardized,7.6130723046
part,partitioned,7.62331711985
transport,transported,7.63142149729
state,stated,7.6340456316
line,lined,7.65824907147
stem,stemmed,7.65971428293
pain,painted,7.6830571224
associate,associated,7.68982599145
pattern,patterned,7.69362466236
link,linked,7.69411877603
stage,staged,7.74144214408
correct,corrected,7.80075081821
size,sized,7.80275762837
center,centered,7.85379889549
post,posted,7.86049131841
coll,collected,7.88157358845
water,watershed,7.97834186082
blind,blinded,8.00876882836
assess,assessed,8.02168485356
valve,valved,8.02605518765
power,powered,8.08060312434
define,defined,8.0922032932
structure,structured,8.18741645834
show,shown,8.20748104918
order,ordered,8.33365255782
cent,centered,8.39167677425
subject,subjected,8.40212134151
design,designed,8.41180983441
score,scored,8.44138890804
wound,wounded,8.4438315066
space,spaced,8.48643209415
need,needled,8.53245791907
weight,weighted,8.57937386858
determine,determined,8.64139205304
block,blocked,8.66773518267
time,timed,8.71938729012
surface,surfaced,8.84219969513
curve,curved,8.91228520741
carr,carried,9.08541783451
form,formed,9.10475798921
lamina,laminated,9.1900853359
angle,angled,9.36438912332
base,based,9.39805494272
test,tested,9.40453811921
graft,grafted,9.47858812496
class,classified,9.48176527066
mask,masked,9.62762741278
disease,diseased,9.64859228468
segment,segmented,9.64931072628
rate,rated,9.66699566283
group,grouped,10.2034461167
layer,layered,10.3231771233
range,ranged,10.677522961
gene,generalized,12.3693732944

## group: bigrams
and,the,6.42629037382
and,in,6.5540183966
in,the,6.63416287485
of,the,6.90627953332
with,the,7.35575030892
in,glaucoma,7.92358267119
glaucoma,in,7.92358267119
intraocular,pressure,8.00664753097
for,the,8.21279075049
that,the,8.3948771352
glaucoma,and,8.42791189083
with,glaucoma,8.49332481747
to,the,8.53831257725
the,mean,8.61745508403
of,glaucoma,8.6734529767
in,this,8.76189806035
on,the,8.85479119129
the,study,8.9992225503
visual,field,9.11968513274
at,the,9.12859267839
visual,acuity,9.13436247674
of,this,9.28844011534
treatment,of,9.38476178033
associated,with,9.42192463382
by,the,9.71422110361
from,the,9.83935721223
use,of,9.85939396786
the,optic,9.86254014351
this,study,9.90876002858
the,anterior,10.0605605417
number,of,10.0902776569
optic,disc,10.1627776265
effect,of,10.1921149023
to,evaluate,10.3309950196
there,was,10.3419492656
to,determine,10.4859026557
between,the,10.5468339976
optic,nerve,10.752779056
anterior,chamber,11.0808210622
ocular,hypertension,12.1350714133
to,be,12.3749031985
purpose,to,13.7764674208
may,be,14.1066414638

