## group: nn_nns
stick,sticks,1.66943457041
obstetric,obstetrics,1.73127306502
asset,assets,2.05506528632
scratch,scratches,2.08753913634
stock,stocks,2.51546096929
surround,surroundings,2.58843260157
leech,leeches,2.60867867161
caliper,calipers,2.88515198734
proceed,proceeds,2.93654649823
sport,sports,2.98486761706
onward,onwards,3.11584879552
wage,wages,3.33698054347
blink,blinks,3.37429637847
technic,technics,3.38915304572
chip,chips,4.04019307525
arch,arches,4.16117259298
mechanic,mechanics,4.43848094491
sander,sanders,4.61957791062
backward,backwards,4.80159299659
synapse,synapses,4.92722891672
outdoor,outdoors,5.08459552611
pharmacodynamic,pharmacodynamics,5.21110295381
clip,clips,5.44925523901
quarter,quarters,6.16781296299
ground,grounds,6.22501911166
button,buttons,6.28242306653
syringe,syringes,6.4383364416
street,streets,6.63821964761
hydrodynamic,hydrodynamics,7.4970175095
harmonic,harmonics,7.79299455301
spectacle,spectacles,7.94850723909
stay,stays,8.32408367143
plastic,plastics,9.28241726133
geriatric,geriatrics,10.5200351777
ellipse,ellipses,10.7128523822
table,tables,10.7902441849
turn,turns,11.8504188864
gain,gains,12.3910364105
glass,glasses,13.0793843688
link,links,13.5575414696
cone,cones,14.6928996413
base,bases,15.0764993003
session,sessions,16.5632986602
class,classes,17.2131725968
hemodynamic,hemodynamics,18.4459854636
content,contents,18.5606423998
needle,needles,20.1729680416
work,works,21.121916856
remain,remains,21.141531236
manner,manners,21.5444702402
biometric,biometrics,21.6377602488
morning,mornings,21.7328983797
night,nights,21.9385859046
size,sizes,22.6540461406
phase,phases,22.7109546432
scale,scales,23.1213439977
pediatric,pediatrics,24.4741481496
diagnose,diagnoses,24.5711848795
wound,wounds,26.6103631633
color,colors,26.9027739934
need,needs,28.0308581223
become,becomes,29.1457138383
damage,damages,29.3031236297
brain,brains,29.3166795152
effect,effects,31.8899869248
term,terms,33.5889078491
test,testes,35.8110984878
analyse,analyses,37.6176226524
heart,hearts,38.1754409015
side,sides,38.567258678
time,times,39.901002339

