## group: nn_nns
stick,sticks,0.92978250229
asset,assets,1.02124834286
leech,leeches,1.14215072709
obstetric,obstetrics,1.30872316563
scratch,scratches,1.33398672349
caliper,calipers,1.34653884277
stock,stocks,1.45028653148
wage,wages,1.46869637066
onward,onwards,1.47108261756
proceed,proceeds,1.67200986104
sport,sports,1.67361148148
technic,technics,1.68113599418
surround,surroundings,1.81920901422
outdoor,outdoors,2.0041890501
arch,arches,2.08830851348
mechanic,mechanics,2.1868331146
syringe,syringes,2.198340095
chip,chips,2.25640942194
clip,clips,2.2734819232
sander,sanders,2.62166922594
button,buttons,2.65674298227
blink,blinks,2.66592862976
synapse,synapses,2.76382898293
backward,backwards,2.79175519278
pharmacodynamic,pharmacodynamics,2.88292287224
stay,stays,2.92169380946
street,streets,2.95054259225
spectacle,spectacles,2.9753023058
ground,grounds,3.14086394098
link,links,3.37282502385
quarter,quarters,3.46862044491
table,tables,3.53680234294
hydrodynamic,hydrodynamics,3.55888041851
effect,effects,3.67022040175
size,sizes,3.68276978232
plastic,plastics,3.83531070386
harmonic,harmonics,4.12209341891
geriatric,geriatrics,4.41177788484
gain,gains,4.4267486706
damage,damages,4.44395911165
class,classes,4.48222017393
content,contents,4.73539727721
session,sessions,4.82228654311
ellipse,ellipses,4.86326830876
phase,phases,5.08114270099
turn,turns,5.155398272
hemodynamic,hemodynamics,5.21445170273
glass,glasses,5.21816311555
pediatric,pediatrics,5.46725647485
scale,scales,5.51395617737
work,works,5.51446781534
cone,cones,5.63316678446
needle,needles,5.80634048272
remain,remains,5.86513793706
manner,manners,5.89843981285
base,bases,5.94995817244
night,nights,5.97943220748
brain,brains,6.09127482247
need,needs,6.13028141198
biometric,biometrics,6.70333907767
wound,wounds,6.71093468927
morning,mornings,6.97003309933
color,colors,6.97122207079
test,testes,7.0622872578
diagnose,diagnoses,7.10295630437
term,terms,7.43005222433
become,becomes,7.45787514097
time,times,7.50630596787
analyse,analyses,7.60086527331
side,sides,7.80688796093
heart,hearts,8.7612020717

