## group: bigrams
of,the,4.31579017439
and,in,5.54274476489
and,the,6.50965846857
in,the,6.51843849283
number,of,7.78484758387
for,the,8.27648887505
to,the,9.2592474286
on,the,9.62390799539
that,the,9.78191308521
with,the,10.0038543045
in,glaucoma,10.3941081215
glaucoma,in,10.3941081215
with,glaucoma,10.6489786762
from,the,10.7652521147
of,glaucoma,10.8770323758
by,the,11.137260639
at,the,11.2190944931
glaucoma,and,11.3233558923
between,the,11.6289367796
of,this,11.8115837951
in,this,13.2553042953
the,mean,13.2929646826
this,study,13.4956942726
treatment,of,14.1586324781
use,of,14.3811785203
the,study,14.7265345511
intraocular,pressure,14.7940611985
the,anterior,18.5594576891
effect,of,18.8812814292
associated,with,19.7729651478
to,determine,20.9575242647
there,was,21.4624030309
to,evaluate,22.6077770478
the,optic,23.3696290848
visual,field,24.4967096822
visual,acuity,24.7858866553
purpose,to,25.1180994179
ocular,hypertension,25.496031874
anterior,chamber,26.186990045
to,be,26.9671350011
optic,disc,32.2435650881
optic,nerve,34.4953930613
may,be,36.9860345343

