## group: nn_nns
term,terms,0.04712050043
time,times,0.0777716112594
effect,effects,0.0908741041214
base,bases,0.11622819212
need,needs,0.14266952014
remain,remains,0.268556372495
work,works,0.30458299159

