## group: nn_nns
obstetric,obstetrics,2.86700268384
stick,sticks,3.15143939259
leech,leeches,3.16457528365
asset,assets,3.279230244
scratch,scratches,3.76869032865
blink,blinks,3.80290612452
caliper,calipers,4.44897625642
technic,technics,4.78383252108
proceed,proceeds,4.84249365515
stock,stocks,4.96113308453
surround,surroundings,5.26800927509
sport,sports,5.57612738861
onward,onwards,5.74907932533
sander,sanders,6.51410406312
pharmacodynamic,pharmacodynamics,6.63119956718
arch,arches,7.15846917472
wage,wages,7.22401649731
backward,backwards,7.37666602129
synapse,synapses,7.53958674216
mechanic,mechanics,7.77593062646
chip,chips,7.84392948148
outdoor,outdoors,9.04692676402
quarter,quarters,9.31209435164
syringe,syringes,10.0799620051
ground,grounds,10.4173813869
clip,clips,10.8858367673
hydrodynamic,hydrodynamics,11.0428614254
button,buttons,11.1381016009
street,streets,11.4555441794
spectacle,spectacles,11.6787777339
harmonic,harmonics,11.7104188481
stay,stays,12.4771119731
plastic,plastics,15.5059537336
table,tables,15.5666386211
turn,turns,15.7997138931
ellipse,ellipses,16.2612774372
link,links,17.8214801866
geriatric,geriatrics,18.8172364183
gain,gains,19.3297623164
glass,glasses,20.934185379
base,bases,22.3644044402
class,classes,22.9557843105
session,sessions,23.8471538725
cone,cones,24.272415607
hemodynamic,hemodynamics,24.3548631492
manner,manners,27.6106796704
content,contents,27.9289374658
work,works,28.3151600686
needle,needles,28.8662978923
morning,mornings,30.1445913356
remain,remains,30.6222399931
size,sizes,30.8756647259
scale,scales,31.2949168878
night,nights,31.3863587332
biometric,biometrics,31.5473123809
wound,wounds,32.9873801194
diagnose,diagnoses,33.8761195583
need,needs,35.4815642516
phase,phases,36.1475722994
color,colors,38.0537549906
damage,damages,38.3491841596
become,becomes,38.5228411449
effect,effects,40.2443335135
pediatric,pediatrics,40.2891440481
brain,brains,41.7782383948
test,testes,43.1890893943
time,times,46.1026710599
analyse,analyses,47.2833256067
term,terms,49.4206623624
heart,hearts,51.543898473
side,sides,52.1434567926

## group: nn_vbg
unlock,unlocking,2.51844665378
stitch,stitching,2.61591383401
void,voiding,2.65676917098
underpin,underpinning,2.73297640534
talk,talking,2.90921588903
depress,depressing,2.95198897269
perturb,perturbing,2.98422198073
finish,finishing,3.00175104291
afflict,afflicting,3.03643328382
weaken,weakening,3.11912727338
forget,forgetting,3.2042528032
interrupt,interrupting,3.21398445372
ripe,ripening,3.23817346484
shea,sheathing,3.31706441673
unravel,unraveling,3.33389545456
unravel,unravelling,3.41901959923
shrink,shrinking,3.44645522965
reward,rewarding,3.49762298647
scratch,scratching,3.53428141534
smart,smarting,3.53638749276
absorb,absorbing,3.60293048804
resist,resisting,3.68506529677
mold,molding,3.70206405909
ladder,laddering,3.7382377785
knock,knocking,3.78234032451
sweat,sweating,3.79305157003
sprout,sprouting,3.79572516908
wick,wicking,3.90077666585
push,pushing,3.92671072851
farm,farming,3.97726343291
appeal,appealing,4.00186497228
wish,wishing,4.11409420951
lift,lifting,4.14774945563
discern,discerning,4.34483486397
strengthen,strengthening,4.36249785525
join,joining,4.43253971918
cast,casting,4.5587640108
pick,pickering,4.76787248126
tailor,tailoring,4.79144165698
flush,flushing,4.84355649276
warn,warning,4.91490595267
hunt,hunting,4.95535318539
shadow,shadowing,5.02179282708
kill,killing,5.11114124383
weigh,weighing,5.15208166021
grasp,grasping,5.17194845966
kiss,kissing,5.19479371399
multiply,multiplying,5.22402986654
speak,speaking,5.26498247335
disturb,disturbing,5.29265470782
char,charting,5.33896308882
govern,governing,5.40753519553
retard,retarding,5.41188086914
sustain,sustaining,5.42390215613
tattoo,tattooing,5.45591488046
worry,worrying,5.52282598778
mislead,misleading,5.56723356937
satisfy,satisfying,5.57812805951
trap,trapping,5.59020271992
shea,shearing,5.66709159472
watch,watching,5.67368399343
book,booking,5.69806708201
poison,poisoning,5.72780033914
float,floating,5.75029418766
partition,partitioning,5.84290603303
weigh,weighting,5.8671194868
comb,combing,5.8716296867
crack,cracking,5.89330624023
hatch,hatching,5.95033013274
mount,mounting,6.02321772405
wash,washing,6.04392197153
tape,tapering,6.11501696029
justify,justifying,6.16133502857
spark,sparkling,6.29630422595
counteract,counteracting,6.32148474404
taper,tapering,6.32258244315
chin,ching,6.53473336671
alarm,alarming,6.5376913751
consult,consulting,6.65477973245
disappear,disappearing,6.73025244414
feed,feeding,6.85761791339
halt,halting,6.92421592649
recur,recurring,7.09952347878
auto,autografting,7.17068306341
seal,sealing,7.1895081779
cree,creeping,7.36264455063
counter,counteracting,7.53951754313
distress,distressing,7.65736596672
creep,creeping,7.68003085838
dissect,dissecting,7.70054784768
coat,coating,7.85611500413
shorten,shortening,7.99757551638
sick,sickling,8.01921912062
proceed,proceeding,8.05150934689
convert,converting,8.21402730686
path,pathfinding,8.32520159791
render,rendering,8.35402420345
house,housekeeping,8.36643357863
press,pressing,8.37535330747
retain,retaining,8.42393347291
cool,cooling,8.46803163203
genera,generating,8.52229069683
favor,favoring,8.62540423713
think,thinking,8.66555648808
club,clubbing,8.7491246005
hold,holding,8.91967419121
melt,melting,8.94949699658
autograft,autografting,8.95937378443
tail,tailoring,9.02404583731
seek,seeking,9.32982264261
expand,expanding,9.46698576178
flank,flanking,9.47225631581
plug,plugging,9.5237350546
call,calling,9.5699909108
mark,marking,9.63322512421
agree,agreeing,9.70088222945
pertain,pertaining,9.83050342897
deal,dealing,9.86652727449
resp,respecting,9.89490795806
drift,drifting,10.0785469705
neighbor,neighboring,10.1243698117
feel,feeling,10.1394540504
stiffen,stiffening,10.3375273027
nick,nicking,10.3806926566
demand,demanding,10.5372871998
shield,shielding,10.5595409948
rais,raising,10.5750962148
stiff,stiffening,10.602504666
possess,possessing,10.6593514211
enter,entering,10.6952875505
persist,persisting,10.7187769782
conflict,conflicting,10.7360909937
spread,spreading,10.969810732
draw,drawing,11.048152254
travel,traveling,11.2400528719
awake,awakening,11.2877427678
wear,wearing,11.8879474111
arrest,arresting,11.9865238329
break,breaking,12.3656194016
list,listening,12.9348027046
look,looking,13.0756803255
walk,walking,13.3882896368
coup,coupling,13.3949939628
threat,threatening,13.7767836959
invest,investigating,13.9361495613
scaffold,scaffolding,14.0725081424
cloud,clouding,14.2750616707
wait,waiting,14.447857371
stop,stopping,14.5174086961
deva,devastating,14.5697781617
exceed,exceeding,14.8769953395
match,matching,14.9123571468
turn,turning,15.258714283
carr,carrying,15.5882622537
notch,notching,15.6003795982
peel,peeling,15.7774483639
miss,missing,15.9764275015
stand,standing,16.0882899806
cover,covering,16.3458833581
round,rounding,16.3734257419
carry,carrying,17.0210751682
extend,extending,17.1114847853
yield,yielding,17.203664378
tend,tending,17.2848210346
sheath,sheathing,17.4301907532
fold,folding,17.5095209652
load,loading,17.5194032904
plot,plotting,17.9583148559
touch,touching,18.0790728385
wild,wilding,18.202286937
scatter,scattering,18.2879596147
distinguish,distinguishing,18.3225208755
shear,shearing,18.4623921409
grow,growing,18.6695510944
rest,resting,19.0666272618
teach,teaching,19.5387059026
fail,failing,19.6427807185
consent,consenting,19.9828356586
switch,switching,20.109085574
start,starting,20.354287391
comb,combining,21.8290406107
confound,confounding,21.8635427748
vault,vaulting,21.8794891947
gain,gaining,21.943321797
correct,correcting,21.9508828931
surround,surrounding,22.0960422328
link,linking,22.4271608734
reveal,revealing,22.5396302639
bloc,blocking,22.5957224393
school,schooling,22.8123321482
reach,reaching,23.1673760962
reason,reasoning,23.2155328869
worsen,worsening,23.3425468792
cross,crossing,23.4338996929
yellow,yellowing,23.589735645
strip,stripping,23.6374192123
foster,fostering,23.6614496407
strength,strengthening,23.9303672959
begin,beginning,24.0918192437
transfer,transferring,24.141458989
flash,flashing,24.2561873592
smooth,smoothing,24.6105731603
tunnel,tunneling,24.9393144273
exam,examining,24.939927938
protect,protecting,25.3166113311
step,stepping,25.6253161952
delay,delaying,25.7528393084
crush,crushing,25.775187049
reflect,reflecting,26.8486977065
depend,depending,26.8959969535
project,projecting,27.0715451308
shift,shifting,27.1827492871
scar,scarring,27.7354285349
spot,spotting,27.8584044808
form,forming,27.9974392987
alter,alternating,28.329793382
respect,respecting,28.8875623369
record,recording,29.0346911928
flicker,flickering,29.5443040277
fall,falling,29.6990708863
interest,interesting,29.8482554671
thin,thinking,29.9814048486
thick,thickening,30.0617841133
limit,limiting,30.0930140235
correspond,corresponding,30.1372428491
compound,compounding,30.2704337593
confirm,confirming,30.7929418936
fill,filling,30.9392525618
ring,ringing,31.1000370369
work,working,31.2090108723
cluster,clustering,31.4743651617
concern,concerning,32.19044852
lamp,lamping,32.6066014689
exact,exacting,32.6990863851
shunt,shunting,32.7691121842
explain,explaining,32.7735142465
transform,transforming,32.8145392286
treat,treating,32.8350922833
suffer,suffering,32.8648250135
pattern,patterning,33.3955736806
part,partitioning,33.6638300416
fast,fasting,34.5318242868
mode,modeling,34.6027175301
seem,seeming,34.7160362144
support,supporting,34.767042238
point,pointing,35.4310844789
result,resulting,35.7049995547
tilt,tilting,35.8267468111
head,heading,35.9365972618
regard,regarding,35.9785129299
help,helping,36.0064414904
search,searching,36.0082358462
count,counteracting,36.1180448293
heal,healing,36.148138907
understand,understanding,36.409855685
undergo,undergoing,36.9663868691
approach,approaching,37.6133849055
cent,centering,37.8600493537
need,needing,38.0379373828
wound,wounding,38.2319488307
transport,transporting,38.2982145853
model,modeling,38.320041374
light,lighting,38.5761774753
gene,generating,38.6611239382
graft,grafting,38.7460805888
learn,learning,38.8675170157
chart,charting,39.0193222111
block,blocking,39.0520784442
dark,darkening,39.6374625847
weight,weighting,39.7333707018
center,centering,39.8262645857
sleep,sleeping,39.8405131445
drop,dropping,40.0135830879
peak,peaking,40.08198273
visit,visiting,40.4991946537
color,coloring,40.5050461244
show,showing,40.6268669317
deep,deepening,42.0987588906
filter,filtering,42.2483115253
actin,acting,42.4361785902
water,watering,42.6200210872
screen,screening,42.8986635331
stain,staining,42.934642143
thin,thinning,43.1387593927
assay,assaying,43.2186007877
tear,tearing,43.318964977
group,grouping,43.7978899537
affect,affecting,44.4456407106
hand,handling,44.7067868919
cost,costing,44.7666962333
stem,stemming,45.097430492
test,testing,45.6294193707
survey,surveying,46.3236678934
flow,flowing,47.3513936283
accord,according,47.548362817
need,needling,48.40428544
found,founding,52.6903140995
suggest,suggesting,53.7387514401
lead,leading,56.050775506
design,designing,67.4817118906

## group: jj_jjr_jjs
young,younger,42.6732047644
small,smaller,44.4852002789
high,highest,46.7496308736
high,higher,50.7055002641
great,greater,58.9129201523

## group: nn_vbd_vbn
fade,faded,2.18545035085
plague,plagued,2.25531557101
restrain,restrained,2.57587051539
decompose,decomposed,2.86355535274
constrain,constrained,2.99746315026
lapse,lapsed,3.03626037771
traverse,traversed,3.04749688229
articulate,articulated,3.06338604245
convince,convinced,3.07711638925
silence,silenced,3.07826878821
enforce,enforced,3.08204177568
avert,averted,3.10888553956
fire,fired,3.12210747316
precondition,preconditioned,3.12970415851
tackle,tackled,3.15794672614
hyper,hypertrophied,3.22886667018
concert,concerted,3.33317509355
multinucleate,multinucleated,3.34746191859
erode,eroded,3.434836484
bevel,beveled,3.44208847863
bill,billed,3.52565567472
sort,sorted,3.53184118451
shea,sheathed,3.76972966694
peel,peeled,3.83583194104
tune,tuned,3.88414250575
finish,finished,4.08625037503
acknowledge,acknowledged,4.12410171529
assure,assured,4.24563312635
tint,tinted,4.29911486715
serra,serrated,4.37230470076
waste,wasted,4.40359009526
digest,digested,4.45037960087
polis,polished,4.47877813831
hyper,hyperpigmented,4.52188561122
conceal,concealed,4.52966296471
engage,engaged,4.60989576402
sequester,sequestered,4.64152324225
merit,merited,4.65514104681
buck,buckled,4.66696432181
confound,confounded,4.74772547098
title,titled,4.79568520674
flank,flanked,4.79749095416
saturate,saturated,4.80927481917
forgot,forgotten,4.91682178229
defer,deferred,4.9962378802
retract,retracted,5.03006071499
belt,belted,5.12841135761
pick,picked,5.15262688035
watch,watched,5.29326615547
deform,deformed,5.29345743662
book,booked,5.35285263174
stream,streamlined,5.55068736498
constrict,constricted,5.62725002274
partition,partitioned,5.66974595561
disperse,dispersed,5.75504216298
graduate,graduated,5.82801643644
handle,handled,5.94778896662
weigh,weighed,5.99785917013
license,licensed,6.08037279603
inspire,inspired,6.08080884373
gate,gated,6.11668317911
distort,distorted,6.19706203235
trap,trapped,6.21651118653
tape,tapered,6.23986735415
frost,frosted,6.32516859296
conjugate,conjugated,6.36823311693
devote,devoted,6.48431506348
reform,reformed,6.5292145134
afflict,afflicted,6.53188886118
spark,sparked,6.57553176216
taper,tapered,6.64327008685
warm,warmed,6.70341671137
print,printed,6.73748361495
seal,sealed,6.75539202876
arch,arched,6.77528657403
retard,retarded,6.78727860005
crow,crowded,6.89890994271
melt,melted,6.90423922669
suppose,supposed,6.94659372147
wish,wished,6.97358321416
coil,coiled,7.01966738573
trabecula,trabeculated,7.04106652603
threat,threaten,7.44806327101
anchor,anchored,7.44840179186
degrade,degraded,7.46793451989
educate,educated,7.5548706682
compress,compressed,7.68168494477
seed,seeded,7.68933107123
bond,bonded,7.74010123139
interrupt,interrupted,7.85681680169
hydrate,hydrated,8.21511210065
super,superimposed,8.34940922037
mirror,mirrored,8.4014029834
mail,mailed,8.46109339715
bridge,bridged,8.55562783216
plug,plugged,8.56269668329
track,tracked,8.66467635781
learn,learned,8.66724760024
favor,favored,8.8130924893
dilute,diluted,8.87005483747
wash,washed,8.90130986387
precipitate,precipitated,8.90944746972
contract,contracted,8.92402686805
strip,stripped,9.02164793086
accomplish,accomplished,9.10381843961
illuminate,illuminated,9.13790926216
notch,notched,9.28665816339
reconstruct,reconstructed,9.29847930891
refine,refined,9.42239814528
compact,compacted,9.62070054502
perforate,perforated,9.68427565556
coat,coated,9.8445771377
ground,grounded,9.86714907186
skill,skilled,9.94369350906
advise,advised,10.0067156278
sick,sickled,10.0408494381
rotate,rotated,10.1263670568
hope,hoped,10.1538322184
brand,branded,10.2510901438
instruct,instructed,10.265960068
mela,melamed,10.3517837317
decide,decided,10.6191495335
replicate,replicated,10.6333717969
shield,shielded,10.6637641701
guard,guarded,10.7161973926
fuse,fused,10.8421564293
smoke,smoked,10.8659307154
concentrate,concentrated,10.9073739034
drain,drained,11.0903560895
striate,striated,11.150288313
travel,traveled,11.2289449909
relieve,relieved,11.2461642888
travel,travelled,11.2796203014
detach,detached,11.2965594719
handicap,handicapped,11.6191152029
intend,intended,11.6943649193
restrict,restricted,11.8145698633
seat,seated,11.8672948528
ciliate,ciliated,11.9845094884
puncture,punctured,12.1196999675
possess,possessed,12.342997002
oppose,opposed,12.4311194047
accelerate,accelerated,12.7616538907
list,listed,12.7716808021
surround,surrounded,12.8931039991
reserve,reserved,12.8932531218
substitute,substituted,12.8942687659
adopt,adopted,12.9203429748
outline,outlined,13.0918588347
mount,mounted,13.1913327284
desire,desired,13.2261015122
kind,kindred,13.2598490758
permit,permitted,13.490780981
expand,expanded,13.5196472804
bound,bounded,13.6275285095
mani,manifested,13.6710736184
cannula,cannulated,13.8132835038
glue,glued,14.3523498001
perfect,perfected,14.3685875364
incorporate,incorporated,14.5124513083
predispose,predisposed,14.6715787925
absorb,absorbed,15.1278919514
scatter,scattered,15.2101413159
rest,restrained,15.7062081031
round,rounded,15.7734898543
agree,agreed,15.9112686617
coup,coupled,16.009118657
couple,coupled,16.669080686
trigger,triggered,16.7156515264
turn,turned,17.2233252694
myelin,myelinated,17.3714131017
buckle,buckled,17.380004173
fold,folded,17.6118731878
sheath,sheathed,17.632642388
price,priced,17.6794338824
burn,burned,17.7680423021
load,loaded,17.9250086929
touch,touched,18.1545780978
convert,converted,18.2395648067
discover,discovered,18.5452980457
plot,plotted,18.5742191203
dissect,dissected,19.0328353491
stop,stopped,19.0394245269
compose,composed,19.0562371905
suppress,suppressed,19.2806487069
augment,augmented,19.3435238638
fragment,fragmented,19.4097276869
fill,filled,19.5476897241
switch,switched,19.6037299618
connect,connected,19.6391659982
square,squared,19.6512866781
check,checked,19.6716310111
admit,admitted,19.6779715453
rest,restricted,19.7762556934
sight,sighted,20.3106997907
attach,attached,20.3213505486
fear,feared,20.6808006594
atta,attached,21.1373695759
warrant,warranted,21.4738949637
weigh,weighted,21.619964271
inform,informed,21.6209493049
employ,employed,21.8504328589
organ,organized,22.2543629595
rupture,ruptured,22.2567509515
vault,vaulted,22.3144741268
spike,spiked,22.317451917
fashion,fashioned,22.4102240436
extend,extended,22.566506018
feature,featured,22.6777075088
transfer,transferred,22.6928720244
sickle,sickled,22.8277970435
branch,branched,23.2044233185
train,trained,23.4369764398
enlarge,enlarged,23.5377426075
reverse,reversed,23.5903159464
decline,declined,23.8098451935
distinguish,distinguished,23.8505017382
cover,covered,24.1534819531
forme,formed,24.241076846
tunnel,tunneled,24.3234437051
abstract,abstracted,24.7647412817
cross,crossed,24.9149353431
insert,inserted,25.0693449242
return,returned,25.1001167639
regulate,regulated,25.1272255805
crush,crushed,25.4645285769
scar,scarred,25.8250792563
step,stepped,25.886991655
face,faced,26.479750561
genera,generalized,26.5789656517
register,registered,26.6715048554
experiment,experimented,26.9704424591
spot,spotted,27.176796949
post,posted,27.3648719226
prefer,preferred,27.4541583429
fall,fallen,27.5856546122
bloc,blocked,27.6776247748
border,bordered,27.7239816527
author,authorized,27.751772419
reflect,reflected,28.5401233865
band,banded,28.803784065
plate,plated,29.0113615932
class,classed,29.4585817816
complicate,complicated,29.4920191435
force,forced,29.6836418481
stand,standardized,29.7557958803
dilate,dilated,29.8668849156
shape,shaped,29.968138666
state,stated,30.4807955569
blur,blurred,30.8166859202
needle,needled,30.878217985
wall,walled,30.9170588569
resolve,resolved,31.2305514329
link,linked,31.4419204934
mark,marked,31.4661771922
comprise,comprised,31.5053059511
suspect,suspected,31.8987468246
sustain,sustained,31.9883980626
derive,derived,32.040793006
extract,extracted,32.0748717705
work,worked,32.0987194607
culture,cultured,32.2872159748
form,formed,32.4501337023
pattern,patterned,32.5327303445
rank,ranked,32.5343601463
balance,balanced,33.0196572374
cluster,clustered,33.1154576366
raise,raised,33.23481117
sector,sectored,33.343440831
line,lined,33.5216094544
rais,raised,33.5304383664
slope,sloped,34.0443348666
part,partitioned,34.2061837083
diffuse,diffused,34.4950547243
enhance,enhanced,34.6473186788
screen,screened,34.6733540975
point,pointed,35.8353480232
involve,involved,36.0344202221
condition,conditioned,36.4479142008
comb,combined,36.5928701347
transport,transported,36.76719058
combine,combined,36.7798287465
disorder,disordered,36.8468396116
course,coursed,36.8580102372
receive,received,37.0493329401
power,powered,37.0556476997
score,scored,37.155633768
order,ordered,37.5989341529
wound,wounded,37.6185925644
scale,scaled,38.0106332521
valve,valved,38.1074355874
assign,assigned,38.292792048
express,expressed,38.4230565444
grade,graded,38.6152728689
space,spaced,38.7124282562
size,sized,38.8061649952
confirm,confirmed,38.9440518107
select,selected,38.9942592279
need,needled,39.0289173624
note,noted,39.0630454166
repeat,repeated,39.1107328356
correct,corrected,39.2170697693
center,centered,39.2394186737
sele,selected,39.3073309287
color,colored,39.3501618665
practice,practiced,39.524707359
produce,produced,39.8143029875
peak,peaked,39.8254616066
target,targeted,39.9612497405
structure,structured,40.1759209864
value,valued,40.1964597576
position,positioned,40.3730662492
graft,grafted,41.2720147369
disease,diseased,41.4142537509
lamina,laminated,41.4674414384
weight,weighted,42.0103262686
elevate,elevated,42.1066268731
standard,standardized,42.2012183985
blind,blinded,42.4534038274
subject,subjected,42.6318127509
hand,handled,42.8050479926
calculate,calculated,42.8083333538
cent,centered,43.0256288932
collect,collected,43.0984858407
time,timed,43.2059999537
hand,handed,43.4822095904
stage,staged,43.5777782719
water,watershed,43.6215492742
layer,layered,43.6541382008
pair,paired,43.7210400714
block,blocked,43.8129597119
coll,collected,44.5094169821
curve,curved,44.6866039837
rate,rated,44.7532843286
group,grouped,44.9465054841
stem,stemmed,45.2993859876
pain,painted,45.8100199756
mask,masked,45.8267269072
test,tested,46.2285390744
prove,proved,46.968766479
provide,provided,47.4160632933
surface,surfaced,47.9085398332
associate,associated,48.2553247171
impact,impacted,48.3296521816
enroll,enrolled,49.4976528986
gene,generalized,49.8891890398
correlate,correlated,50.7163803071
show,shown,51.4546504386
reveal,revealed,51.9922087304
measure,measured,52.628639858
range,ranged,55.8933794987
include,included,57.2509548188
base,based,57.772658192
divide,divided,59.6960938365
carr,carried,60.0181893105
assess,assessed,60.6518650345
class,classified,62.6870597605
segment,segmented,68.4352830387
angle,angled,69.2801862438
define,defined,69.5892094335
design,designed,71.1345645774
determine,determined,74.2392132708

## group: bigrams
of,the,23.6500206341
in,the,24.9532052608
and,the,26.600392667
and,in,29.4766837086
for,the,30.5994758089
with,the,31.9906334663
of,glaucoma,33.6962428831
with,glaucoma,36.1457633418
glaucoma,and,37.3210397792
in,glaucoma,37.6563042459
glaucoma,in,37.6563042459
to,the,37.8777742602
by,the,41.7430974294
at,the,42.730976902
treatment,of,42.7998736259
from,the,42.9005567915
use,of,43.1435462365
of,this,47.5435633189
that,the,47.6045574744
number,of,48.5258799534
in,this,48.8307559148
on,the,50.4154196048
the,mean,52.3531120209
between,the,56.5005474354
effect,of,57.4232554482
associated,with,57.7592936456
the,study,65.4679199
the,anterior,73.4892802069
there,was,74.4254983436
the,optic,76.2627858474
ocular,hypertension,77.4862942985
this,study,81.1837980029
to,be,82.9524839536
to,determine,84.8307163869
to,evaluate,89.9965733092
visual,field,98.042378067
intraocular,pressure,106.309732014
visual,acuity,107.090696032
may,be,114.093251816
optic,disc,120.019984926
purpose,to,124.35423853
anterior,chamber,129.543916716
optic,nerve,136.44341283

