## group: nn_nns
stick,sticks,1.02026490001
obstetric,obstetrics,1.02978977634
asset,assets,1.27024968087
scratch,scratches,1.34759223158
surround,surroundings,1.38968199807
onward,onwards,1.69236860394
leech,leeches,1.72541934366
stock,stocks,1.73376192124
sport,sports,1.87639152448
proceed,proceeds,1.92192199673
blink,blinks,1.96638271083
caliper,calipers,2.14902707871
technic,technics,2.58025744381
chip,chips,2.79361357387
wage,wages,3.04530373977
mechanic,mechanics,3.05545349383
arch,arches,3.15019752502
synapse,synapses,3.3529625456
clip,clips,3.36982466491
backward,backwards,3.45803816796
outdoor,outdoors,3.68819811786
pharmacodynamic,pharmacodynamics,3.70442818233
sander,sanders,3.74720531629
quarter,quarters,3.90731506825
ground,grounds,4.03818239183
button,buttons,4.59284506183
hydrodynamic,hydrodynamics,4.84315088892
stay,stays,5.04949577492
street,streets,5.35628655246
syringe,syringes,5.49162489674
spectacle,spectacles,5.82763088214
harmonic,harmonics,5.84307832062
table,tables,6.47218584279
plastic,plastics,7.58909780404
gain,gains,8.20261524974
geriatric,geriatrics,8.5568660464
ellipse,ellipses,8.78310091177
turn,turns,8.80195877525
session,sessions,9.37461403496
class,classes,9.61131468764
cone,cones,10.4293973136
glass,glasses,11.2214095821
link,links,11.4067464249
base,bases,11.5935670458
phase,phases,12.6055759712
hemodynamic,hemodynamics,13.0468132508
content,contents,14.3151324964
remain,remains,14.5047138984
size,sizes,14.5187476871
work,works,15.7357358485
manner,manners,16.2812816467
scale,scales,16.2903239235
needle,needles,16.4302109094
night,nights,16.507689842
effect,effects,16.9739214957
biometric,biometrics,17.6083610249
need,needs,17.6771427453
morning,mornings,18.5687482535
color,colors,18.8287162089
pediatric,pediatrics,19.6145713726
diagnose,diagnoses,19.6855597552
damage,damages,19.968344206
wound,wounds,21.5833005926
term,terms,22.6900190243
time,times,22.8273965643
become,becomes,23.3087747507
brain,brains,24.109058992
heart,hearts,26.4796899099
analyse,analyses,26.9067725737
test,testes,27.6879803068
side,sides,34.6449985012

## group: nn_vbg
underpin,underpinning,0.779506239951
stitch,stitching,0.811977664901
unlock,unlocking,0.922932095657
perturb,perturbing,0.935160559405
afflict,afflicting,0.969871923854
finish,finishing,1.00342426162
unravel,unravelling,1.01121859477
depress,depressing,1.01853340471
shrink,shrinking,1.07189913435
void,voiding,1.08903599714
scratch,scratching,1.10721667298
weaken,weakening,1.14143479826
ladder,laddering,1.18872944978
lift,lifting,1.24723795983
forget,forgetting,1.25604635189
knock,knocking,1.35137162843
sweat,sweating,1.39317993239
sprout,sprouting,1.46642858503
resist,resisting,1.49966812263
farm,farming,1.53379118523
interrupt,interrupting,1.55488649719
talk,talking,1.55997486042
join,joining,1.58260012216
unravel,unraveling,1.59300443291
push,pushing,1.60639352775
ripe,ripening,1.63586904928
mold,molding,1.64264501346
tailor,tailoring,1.65565632654
discern,discerning,1.67086443502
reward,rewarding,1.67172763288
absorb,absorbing,1.67682786905
smart,smarting,1.68562021952
pick,pickering,1.70541639819
strengthen,strengthening,1.73246030068
hunt,hunting,1.75913689625
warn,warning,1.80187599567
tattoo,tattooing,1.82838710274
flush,flushing,1.8544335674
grasp,grasping,1.88976062943
appeal,appealing,1.89400222172
shea,sheathing,1.93916856074
shadow,shadowing,1.96332161035
worry,worrying,1.96618724162
wick,wicking,1.97750592019
speak,speaking,2.01131095799
kill,killing,2.04476683189
watch,watching,2.05455428328
multiply,multiplying,2.05562252567
weigh,weighing,2.06647072819
spark,sparkling,2.13928933948
satisfy,satisfying,2.19013443349
wash,washing,2.23863404391
cast,casting,2.32363988185
comb,combing,2.34679317152
book,booking,2.40258873907
disturb,disturbing,2.41456146383
alarm,alarming,2.41468928919
hatch,hatching,2.42243305396
crack,cracking,2.43745414864
float,floating,2.44181046264
cree,creeping,2.45169761183
recur,recurring,2.45509048178
weigh,weighting,2.45881041554
retard,retarding,2.49050616421
trap,trapping,2.56218767872
wish,wishing,2.57047221396
feed,feeding,2.58163756548
govern,governing,2.67200477787
disappear,disappearing,2.73955267724
auto,autografting,2.7544028948
seal,sealing,2.76797732342
partition,partitioning,2.78300100183
mislead,misleading,2.80388511633
poison,poisoning,2.83451307795
press,pressing,2.8471605801
consult,consulting,2.85091971542
shea,shearing,2.8514776764
proceed,proceeding,2.91303819497
creep,creeping,2.93689382349
sustain,sustaining,2.95759223132
cool,cooling,2.97344389001
mount,mounting,2.97895870246
justify,justifying,2.98725451762
convert,converting,3.08019549319
kiss,kissing,3.08629614343
dissect,dissecting,3.09219468042
taper,tapering,3.11701711646
club,clubbing,3.1325701942
sick,sickling,3.13580037532
shorten,shortening,3.22058627832
counteract,counteracting,3.3150779827
counter,counteracting,3.37048917438
tape,tapering,3.47715821575
path,pathfinding,3.51184955605
halt,halting,3.53824351798
chin,ching,3.65952512727
coat,coating,3.70634986601
render,rendering,3.83142787492
retain,retaining,3.84474713595
char,charting,3.87104521647
resp,respecting,3.93301705706
distress,distressing,3.95520077567
deal,dealing,3.959876587
seek,seeking,3.9643390024
enter,entering,3.96823608954
neighbor,neighboring,3.96849638215
autograft,autografting,4.25252885972
plug,plugging,4.26725611655
melt,melting,4.31177127955
genera,generating,4.31237533512
favor,favoring,4.33971736406
draw,drawing,4.52690361725
drift,drifting,4.52892155342
call,calling,4.54495867559
shield,shielding,4.70638755967
hold,holding,4.70781032898
wear,wearing,4.72498734535
think,thinking,4.7611142354
stiff,stiffening,4.85651398808
house,housekeeping,4.87483929988
awake,awakening,4.88097595957
mark,marking,4.89237177808
stiffen,stiffening,4.91824113208
agree,agreeing,5.0046504755
travel,traveling,5.02900108941
expand,expanding,5.06062186678
tail,tailoring,5.09684226252
possess,possessing,5.18746979149
feel,feeling,5.25563163784
demand,demanding,5.3115847925
walk,walking,5.42043168226
notch,notching,5.45798516057
match,matching,5.56145295352
stand,standing,5.59293849793
pertain,pertaining,5.65830054113
spread,spreading,5.68670626704
conflict,conflicting,5.8514064585
persist,persisting,5.89854409764
rais,raising,6.05973029622
arrest,arresting,6.15312552312
scaffold,scaffolding,6.2448079257
nick,nicking,6.29455241714
scatter,scattering,6.37240257222
stop,stopping,6.4601558376
break,breaking,6.46502710088
flank,flanking,6.58529819667
look,looking,6.70013054776
coup,coupling,6.70465110201
exceed,exceeding,6.74909281315
carry,carrying,6.77891873217
wait,waiting,6.7887992397
threat,threatening,7.02289677032
cloud,clouding,7.20181373485
cover,covering,7.53644090848
list,listening,7.67414153955
start,starting,7.71840485884
sheath,sheathing,7.89158832006
rest,resting,7.97797703304
switch,switching,7.98044856983
round,rounding,8.07129991753
fold,folding,8.27496924193
turn,turning,8.31531687225
shear,shearing,8.34254473231
peel,peeling,8.46042841156
yield,yielding,8.50774190717
extend,extending,8.62020792815
load,loading,8.63625273003
fail,failing,8.64219477058
miss,missing,8.6497612229
gain,gaining,8.69562489435
touch,touching,8.86976093812
invest,investigating,9.16364236088
carr,carrying,9.58908319908
grow,growing,10.0948777117
consent,consenting,10.1816694517
wild,wilding,10.18192768
deva,devastating,10.2656930563
plot,plotting,10.5480311695
cross,crossing,10.7095944726
distinguish,distinguishing,10.7156633872
comb,combining,10.8407660831
depend,depending,10.8527995054
teach,teaching,10.9287909781
scar,scarring,11.070405257
vault,vaulting,11.3394018393
reach,reaching,11.536611633
correct,correcting,11.596624924
shift,shifting,11.804316757
confound,confounding,11.8638035299
reason,reasoning,11.9482295906
worsen,worsening,12.0073790788
delay,delaying,12.0408674472
tend,tending,12.085577334
transfer,transferring,12.1441860142
begin,beginning,12.3720931737
exam,examining,12.9343714606
yellow,yellowing,13.2658323894
concern,concerning,13.2713941975
surround,surrounding,13.5883246211
link,linking,13.6636434107
school,schooling,13.9552809716
respect,respecting,14.1218628606
step,stepping,14.4206639381
tunnel,tunneling,14.4267336921
thick,thickening,14.5482128152
reveal,revealing,14.5518281887
foster,fostering,14.5928131906
treat,treating,14.7205462337
crush,crushing,14.7628807457
strength,strengthening,14.7921966139
project,projecting,14.8556664703
part,partitioning,14.9561422241
flicker,flickering,15.1304700818
fall,falling,15.2617064966
bloc,blocking,15.3577421328
confirm,confirming,15.4672473704
smooth,smoothing,15.4966946066
limit,limiting,15.6008211702
tilt,tilting,15.6141945699
interest,interesting,15.6291122031
cluster,clustering,15.6393650465
form,forming,15.6501626685
protect,protecting,15.6645791623
correspond,corresponding,16.0511785584
record,recording,16.1127666908
result,resulting,16.117810347
ring,ringing,16.1770769518
flash,flashing,16.4048500676
exact,exacting,16.4158932016
spot,spotting,16.7574647182
mode,modeling,16.9897028863
thin,thinking,17.0090793595
head,heading,17.0241724704
reflect,reflecting,17.0435314495
undergo,undergoing,17.2568083144
count,counteracting,17.3846792338
work,working,17.3858775643
compound,compounding,17.4155792505
regard,regarding,17.4321472678
alter,alternating,17.6239220231
fill,filling,17.7114151282
search,searching,17.8363923511
support,supporting,17.8553487931
suffer,suffering,17.8814689361
strip,stripping,18.1773907857
pattern,patterning,18.4375947724
point,pointing,18.7957078576
understand,understanding,18.8709885844
light,lighting,18.9069814385
model,modeling,19.5833177995
weight,weighting,19.8996784446
lamp,lamping,19.9650252939
seem,seeming,20.1167098024
shunt,shunting,20.5639147774
color,coloring,20.6026796001
cent,centering,20.7082807958
explain,explaining,20.7988484932
need,needing,20.9084867473
transport,transporting,21.3634267692
approach,approaching,21.4247764225
show,showing,21.4553966758
test,testing,21.4994240432
learn,learning,21.5350710342
deep,deepening,21.6761580496
chart,charting,21.6801125054
transform,transforming,21.7549776657
screen,screening,21.766969161
peak,peaking,21.9664965074
sleep,sleeping,22.3599549998
block,blocking,22.4221442558
thin,thinning,22.5042672116
help,helping,22.6135137117
heal,healing,22.8995212432
stain,staining,22.9062705702
dark,darkening,23.0208445426
actin,acting,23.0290242776
water,watering,23.1026184946
drop,dropping,23.1962539584
fast,fasting,23.2388359111
center,centering,24.0918977956
hand,handling,24.2587385101
visit,visiting,24.2780369336
tear,tearing,24.3567975028
accord,according,24.5991713679
suggest,suggesting,24.6473325081
affect,affecting,24.8358569325
filter,filtering,25.3814036526
gene,generating,25.7591291479
wound,wounding,26.3653473144
graft,grafting,26.477252455
need,needling,26.5941845448
stem,stemming,26.6339844743
survey,surveying,26.9190731365
design,designing,26.9557351061
cost,costing,28.5698641545
group,grouping,28.77589108
assay,assaying,29.2273842921
found,founding,35.6498233101
flow,flowing,35.91473617
lead,leading,36.200289746

## group: jj_jjr_jjs
young,younger,19.1660480784
high,highest,19.807790061
small,smaller,21.6838931295
high,higher,25.3043394475
great,greater,34.3817904214

## group: nn_vbd_vbn
fade,faded,0.816143759525
bevel,beveled,0.90311609292
traverse,traversed,0.934501481349
precondition,preconditioned,0.942176831153
hyper,hypertrophied,1.00422539237
enforce,enforced,1.04898726182
fire,fired,1.08002473585
plague,plagued,1.10528246557
silence,silenced,1.12289609656
multinucleate,multinucleated,1.16514326781
avert,averted,1.22842427812
bill,billed,1.26506922575
constrain,constrained,1.28571194897
tackle,tackled,1.34849830715
decompose,decomposed,1.35498566067
shea,sheathed,1.36513042195
conceal,concealed,1.37905108045
articulate,articulated,1.41398645312
sort,sorted,1.43403095787
concert,concerted,1.45684020421
tune,tuned,1.50831545028
convince,convinced,1.51270131397
finish,finished,1.53317110596
peel,peeled,1.54905779987
graduate,graduated,1.56607244101
engage,engaged,1.58382213651
lapse,lapsed,1.59424175659
acknowledge,acknowledged,1.61004858042
serra,serrated,1.65621951916
digest,digested,1.67488258453
buck,buckled,1.70287316644
tint,tinted,1.73360947213
erode,eroded,1.76976429348
sequester,sequestered,1.77466032795
restrain,restrained,1.78718324193
pick,picked,1.80436701866
waste,wasted,1.81940780075
assure,assured,1.87341582522
hyper,hyperpigmented,1.91452296748
retract,retracted,1.95928234602
belt,belted,1.97673316795
forgot,forgotten,2.00586149591
defer,deferred,2.08243591576
confound,confounded,2.09667501301
deform,deformed,2.10541000135
inspire,inspired,2.21955994852
merit,merited,2.22596436504
watch,watched,2.24878544186
flank,flanked,2.25201378926
book,booked,2.27230692773
saturate,saturated,2.29619535193
spark,sparked,2.31050578119
print,printed,2.32112196762
license,licensed,2.32146572428
stream,streamlined,2.47251523952
constrict,constricted,2.48569308005
polis,polished,2.53435841508
seal,sealed,2.60636997774
anchor,anchored,2.63016899829
gate,gated,2.6873310201
devote,devoted,2.69224581198
partition,partitioned,2.69578976483
handle,handled,2.71417468078
reform,reformed,2.76157287655
trap,trapped,2.80013780427
title,titled,2.86911648257
coil,coiled,2.90352385206
disperse,dispersed,2.90828588601
arch,arched,2.92750764688
taper,tapered,2.93819287759
threat,threaten,2.96208431982
warm,warmed,3.00702816892
hydrate,hydrated,3.11424411079
trabecula,trabeculated,3.1167453118
tape,tapered,3.14825638348
weigh,weighed,3.153847922
seed,seeded,3.15642656241
afflict,afflicted,3.17572606952
frost,frosted,3.21476617447
mail,mailed,3.23854407649
retard,retarded,3.24609197756
wish,wished,3.29031610999
distort,distorted,3.30125334488
educate,educated,3.39297243125
degrade,degraded,3.53215480819
conjugate,conjugated,3.55485714988
contract,contracted,3.56280665799
suppose,supposed,3.58540394632
interrupt,interrupted,3.61025422036
melt,melted,3.6231895472
smoke,smoked,3.73510187679
notch,notched,3.73861785517
wash,washed,3.764968322
super,superimposed,3.80110754456
crow,crowded,3.84124593773
ground,grounded,3.84847122649
compress,compressed,3.86948130515
track,tracked,3.91527314739
strip,stripped,3.94317821453
mirror,mirrored,4.02085803751
skill,skilled,4.03785179089
plug,plugged,4.10127599496
refine,refined,4.17283365325
bond,bonded,4.17533595556
illuminate,illuminated,4.18773149457
favor,favored,4.19587012652
sick,sickled,4.2930653727
compact,compacted,4.40552451927
learn,learned,4.49433993159
shield,shielded,4.53510761779
advise,advised,4.61709473347
striate,striated,4.63191924142
travel,traveled,4.69585679133
ciliate,ciliated,4.73565454496
perforate,perforated,4.81260604327
coat,coated,4.92242207855
replicate,replicated,4.93393778336
drain,drained,4.94266987029
dilute,diluted,4.95031470514
bridge,bridged,5.045726433
concentrate,concentrated,5.09301173074
rotate,rotated,5.168157509
travel,travelled,5.19549509299
decide,decided,5.21114374302
hope,hoped,5.25046224943
brand,branded,5.35362463889
reconstruct,reconstructed,5.38035343296
accomplish,accomplished,5.47922573208
puncture,punctured,5.49088844796
precipitate,precipitated,5.59917856461
accelerate,accelerated,5.59924472017
guard,guarded,5.78738113998
handicap,handicapped,5.91213044974
list,listed,5.99966461031
scatter,scattered,6.00827121408
instruct,instructed,6.02020929969
seat,seated,6.02218713589
oppose,opposed,6.03238363168
glue,glued,6.03503392779
expand,expanded,6.04968453712
cannula,cannulated,6.05236383988
restrict,restricted,6.14354418331
outline,outlined,6.21507367612
myelin,myelinated,6.23346069796
fuse,fused,6.30223213759
relieve,relieved,6.37627491553
intend,intended,6.38983207418
detach,detached,6.4409382328
desire,desired,6.45964439943
substitute,substituted,6.48564213098
possess,possessed,6.54643999526
surround,surrounded,6.97430217889
agree,agreed,7.00945398045
mela,melamed,7.0245360967
kind,kindred,7.13517717334
permit,permitted,7.21121359204
convert,converted,7.36805170555
reserve,reserved,7.52176985512
round,rounded,7.54041711187
adopt,adopted,7.76765527433
rest,restrained,8.18418104041
mount,mounted,8.3498081077
perfect,perfected,8.36722353831
sheath,sheathed,8.37682940487
trigger,triggered,8.44130221296
fold,folded,8.48464550105
augment,augmented,8.5163770131
coup,coupled,8.62543277375
couple,coupled,8.66894301018
plot,plotted,8.67323373199
incorporate,incorporated,8.6809526829
predispose,predisposed,8.70314788554
bound,bounded,8.77883209197
absorb,absorbed,9.11121678497
mani,manifested,9.15052312716
touch,touched,9.46805102967
buckle,buckled,9.52640106618
burn,burned,9.66070523722
extend,extended,9.71598351166
turn,turned,9.72697280617
fear,feared,9.73402914593
check,checked,9.77611417849
rest,restricted,9.90288980577
fill,filled,9.90808762146
connect,connected,10.1093121459
cover,covered,10.2341290989
load,loaded,10.3369347267
spike,spiked,10.376587198
price,priced,10.3948443204
sickle,sickled,10.4162891421
organ,organized,10.4898519122
stop,stopped,10.5586824777
transfer,transferred,10.6974907309
inform,informed,10.85156254
suppress,suppressed,11.0825005987
dissect,dissected,11.2221463844
compose,composed,11.2529508906
rupture,ruptured,11.2738981825
return,returned,11.3346014964
vault,vaulted,11.3898687106
switch,switched,11.5452726622
discover,discovered,11.6136278245
square,squared,11.7749740845
decline,declined,11.7997360181
warrant,warranted,12.1783770873
fashion,fashioned,12.2002795552
weigh,weighted,12.2103330183
reverse,reversed,12.2216021141
admit,admitted,12.2426163191
register,registered,12.2597007369
enlarge,enlarged,12.2855942197
fall,fallen,12.2913542579
prefer,preferred,12.3629019651
cross,crossed,12.4539384659
sight,sighted,12.4707674167
attach,attached,12.7315439386
force,forced,12.7597905775
band,banded,12.80908673
genera,generalized,12.8487082821
feature,featured,12.9108636342
fragment,fragmented,12.9669830364
suspect,suspected,13.3170748976
abstract,abstracted,13.3815288828
experiment,experimented,13.5229274815
atta,attached,13.5296190072
forme,formed,14.0050277396
rank,ranked,14.1046328146
tunnel,tunneled,14.243789607
employ,employed,14.2726239465
step,stepped,14.4175254216
crush,crushed,14.4977105365
regulate,regulated,14.6493809906
post,posted,14.8445040936
dilate,dilated,14.8980148908
part,partitioned,14.9267262368
branch,branched,14.9604651379
distinguish,distinguished,15.0166998927
insert,inserted,15.0571234691
scar,scarred,15.0817735857
state,stated,15.2070972632
class,classed,15.3591908084
line,lined,15.3853411756
raise,raised,15.4743017286
author,authorized,15.4962502074
face,faced,15.5564009403
train,trained,15.9283505309
shape,shaped,15.9831963918
stand,standardized,16.0230333456
culture,cultured,16.0711793393
plate,plated,16.1816828724
cluster,clustered,16.2996518506
spot,spotted,16.3851561927
bloc,blocked,16.6864734245
derive,derived,16.7375530739
border,bordered,16.9343666099
rais,raised,16.9726108421
repeat,repeated,17.1817815558
reflect,reflected,17.1982868438
sustain,sustained,17.5004350072
blur,blurred,17.6330417317
slope,sloped,17.7528729943
pattern,patterned,17.7690851589
form,formed,17.8214318128
needle,needled,17.9416990497
mark,marked,17.9687481399
work,worked,18.1050074887
color,colored,18.3290805244
link,linked,18.3717334466
complicate,complicated,18.513012802
screen,screened,18.5638893654
diffuse,diffused,18.5867152521
combine,combined,18.6043564716
comprise,comprised,18.7021931599
size,sized,18.786273615
course,coursed,18.8462508104
comb,combined,18.9022586785
point,pointed,19.0015328445
balance,balanced,19.2271190219
order,ordered,19.2926172258
standard,standardized,19.341528744
target,targeted,19.3943608383
select,selected,19.4381486586
structure,structured,19.5276757944
transport,transported,19.5528210097
correct,corrected,19.5678197928
wall,walled,19.8654317492
enhance,enhanced,19.9662153256
grade,graded,20.002588036
value,valued,20.0622587984
power,powered,20.0628750498
extract,extracted,20.3223553483
resolve,resolved,20.3346350526
position,positioned,20.5036095732
involve,involved,20.5870824931
peak,peaked,20.711596216
confirm,confirmed,20.8303600344
sector,sectored,20.86464639
pair,paired,20.9864248033
receive,received,21.2422720131
condition,conditioned,21.6254588232
express,expressed,21.7680767011
center,centered,21.8213572872
time,timed,21.8350201761
valve,valved,21.9708100528
sele,selected,22.0139743456
produce,produced,22.367974817
layer,layered,22.401235811
need,needled,22.4664326346
scale,scaled,22.4759904014
score,scored,22.4791087786
practice,practiced,22.8264489123
cent,centered,23.0015600702
stage,staged,23.0871119486
weight,weighted,23.0966035916
subject,subjected,23.1235417833
water,watershed,23.1597099067
rate,rated,23.3442434268
space,spaced,23.5692473611
disorder,disordered,23.7819269985
hand,handled,23.963230876
hand,handed,23.9862726242
elevate,elevated,24.4361119291
note,noted,24.5525115073
mask,masked,24.6925055255
assign,assigned,24.8486721621
curve,curved,25.0142377509
range,ranged,25.2968585609
block,blocked,25.3941510297
calculate,calculated,25.5726971406
wound,wounded,25.7110122495
blind,blinded,25.7257727745
surface,surfaced,25.9281980177
disease,diseased,26.0867017901
collect,collected,26.1066314012
pain,painted,26.2119389933
stem,stemmed,26.8809385639
impact,impacted,26.9834204529
design,designed,27.3475673565
associate,associated,27.5629361568
provide,provided,28.2074378317
group,grouped,28.3986022641
measure,measured,28.4606921805
coll,collected,28.5496059221
correlate,correlated,28.6376882552
test,tested,28.7896285726
base,based,29.0509346458
lamina,laminated,29.495163706
prove,proved,29.5585243677
gene,generalized,29.7360003807
graft,grafted,30.1720321388
enroll,enrolled,30.9152597614
divide,divided,31.8411391383
carr,carried,31.9817452244
reveal,revealed,32.4767762065
show,shown,33.3202287448
class,classified,34.1566059792
assess,assessed,34.2578728591
include,included,34.6785524951
define,defined,35.3000411616
determine,determined,39.8770797966
angle,angled,46.8445683191
segment,segmented,47.2300655821

## group: bigrams
of,the,8.00007000259
in,the,11.7121326793
and,the,12.069373189
and,in,12.4857742666
for,the,15.2999932943
of,glaucoma,16.7005936622
with,the,17.1344080945
to,the,17.3146697284
with,glaucoma,17.9581592051
in,glaucoma,18.119237986
glaucoma,in,18.119237986
glaucoma,and,19.1029719455
number,of,19.909675117
by,the,20.5000386434
of,this,22.3249182196
from,the,22.5030288333
in,this,23.5207188555
at,the,24.486406971
treatment,of,24.871783861
use,of,25.2633801203
on,the,25.4158674965
that,the,25.4700015371
between,the,28.4577399892
the,mean,30.7125432714
associated,with,31.9652835248
the,study,34.7843212021
effect,of,41.011701427
this,study,42.569656992
to,determine,48.2969322595
there,was,50.5166793269
the,anterior,52.9622853494
the,optic,53.854957233
to,evaluate,53.950733081
to,be,54.5146181836
purpose,to,62.065406786
ocular,hypertension,65.592963077
visual,field,75.4106017019
visual,acuity,77.3093457715
intraocular,pressure,78.058728618
may,be,79.97276295
optic,disc,85.5412587759
anterior,chamber,89.8894290334
optic,nerve,100.350896647

