"term1","term2","term3","term4","term5","term6","term7","term8","term9","term10","term11","term12","term13","term14","term15","term16","term17","term18","term19"
"effects","topical","treatment","effect","beta","drugs","side","drug","therapy","drops","ocular","administration","pilocarpine","dose","treated","systemic","mg","medications","blockers"
"glaucoma","early","diagnostic","specificity","stage","sensitivity","screening","diagnosis","detection","advanced","analysis","classification","ability","based","curve","moderate","positive","characteristic","methods"
"ocular","uveitis","disease","inflammation","treatment","chronic","systemic","inflammatory","clinical","therapy","steroid","secondary","severe","complications","endophthalmitis","infection","corticosteroids","cases","common"
"clinical","studies","data","evidence","trials","glaucoma","review","analysis","results","included","reported","literature","published","identified","trial","controlled","meta","criteria","search"
"method","model","data","images","system","based","imaging","image","technique","high","approach","time","information","fundus","methods","techniques","detection","proposed","monitoring"
"retinal","cell","cells","ganglion","rgc","retina","mice","rgcs","loss","death","induced","model","rat","nerve","degeneration","experimental","damage","optic","rats"
"eyes","results","fellow","methods","glaucomatous","control","purpose","treated","compared","showed","performed","included","study","conclusions","significantly","greater","twenty","evaluate","evaluated"
"bleb","surgery","filtering","scleral","conjunctival","filtration","blebs","technique","flap","subconjunctival","days","site","wound","conjunctiva","surgical","suture","performed","operation","anesthesia"
"trabeculectomy","surgery","months","postoperative","success","mmhg","complications","mitomycin","medications","surgical","mmc","follow","preoperative","combined","medication","rate","failure","fu","underwent"
"aqueous","outflow","trabecular","humor","meshwork","increase","increased","canal","facility","schlemm","min","sc","fluid","monkeys","human","resistance","normal","glaucomatous","experimental"
"cells","expression","human","beta","cell","protein","tm","factor","alpha","trabecular","growth","meshwork","tgf","cultured","induced","myocilin","mmp","matrix","proteins"
"age","population","years","study","prevalence","subjects","participants","oag","based","older","ci","diabetes","women","higher","examination","aged","persons","incidence","men"
"pressure","intraocular","glaucoma","long","term","elevated","pressures","increased","increase","control","short","elevation","effect","rise","lowering","high","controlled","raised","hypertension"
"eye","glaucoma","jr","developed","ma","previously","da","ra","left","determine","approximately","prior","demonstrated","van","rj","sa","gl","mr","resulted"
"blood","ocular","flow","retinal","vascular","artery","normal","ophthalmic","perfusion","vessels","pressure","systemic","doppler","arterial","velocity","central","subjects","healthy","retrobulbar"
"group","groups","significant","control","compared","lt","significantly","difference","study","statistically","differences","controls","higher","versus","patients","lower","compare","similar","comparison"
"timolol","latanoprost","treatment","ocular","combination","baseline","daily","therapy","patients","efficacy","hypertension","brimonidine","study","dorzolamide","bimatoprost","weeks","travoprost","fixed","randomized"
"retinal","detachment","diabetic","neovascular","vitreous","vitrectomy","retinopathy","macular","occlusion","injection","intravitreal","vein","hemorrhage","visual","pars","central","plana","silicone","bevacizumab"
"clinical","glaucoma","present","authors","discussed","important","simple","due","part","author","made","considered","difficult","general","order","diagnosis","paper","problems","result"
"glaucoma","cases","congenital","children","years","age","early","secondary","type","pediatric","diagnosis","onset","young","bilateral","aniridia","late","primary","unilateral","childhood"
"response","glaucoma","function","light","pattern","amplitude","visual","contrast","reduced","responses","functional","ms","perg","phase","recorded","normal","time","erg","early"
"patients","follow","years","outcome","year","months","time","retrospective","main","period","included","measures","study","range","design","rate","initial","rates","acuity"
"alpha","drug","receptor","ca","release","inhibitors","ocular","rabbits","effects","activity","receptors","delivery","effect","ii","carbonic","rabbit","anhydrase","vitro","induced"
"lt","high","significantly","results","low","length","age","myopia","methods","axial","purpose","refractive","conclusions","gt","myopic","error","increased","study","degree"
"role","mechanisms","diseases","development","disease","system","function","involved","pathogenesis","important","evidence","related","including","mechanism","play","studies","specific","molecular","type"
"corneal","central","cct","measurements","thickness","measured","tonometry","iop","goldmann","applanation","tonometer","measurement","gat","ocular","microm","mmhg","values","correlation","difference"
"test","perimetry","normal","sensitivity","ocular","subjects","frequency","hypertension","results","glaucoma","abnormal","automated","tests","testing","oht","glaucomatous","standard","fdt","contrast"
"gene","mutations","genetic","family","rs","mutation","identified","association","myoc","genes","cyp","disease","analysis","controls","polymorphisms","dna","affected","variants","individuals"
"levels","ml","level","free","concentration","surface","ocular","concentrations","plasma","serum","increased","acid","samples","oxidative","pg","control","higher","results","tear"
"glaucoma","angle","open","primary","poag","tension","normal","ntg","patients","subjects","chronic","found","sleep","types","htg","glaucomas","pseudoexfoliative","diagnosed","pexg"
"glaucoma","disease","treatment","review","management","recent","current","therapeutic","diseases","potential","research","development","include","future","therapy","including","article","important","understanding"
"glaucoma","care","patient","health","cost","quality","life","medical","adherence","ophthalmologists","medication","questionnaire","practice","ophthalmology","hospital","costs","general","compliance","clinic"
"glaucoma","study","results","methods","purpose","performed","found","number","conclusions","de","conclusion","aim","observed","jm","studied","total","showed","determine","evaluation"
"laser","treatment","treated","months","trabeculoplasty","yag","therapy","argon","slt","medical","cyclophotocoagulation","effective","performed","diode","procedure","alt","reduction","energy","selective"
"visual","vision","blindness","eye","acuity","impairment","related","cataract","diseases","age","low","loss","degeneration","blind","macular","disease","retinopathy","diabetic","people"
"results","agreement","analysis","measurements","methods","test","variability","correlation","change","values","obtained","standard","variation","reproducibility","coefficient","differences","measurement","purpose","conclusions"
"fiber","superior","nerve","normal","retinal","layer","scanning","temporal","parameters","inferior","laser","subjects","nasal","gdx","correlation","healthy","glaucomatous","average","values"
"anterior","angle","closure","chamber","iris","segment","peripheral","acute","pacg","depth","primary","ultrasound","pupillary","gonioscopy","biomicroscopy","block","iridotomy","angles","narrow"
"optic","disc","nerve","area","head","cup","glaucomatous","rim","ratio","onh","hrt","damage","neuropathy","normal","disk","atrophy","parameters","retina","heidelberg"
"risk","factors","ci","glaucoma","analysis","study","regression","association","ratio","factor","chinese","wang","odds","multivariate","interval","development","higher","confidence","chen"
"visual","field","loss","progression","defects","vf","md","deviation","db","fields","defect","glaucomatous","humphrey","standard","damage","perimetry","pattern","central","threshold"
"iop","mm","hg","pressure","intraocular","mmhg","reduction","lt","baseline","day","sd","hours","diurnal","hour","iops","gt","elevation","position","decrease"
"ciliary","tissue","body","cells","microscopy","lamina","cribrosa","lc","epithelium","human","sclera","collagen","surface","electron","membrane","posterior","light","material","normal"
"corneal","endothelial","graft","keratoplasty","tumor","penetrating","melanoma","cell","cases","cornea","months","enucleation","epithelial","secondary","failure","descemet","uveal","survival","radiation"
"cataract","lens","surgery","posterior","visual","intraocular","implantation","postoperative","iol","acuity","extraction","complications","phacoemulsification","combined","chamber","anterior","lenses","surgical","preoperative"
"syndrome","pseudoexfoliation","iris","pex","pigment","exfoliation","findings","ocular","clinical","features","abnormalities","pigmentary","dispersion","weber","xfs","disorder","present","pigmentation","disease"
"glaucoma","surgery","implant","drainage","tube","surgical","implantation","device","ahmed","valve","months","complications","postoperative","results","procedures","implants","shunt","refractory","case"
"thickness","oct","rnfl","optical","tomography","coherence","retinal","layer","macular","nerve","sd","fiber","domain","mum","measurements","average","spectral","parameters","imaging"
"patients","glaucoma","results","study","methods","conclusion","purpose","patient","observed","background","evaluated","aim","japanese","examined","twenty","diagnosed","evaluate","found","investigated"
"case","patient","report","year","eye","examination","left","bilateral","presented","diagnosis","pain","dogs","revealed","acute","symptoms","secondary","rare","history","diagnosed""
