## group: nn_nns
stick,sticks,0.712662661023
obstetric,obstetrics,0.787932981121
leech,leeches,0.880958740965
scratch,scratches,0.925014770011
asset,assets,1.00044654925
onward,onwards,1.02521326595
caliper,calipers,1.04190118315
stock,stocks,1.06468975801
technic,technics,1.08839686893
sport,sports,1.12519187146
wage,wages,1.23691446519
surround,surroundings,1.27920631393
mechanic,mechanics,1.51446627325
clip,clips,1.53514609923
chip,chips,1.6193349107
proceed,proceeds,1.76794573638
outdoor,outdoors,1.87678081733
blink,blinks,1.88526599729
arch,arches,1.89252137856
button,buttons,2.18770550389
syringe,syringes,2.23232533385
quarter,quarters,2.23803704278
backward,backwards,2.27127424941
pharmacodynamic,pharmacodynamics,2.28442225411
synapse,synapses,2.36783983876
ground,grounds,2.68228228944
sander,sanders,2.75013716404
spectacle,spectacles,2.85592446285
street,streets,2.93278172821
plastic,plastics,3.17774505769
session,sessions,3.46724065252
stay,stays,3.63154674543
gain,gains,3.81023618389
effect,effects,3.86391268287
harmonic,harmonics,3.92742077503
hydrodynamic,hydrodynamics,4.02534074556
table,tables,4.08568864658
content,contents,4.38581682696
link,links,4.44144495644
geriatric,geriatrics,4.4430133708
phase,phases,4.5991359154
cone,cones,4.61334718211
turn,turns,4.72991064485
scale,scales,4.75346754404
class,classes,4.80665338705
size,sizes,4.83547987063
remain,remains,4.85517430705
work,works,5.19681861415
ellipse,ellipses,5.34126539327
glass,glasses,5.4652366423
base,bases,5.75597136444
damage,damages,6.31487609835
night,nights,6.41511783563
brain,brains,6.75637883017
need,needs,6.76607775093
hemodynamic,hemodynamics,6.86615511224
pediatric,pediatrics,6.88501266126
needle,needles,7.23757483599
morning,mornings,7.30542182504
color,colors,7.34707500563
manner,manners,7.37629193417
become,becomes,7.56237454673
time,times,8.26309729007
biometric,biometrics,8.34471052327
diagnose,diagnoses,8.60635438111
test,testes,8.66241945584
analyse,analyses,8.70718223717
term,terms,8.72451137455
wound,wounds,8.77739037247
heart,hearts,9.57220706768
side,sides,9.83370706722

