our	1	1	PRP$
them	1	1	PRP
me	1	1	PRP
she	1	1	PRP
he	1	1	PRP
it	1	1	PRP
themselves	1	1	PRP
my	1	1	PRP$
her	1	1	PRP$
us	1	1	PRP
his	1	1	PRP$
their	1	1	PRP$
its	1	1	PRP$
your	1	1	PRP$
you	1	1	PRP
they	1	1	PRP
itself	1	1	PRP
him	1	1	PRP
we	1	1	PRP
himself	1	1	PRP
--------
who	1	1	WP
whose	1	1	WP$
what	1	1	WP
whom	1	1	WP
--------
when	1	1	WRB
why	1	1	WRB
where	1	1	WRB
how	1	1	WRB
--------
