## group: nn_nns
stick,sticks,0.573307445555
onward,onwards,0.592841730352
obstetric,obstetrics,0.735221161182
wage,wages,0.809269878087
asset,assets,0.822855446193
scratch,scratches,0.880179514761
sport,sports,0.910502396548
caliper,calipers,0.9718869171
leech,leeches,0.976887498739
clip,clips,1.00428120403
effect,effects,1.02778484314
technic,technics,1.11240646823
stock,stocks,1.11455905574
surround,surroundings,1.15323417077
arch,arches,1.15841387828
button,buttons,1.2078188392
outdoor,outdoors,1.23913617
phase,phases,1.27754824993
remain,remains,1.3808566093
gain,gains,1.41099777336
ground,grounds,1.46979747976
scale,scales,1.47535506026
proceed,proceeds,1.49317504027
blink,blinks,1.49645499509
session,sessions,1.51150446203
damage,damages,1.54020692334
chip,chips,1.56585904295
size,sizes,1.61911754908
synapse,synapses,1.64709718796
syringe,syringes,1.65536455038
mechanic,mechanics,1.6579767725
street,streets,1.67968267999
need,needs,1.68887325558
spectacle,spectacles,1.78420659759
stay,stays,1.81312657286
backward,backwards,1.87866714323
quarter,quarters,1.88689015242
class,classes,1.89599183243
base,bases,1.8972934427
work,works,1.99921881001
content,contents,2.06588922822
sander,sanders,2.21593678927
link,links,2.3259904928
plastic,plastics,2.37334192451
table,tables,2.46706199819
harmonic,harmonics,2.46847140061
pharmacodynamic,pharmacodynamics,2.51376547742
brain,brains,2.61052708444
hydrodynamic,hydrodynamics,2.73827039662
color,colors,3.0323251318
diagnose,diagnoses,3.09555410844
turn,turns,3.12560580412
cone,cones,3.27795163757
analyse,analyses,3.33114824595
night,nights,3.34563047784
manner,manners,3.37300063828
become,becomes,3.51266512378
time,times,3.52229943582
geriatric,geriatrics,3.52984956261
test,testes,3.56646609365
pediatric,pediatrics,3.633601794
ellipse,ellipses,3.65153847004
glass,glasses,3.66805102164
term,terms,3.90144200251
needle,needles,3.96016230245
morning,mornings,3.98938369276
hemodynamic,hemodynamics,4.25172451199
wound,wounds,4.9299999024
side,sides,5.23704394601
biometric,biometrics,6.55759073165
heart,hearts,6.9392663996

