## group: bigrams
of,the,11.3426538056
in,the,13.6094155795
and,the,15.0895268999
and,in,15.5005107213
for,the,19.1665669945
to,the,19.7648584349
by,the,20.5019030446
with,the,20.6048938094
from,the,23.0868318139
of,glaucoma,23.3517682682
with,glaucoma,23.7616563859
on,the,24.0590875202
of,this,24.6494736157
in,glaucoma,24.9452454663
glaucoma,in,24.9452454663
number,of,26.1296624403
in,this,26.2057811658
at,the,26.9099710098
glaucoma,and,27.9769539566
use,of,28.9707457896
treatment,of,28.9799404324
that,the,29.9022305086
between,the,30.0712832635
associated,with,33.7783621335
ocular,hypertension,36.5191930744
effect,of,40.2183132328
the,mean,41.2437433765
this,study,41.7245313904
the,study,44.3323252718
there,was,56.0044560619
to,determine,57.2131025162
the,anterior,62.7624842265
to,evaluate,67.9854554974
the,optic,75.2045691258
to,be,78.4379909434
visual,field,93.8339986832
intraocular,pressure,100.095778645
visual,acuity,102.73469656
purpose,to,111.288975364
anterior,chamber,114.029532477
may,be,118.553198706
optic,disc,121.265989532
optic,nerve,148.029115768

