## group: nn_nns
obstetric,obstetrics,0.81214968243
stick,sticks,0.98752544966
surround,surroundings,1.08904161251
scratch,scratches,1.15303745643
asset,assets,1.18245106785
onward,onwards,1.28019719048
leech,leeches,1.34414802853
stock,stocks,1.4479856455
caliper,calipers,1.69639648105
technic,technics,1.76217746768
sport,sports,1.77022490704
chip,chips,1.77893099092
blink,blinks,1.89272748992
proceed,proceeds,2.03577641009
mechanic,mechanics,2.06740983427
wage,wages,2.16375349938
arch,arches,2.43807748007
outdoor,outdoors,2.58118594244
synapse,synapses,2.6004597902
clip,clips,2.66454745781
pharmacodynamic,pharmacodynamics,3.10654422753
ground,grounds,3.29696070199
quarter,quarters,3.30547921963
backward,backwards,3.33340322831
sander,sanders,3.3604870821
button,buttons,3.4660790713
syringe,syringes,4.04903912407
hydrodynamic,hydrodynamics,4.20423759663
street,streets,4.25372578785
spectacle,spectacles,4.45677829001
stay,stays,4.92399561562
harmonic,harmonics,5.08752788921
plastic,plastics,5.56993876315
table,tables,6.04611838489
geriatric,geriatrics,6.40182859933
turn,turns,7.1090638405
gain,gains,7.28847992804
session,sessions,7.47086295259
ellipse,ellipses,7.98172109815
cone,cones,8.24643492444
class,classes,8.75332317183
link,links,9.05898278691
glass,glasses,9.06097654904
base,bases,9.40441292326
phase,phases,10.5979735049
content,contents,11.4748228244
size,sizes,12.1371492592
remain,remains,12.1642154045
hemodynamic,hemodynamics,12.1763634312
night,nights,12.7273519409
effect,effects,12.9425235863
work,works,13.1441530227
needle,needles,13.3294274387
manner,manners,13.5889502491
morning,mornings,14.0443871711
scale,scales,14.2745396086
pediatric,pediatrics,14.4203337355
biometric,biometrics,14.4685785004
color,colors,14.7972481998
need,needs,14.8065592505
diagnose,diagnoses,16.5448143888
damage,damages,17.1512602296
brain,brains,17.6748354782
wound,wounds,17.9615126409
become,becomes,18.4002355737
time,times,19.1755815011
term,terms,19.4319061033
heart,hearts,21.1769155968
analyse,analyses,21.5404855943
test,testes,23.1300339093
side,sides,26.111185713

