## group: nn_vbd_vbn
convince,convinced,0.575745769464
hyper,hypertrophied,0.607815978239
enforce,enforced,0.636002363774
precondition,preconditioned,0.655019874793
fade,faded,0.66907889497
traverse,traversed,0.68603222163
restrain,restrained,0.689456765988
shea,sheathed,0.730250443141
concert,concerted,0.758828565218
lapse,lapsed,0.761142039557
silence,silenced,0.789249118777
articulate,articulated,0.803935685807
bevel,beveled,0.807110451781
multinucleate,multinucleated,0.822316119275
avert,averted,0.856029577557
conceal,concealed,0.878416867331
tune,tuned,0.891408867816
plague,plagued,0.908021080313
fire,fired,0.91231418847
buck,buckled,0.951505658384
constrain,constrained,0.966255141332
peel,peeled,0.984193887498
engage,engaged,1.08770876754
bill,billed,1.11237281159
forgot,forgotten,1.11654489522
decompose,decomposed,1.17163839463
sort,sorted,1.17948059574
graduate,graduated,1.18024062875
tackle,tackled,1.18734965248
digest,digested,1.1923835684
erode,eroded,1.19351286579
defer,deferred,1.2203507164
sequester,sequestered,1.23941350943
hyper,hyperpigmented,1.24041369686
watch,watched,1.28059873308
retract,retracted,1.29776690186
title,titled,1.29992457735
waste,wasted,1.30737975297
acknowledge,acknowledged,1.33947273949
polis,polished,1.34918914181
finish,finished,1.37121320975
saturate,saturated,1.38461765241
tint,tinted,1.41827424539
serra,serrated,1.46743817148
deform,deformed,1.47557724831
spark,sparked,1.52779318323
book,booked,1.56082261381
assure,assured,1.57129683089
license,licensed,1.59422204129
pick,picked,1.61665340783
flank,flanked,1.63964195092
inspire,inspired,1.70196717876
print,printed,1.73935072157
trap,trapped,1.77565213771
gate,gated,1.77748111657
seal,sealed,1.79708810688
contract,contracted,1.82584515694
anchor,anchored,1.8393600517
confound,confounded,1.85019693482
constrict,constricted,1.857749502
belt,belted,1.87898672244
reform,reformed,1.88983716055
stream,streamlined,1.90295440066
seed,seeded,1.90783827313
merit,merited,1.95664717827
afflict,afflicted,1.97973532186
devote,devoted,1.98594081718
coil,coiled,2.02680648469
trabecula,trabeculated,2.04266773378
arch,arched,2.07608730632
wish,wished,2.14065094664
degrade,degraded,2.2086705878
disperse,dispersed,2.21549716718
handle,handled,2.29021650821
taper,tapered,2.30625314917
conjugate,conjugated,2.31898719846
warm,warmed,2.41700269068
smoke,smoked,2.42946313096
compress,compressed,2.50170592905
frost,frosted,2.51832927476
partition,partitioned,2.5374016256
weigh,weighed,2.541385144
tape,tapered,2.56369069184
bond,bonded,2.58007946678
notch,notched,2.58054002522
hydrate,hydrated,2.58793053976
distort,distorted,2.634601362
retard,retarded,2.63975932975
crow,crowded,2.66616654639
educate,educated,2.74348508944
ciliate,ciliated,2.74361851742
track,tracked,2.75370605861
mail,mailed,2.75390157747
interrupt,interrupted,2.78689507911
coat,coated,2.79086687614
ground,grounded,2.80247156266
threat,threaten,2.81723349826
strip,stripped,2.85752172872
skill,skilled,2.87141107329
super,superimposed,2.87680524418
brand,branded,2.97286069085
sick,sickled,3.0112498918
bridge,bridged,3.03799713324
suppose,supposed,3.05075554332
melt,melted,3.06212576733
refine,refined,3.07596992468
plug,plugged,3.0933055176
perforate,perforated,3.11513847883
striate,striated,3.14340872422
dilute,diluted,3.16840512882
travel,traveled,3.19196130742
mirror,mirrored,3.26573750277
favor,favored,3.34622057016
travel,travelled,3.3841953638
illuminate,illuminated,3.3907348717
advise,advised,3.4389360433
reconstruct,reconstructed,3.4792227152
rotate,rotated,3.55867680282
compact,compacted,3.628746961
hope,hoped,3.64227406206
concentrate,concentrated,3.64957829248
learn,learned,3.65704383584
wash,washed,3.66032452242
replicate,replicated,3.66138100665
instruct,instructed,3.86853421852
drain,drained,3.89672577554
accelerate,accelerated,3.92048928897
shield,shielded,3.97890643778
puncture,punctured,4.01093525244
decide,decided,4.11836647647
myelin,myelinated,4.13466123004
scatter,scattered,4.17154156441
fuse,fused,4.20102796177
list,listed,4.26840386141
accomplish,accomplished,4.30501484407
round,rounded,4.3901989158
precipitate,precipitated,4.50626294499
possess,possessed,4.51735349957
seat,seated,4.52376054001
handicap,handicapped,4.58072336527
detach,detached,4.62529708208
glue,glued,4.66581842162
guard,guarded,4.68236707796
agree,agreed,4.78273882982
restrict,restricted,4.90122406993
desire,desired,4.91766958082
outline,outlined,4.99606939226
cannula,cannulated,5.05733659717
kind,kindred,5.11594038758
relieve,relieved,5.13308650046
fold,folded,5.13574787358
expand,expanded,5.21458189643
sheath,sheathed,5.27831726028
mount,mounted,5.39459813446
bound,bounded,5.5469318528
surround,surrounded,5.58806361323
substitute,substituted,5.59373990478
force,forced,5.77322911738
mela,melamed,5.77482317026
intend,intended,5.78234007025
predispose,predisposed,5.79476712054
adopt,adopted,5.81786671571
permit,permitted,5.87954759309
rest,restrained,5.93314949827
fear,feared,6.03935601187
oppose,opposed,6.07983673964
perfect,perfected,6.12342253892
absorb,absorbed,6.1486855493
couple,coupled,6.16155148431
coup,coupled,6.19834950641
convert,converted,6.40766305356
fill,filled,6.41136226203
trigger,triggered,6.44717717891
incorporate,incorporated,6.4973691406
burn,burned,6.55037016168
turn,turned,6.57879113837
load,loaded,6.59223188908
extend,extended,6.65001427359
price,priced,6.6668458434
reserve,reserved,6.75011500387
plot,plotted,6.81231345373
abstract,abstracted,6.93032783125
connect,connected,7.00384829786
mani,manifested,7.16613617629
touch,touched,7.21502501108
buckle,buckled,7.26722142806
augment,augmented,7.43152297114
rupture,ruptured,7.46568105031
suppress,suppressed,7.57866705965
check,checked,7.58216163751
enlarge,enlarged,7.58498488101
stop,stopped,7.59304388466
square,squared,7.62736160765
dissect,dissected,7.66880745708
rest,restricted,7.77841869767
spike,spiked,7.98179269872
return,returned,7.99188361011
experiment,experimented,8.08503662779
suspect,suspected,8.11363053013
inform,informed,8.11837579784
compose,composed,8.12541130688
weigh,weighted,8.143246711
fall,fallen,8.16885646965
culture,cultured,8.31321672081
genera,generalized,8.32368791095
band,banded,8.47621857224
reverse,reversed,8.48489984088
vault,vaulted,8.48864109176
transfer,transferred,8.56143098395
attach,attached,8.61848300026
prefer,preferred,8.66043658065
face,faced,8.71344248388
crush,crushed,8.81321760577
organ,organized,8.83432882877
sickle,sickled,9.00969838336
warrant,warranted,9.06165801983
fashion,fashioned,9.17596261452
cover,covered,9.19204949548
cluster,clustered,9.23864052121
admit,admitted,9.28252967725
fragment,fragmented,9.28497507463
feature,featured,9.34632570312
atta,attached,9.35161722485
discover,discovered,9.35404147277
rank,ranked,9.44835154092
decline,declined,9.72895430676
plate,plated,9.74079062861
stand,standardized,9.75800338778
register,registered,9.83458802084
switch,switched,9.8485053983
sight,sighted,9.9251252156
train,trained,9.98422362011
part,partitioned,10.1687099194
repeat,repeated,10.1974138922
distinguish,distinguished,10.2263093677
line,lined,10.3195387693
branch,branched,10.3867628796
raise,raised,10.3920554974
scar,scarred,10.4065322702
comprise,comprised,10.4264362607
tunnel,tunneled,10.4768119216
dilate,dilated,10.4771623873
employ,employed,10.4942958672
sustain,sustained,10.5849031029
class,classed,10.6038415273
shape,shaped,10.6182521948
forme,formed,10.7048406766
cross,crossed,10.7946990638
spot,spotted,10.8112597013
state,stated,10.8392131333
insert,inserted,10.8476269781
position,positioned,10.9019296027
regulate,regulated,10.9888171647
step,stepped,11.0177536577
color,colored,11.0445604073
border,bordered,11.0999203899
slope,sloped,11.1180570721
author,authorized,11.1477739395
pattern,patterned,11.2517592612
bloc,blocked,11.289196925
post,posted,11.3971977748
reflect,reflected,11.4416351222
transport,transported,11.4592627551
blur,blurred,11.5495855641
needle,needled,11.6576695889
peak,peaked,11.8529111403
rais,raised,11.8563808787
work,worked,11.9732967307
balance,balanced,11.9963523873
target,targeted,12.0874238738
diffuse,diffused,12.1225171262
resolve,resolved,12.1273408345
standard,standardized,12.1577862415
combine,combined,12.2509629869
comb,combined,12.3158064942
size,sized,12.4271948848
sector,sectored,12.4593867813
wall,walled,12.4722332897
grade,graded,12.4817188696
order,ordered,12.52367647
score,scored,12.6331978914
correct,corrected,12.6397583918
derive,derived,12.7064237688
scale,scaled,12.7297410746
select,selected,12.7471640632
pair,paired,12.7493565843
value,valued,12.8376442873
screen,screened,12.8538325993
enhance,enhanced,12.9336284947
valve,valved,13.0519459435
power,powered,13.0973863671
structure,structured,13.136854667
complicate,complicated,13.1694588523
course,coursed,13.192684195
mark,marked,13.2042617655
extract,extracted,13.2676055202
weight,weighted,13.3909307437
form,formed,13.4458536763
water,watershed,13.5157081526
point,pointed,13.5261938635
involve,involved,13.5332406698
center,centered,13.6742576428
sele,selected,13.9930255539
space,spaced,14.2353564373
practice,practiced,14.2727832738
link,linked,14.3798898011
pain,painted,14.5092138628
prove,proved,14.5406834734
stage,staged,14.5446824013
produce,produced,14.5645002609
blind,blinded,14.5657867217
surface,surfaced,14.5690340147
hand,handed,14.7236092821
elevate,elevated,14.787749926
need,needled,14.7971778561
hand,handled,14.9437167527
wound,wounded,15.1456873854
layer,layered,15.2293270331
condition,conditioned,15.2469397311
impact,impacted,15.3000735991
express,expressed,15.4336021041
mask,masked,15.4998781185
assign,assigned,15.5455151304
note,noted,15.6595316266
rate,rated,15.7990146649
confirm,confirmed,15.8578222863
time,timed,15.9033232211
disorder,disordered,16.1022503684
stem,stemmed,16.1359869144
cent,centered,16.2850303364
curve,curved,16.285259285
collect,collected,16.2883888666
correlate,correlated,16.5399582826
design,designed,16.7423540058
receive,received,16.7516605509
range,ranged,16.779085569
subject,subjected,16.882895799
enroll,enrolled,17.0519257932
disease,diseased,17.0749264804
provide,provided,17.1441385404
test,tested,17.175156192
base,based,17.3694353949
coll,collected,17.4018763555
block,blocked,17.4925593747
calculate,calculated,17.8426526645
group,grouped,17.9068387205
gene,generalized,17.9322082209
graft,grafted,17.9870226094
reveal,revealed,18.3188335592
divide,divided,18.9143293366
lamina,laminated,18.9555169991
measure,measured,19.4137981881
show,shown,19.7904629329
include,included,20.054661283
define,defined,20.6449398001
segment,segmented,20.7197993092
carr,carried,20.7242043812
associate,associated,20.7500776434
assess,assessed,21.2050596629
angle,angled,21.2336482798
class,classified,21.605802662
determine,determined,22.0434353956

