## group: nn_vbd_vbn
note,noted,0.0600407164597
reveal,revealed,0.0647967611285
smoke,smoked,0.0776693940756
require,required,0.080843419585
agree,agreed,0.0874583951653
receive,received,0.0923763029667
involve,involved,0.0940445994295
base,based,0.0997300997324
increase,increased,0.104087174312
check,checked,0.128102414094
state,stated,0.151379112227
stage,staged,0.156210169024
confirm,confirmed,0.16095916053
return,returned,0.164433395958
stop,stopped,0.172601154287
suspect,suspected,0.188383849169
order,ordered,0.221444088745
include,included,0.224909578761
provide,provided,0.255551388021
determine,determined,0.263063842264
form,formed,0.386637085147
decide,decided,0.395469580402
outline,outlined,0.432115839872
repeat,repeated,0.442889237277
inform,informed,0.446807194675
work,worked,0.448646265502
assess,assessed,0.471102603746
extend,extended,0.581691092169

