## group: nn_vbd_vbn
enforce,enforced,0.594793865846
hyper,hypertrophied,0.662639293562
restrain,restrained,0.73077060595
multinucleate,multinucleated,0.758769377415
lapse,lapsed,0.760288612399
fade,faded,0.786857662074
precondition,preconditioned,0.800365244909
constrain,constrained,0.852189694928
convince,convinced,0.859319652553
avert,averted,0.870196214769
shea,sheathed,0.883010903023
concert,concerted,0.888393550582
buck,buckled,0.89381411808
conceal,concealed,0.908022052966
bill,billed,0.919779327075
traverse,traversed,0.974698142832
fire,fired,0.988980017531
articulate,articulated,1.02231161231
silence,silenced,1.03587837799
tune,tuned,1.08521925809
bevel,beveled,1.14061291996
plague,plagued,1.20328418082
polis,polished,1.24878874568
tackle,tackled,1.2783466144
engage,engaged,1.27847965682
finish,finished,1.27953668526
watch,watched,1.2921616134
peel,peeled,1.33561436033
erode,eroded,1.33998646502
sort,sorted,1.3443606518
hyper,hyperpigmented,1.3515393749
serra,serrated,1.37577452673
forgot,forgotten,1.37739547587
graduate,graduated,1.38363005877
waste,wasted,1.38825726207
digest,digested,1.41297255388
sequester,sequestered,1.41992571234
title,titled,1.44127373841
saturate,saturated,1.48952678717
book,booked,1.52043311164
pick,picked,1.55359823549
retract,retracted,1.60665331805
tint,tinted,1.61628937393
defer,deferred,1.65053376164
gate,gated,1.67640940733
decompose,decomposed,1.69495565345
assure,assured,1.70607373753
spark,sparked,1.73021104613
acknowledge,acknowledged,1.80965775788
coil,coiled,1.86316690695
contract,contracted,1.86461458563
deform,deformed,1.88185016009
trap,trapped,1.88289750667
license,licensed,1.95793528719
taper,tapered,2.01499100548
reform,reformed,2.02199872558
trabecula,trabeculated,2.04278708629
belt,belted,2.04764647203
disperse,dispersed,2.09645542811
seal,sealed,2.12488901594
flank,flanked,2.13891930278
seed,seeded,2.14584132602
print,printed,2.17732874357
inspire,inspired,2.18566655794
conjugate,conjugated,2.20706482744
stream,streamlined,2.25135500464
notch,notched,2.25172526453
merit,merited,2.25345750534
constrict,constricted,2.26372509035
confound,confounded,2.26534986639
tape,tapered,2.27051516271
ciliate,ciliated,2.28775856337
devote,devoted,2.35839702118
frost,frosted,2.39430968562
afflict,afflicted,2.41016587511
degrade,degraded,2.42483821428
wish,wished,2.42753652654
compress,compressed,2.4417143084
arch,arched,2.48540812425
smoke,smoked,2.53038729764
dilute,diluted,2.55589170627
brand,branded,2.58347047009
crow,crowded,2.58875254055
anchor,anchored,2.59472589378
hydrate,hydrated,2.631764475
bond,bonded,2.63375389277
handle,handled,2.66065584858
warm,warmed,2.68394393799
partition,partitioned,2.73034489966
weigh,weighed,2.77115641243
threat,threaten,2.80071807547
interrupt,interrupted,2.81368785362
retard,retarded,2.86809862401
super,superimposed,2.9142208314
suppose,supposed,2.93871050774
educate,educated,2.95060660355
bridge,bridged,2.95804997643
distort,distorted,2.97339284009
strip,stripped,3.06128592981
ground,grounded,3.08864376388
mirror,mirrored,3.16397935705
travel,traveled,3.1894300723
plug,plugged,3.21706098608
perforate,perforated,3.22857750722
compact,compacted,3.26251819556
sick,sickled,3.29793342291
track,tracked,3.29963955797
melt,melted,3.30070047765
favor,favored,3.3277310458
fuse,fused,3.35146634515
coat,coated,3.40504673661
striate,striated,3.42946147295
travel,travelled,3.45361737476
hope,hoped,3.49921108192
illuminate,illuminated,3.50747458254
rotate,rotated,3.52279332952
wash,washed,3.53862587918
skill,skilled,3.57515100173
reconstruct,reconstructed,3.63279523052
refine,refined,3.64285869895
mail,mailed,3.73414001989
replicate,replicated,3.78705746905
learn,learned,3.85086709602
advise,advised,3.85136362586
decide,decided,3.89840324017
instruct,instructed,3.90713147591
round,rounded,3.97628898642
accomplish,accomplished,3.98127615124
concentrate,concentrated,3.98131171887
puncture,punctured,3.98599206978
shield,shielded,4.1223043906
agree,agreed,4.16822724203
possess,possessed,4.2007610848
handicap,handicapped,4.26617237222
myelin,myelinated,4.27363419623
detach,detached,4.31440377981
drain,drained,4.32558460771
precipitate,precipitated,4.40285894914
glue,glued,4.44316014664
seat,seated,4.44444652941
accelerate,accelerated,4.50009526756
mela,melamed,4.55284073114
cannula,cannulated,4.59939617722
guard,guarded,4.63200338392
scatter,scattered,4.67799514005
mount,mounted,4.67850656785
desire,desired,4.74955507097
sheath,sheathed,4.82601558505
surround,surrounded,5.12137069906
restrict,restricted,5.12448981878
relieve,relieved,5.17046643185
bound,bounded,5.17355460912
list,listed,5.26457604832
permit,permitted,5.29673642051
intend,intended,5.30723988485
outline,outlined,5.35346924892
adopt,adopted,5.38756585936
expand,expanded,5.38924789863
predispose,predisposed,5.46250894805
fold,folded,5.50665804528
kind,kindred,5.53541878347
price,priced,5.61625662221
rupture,ruptured,5.64274133497
coup,coupled,5.67004669233
square,squared,5.67692547161
substitute,substituted,5.67737550038
abstract,abstracted,5.6969557306
couple,coupled,5.74402554041
fill,filled,5.77839365328
rest,restrained,5.78689065883
oppose,opposed,5.85156851636
trigger,triggered,5.94289217427
burn,burned,5.99774041063
absorb,absorbed,6.02107578229
fear,feared,6.03797678464
incorporate,incorporated,6.05266344872
convert,converted,6.06667952454
perfect,perfected,6.09444951406
force,forced,6.10900714983
load,loaded,6.25931769293
buckle,buckled,6.29648570114
dissect,dissected,6.32180632381
turn,turned,6.35628777813
crush,crushed,6.38559798031
connect,connected,6.40697398014
weigh,weighted,6.41349278136
fragment,fragmented,6.46963601519
plot,plotted,6.55687367541
reserve,reserved,6.5828527196
mani,manifested,6.62012822943
suppress,suppressed,6.65215922461
touch,touched,6.68273703905
enlarge,enlarged,6.80620553729
vault,vaulted,6.86773043279
stop,stopped,7.0010677888
augment,augmented,7.02196023386
experiment,experimented,7.04750777731
spike,spiked,7.05355174824
inform,informed,7.13595733952
genera,generalized,7.13987755824
check,checked,7.16077808042
distinguish,distinguished,7.21190116846
sickle,sickled,7.22833471386
compose,composed,7.24458738421
cluster,clustered,7.24884937227
extend,extended,7.33818029427
warrant,warranted,7.40236587767
suspect,suspected,7.42195805632
face,faced,7.4898954122
prefer,preferred,7.55400176337
admit,admitted,7.55459613023
plate,plated,7.60561636809
stand,standardized,7.63698094974
fall,fallen,7.65160009953
band,banded,7.71557898661
rest,restricted,7.72481770471
discover,discovered,7.77990668496
reverse,reversed,7.78675752621
attach,attached,7.8149047173
branch,branched,7.87880682638
feature,featured,7.91607558823
transfer,transferred,7.96898170453
return,returned,8.02328870913
fashion,fashioned,8.02931292508
raise,raised,8.03755716154
tunnel,tunneled,8.04192091998
border,bordered,8.11789296069
repeat,repeated,8.18988155814
sight,sighted,8.21232328585
spot,spotted,8.30571301002
employ,employed,8.3777704344
forme,formed,8.41440303806
bloc,blocked,8.43285224577
sustain,sustained,8.45420912305
train,trained,8.4866289937
scar,scarred,8.50654769813
dilate,dilated,8.5306562118
rank,ranked,8.55327798654
atta,attached,8.55493661501
prove,proved,8.55914664387
organ,organized,8.5593388409
switch,switched,8.57249676157
reflect,reflected,8.61679516411
register,registered,8.64077567
slope,sloped,8.71073767593
class,classed,8.71824786232
comprise,comprised,8.72464667494
insert,inserted,8.7466706146
blur,blurred,8.83226069605
rais,raised,8.85201374134
shape,shaped,8.85728792225
cross,crossed,8.87339114846
decline,declined,8.91310962856
position,positioned,8.96079884739
transport,transported,8.9720030499
balance,balanced,9.02117114469
diffuse,diffused,9.03532595368
step,stepped,9.0701920511
state,stated,9.0772948203
cover,covered,9.17198006534
part,partitioned,9.18162015796
culture,cultured,9.19285962427
color,colored,9.27846281431
pattern,patterned,9.33055177607
line,lined,9.34163851216
resolve,resolved,9.36206303127
comb,combined,9.37630838161
needle,needled,9.42505016307
screen,screened,9.45042920075
target,targeted,9.56418719537
pair,paired,9.56523323149
sector,sectored,9.58181158369
select,selected,9.58482403451
score,scored,9.61501321822
regulate,regulated,9.63349587999
peak,peaked,9.63807965957
combine,combined,9.64345178711
work,worked,9.74441434823
scale,scaled,9.81504128142
valve,valved,9.85782304846
water,watershed,9.92544542051
grade,graded,9.94596563873
extract,extracted,9.96142212079
derive,derived,9.97161128109
author,authorized,9.97280132536
wall,walled,9.98427066713
enhance,enhanced,10.0148377523
size,sized,10.0261475066
point,pointed,10.0597239771
standard,standardized,10.0871976413
pain,painted,10.1878147794
value,valued,10.2398376411
sele,selected,10.2883289749
post,posted,10.3264695114
course,coursed,10.38523942
structure,structured,10.4018446752
surface,surfaced,10.4044576634
complicate,complicated,10.4182454296
assign,assigned,10.5063219576
center,centered,10.5594893393
elevate,elevated,10.7247351307
power,powered,10.7826206686
practice,practiced,10.7871230238
correct,corrected,10.829185515
blind,blinded,10.8561203465
impact,impacted,10.871978471
wound,wounded,10.8771982675
correlate,correlated,10.8884497262
order,ordered,10.8948656793
produce,produced,10.9706486174
involve,involved,11.0537010875
mark,marked,11.0638221935
stem,stemmed,11.0714558722
provide,provided,11.0944345963
stage,staged,11.1601781393
space,spaced,11.1994661111
form,formed,11.2551634812
note,noted,11.3783847542
confirm,confirmed,11.4979527128
disorder,disordered,11.5083555759
hand,handed,11.5433036279
link,linked,11.6677556538
collect,collected,11.701874654
curve,curved,11.7398432151
reveal,revealed,11.7549966648
express,expressed,11.8004731646
hand,handled,11.8154281127
receive,received,11.9579291071
condition,conditioned,11.9600512006
test,tested,12.0071487144
weight,weighted,12.0213046829
need,needled,12.1460483546
design,designed,12.1495773183
include,included,12.1582018463
coll,collected,12.175759739
enroll,enrolled,12.2568617727
divide,divided,12.3150958394
subject,subjected,12.3588151504
layer,layered,12.4613685154
segment,segmented,12.5236776882
range,ranged,12.5417747985
block,blocked,12.7315199999
disease,diseased,12.8268746387
calculate,calculated,12.9283267112
time,timed,12.9980333631
lamina,laminated,13.0194646984
mask,masked,13.0220802414
graft,grafted,13.1353724287
cent,centered,13.1444473454
angle,angled,13.3120677187
base,based,13.4351686063
measure,measured,13.6690533846
rate,rated,13.7263264922
group,grouped,13.8151699037
show,shown,13.9358553038
carr,carried,14.4454300947
define,defined,14.586803165
assess,assessed,14.6765272075
gene,generalized,14.9483836714
associate,associated,15.2915398861
determine,determined,15.3661195693
class,classified,15.7854685433

