## group: bigrams
of,the,10.7202711065
and,the,12.2833168425
and,in,13.9985156843
in,the,14.3416978348
for,the,17.6103275871
with,the,19.4143919372
of,glaucoma,20.3416040518
to,the,20.9382084684
glaucoma,and,20.950292397
in,glaucoma,21.2280660277
glaucoma,in,21.2280660277
with,glaucoma,21.4635590192
by,the,23.1570778197
of,this,24.2214499506
from,the,24.5869960845
on,the,24.8854395129
that,the,25.4986021065
in,this,25.910293065
at,the,26.2413353788
treatment,of,27.0711222405
use,of,27.1652029655
number,of,27.263930405
the,mean,28.996632831
between,the,32.0537689634
the,study,32.2606207921
the,optic,35.4269616899
the,anterior,35.4471272748
effect,of,35.4921923115
associated,with,38.3640051188
this,study,40.9933448344
to,be,43.2083368667
there,was,43.995778691
to,determine,44.869662259
to,evaluate,47.3108701759
intraocular,pressure,48.7135958572
visual,field,48.9261062643
visual,acuity,50.5092763915
optic,disc,51.7996292298
ocular,hypertension,52.5996376704
purpose,to,53.5430595886
may,be,55.2921503057
anterior,chamber,55.967884589
optic,nerve,56.5453700748

