## group: nn_vbg
suggest,suggesting,0.0637519067195
concern,concerning,0.124585758397
look,looking,0.13240812116
regard,regarding,0.157932687966
walk,walking,0.16590909332
stain,staining,0.172748885181
tattoo,tattooing,0.174867157541
show,showing,0.209124705966
reveal,revealing,0.222668892371
rest,resting,0.225311534376
remain,remaining,0.267879073756
test,testing,0.289471123617
screen,screening,0.300097537721
feel,feeling,0.301443157277
undergo,undergoing,0.301851117383
work,working,0.344709316063
proceed,proceeding,0.347567934558
extend,extending,0.372998244777
learn,learning,0.690141855047
understand,understanding,1.501723731
start,starting,1.82076736437
form,forming,1.89137053434

