<svg version="1.1" id="Calque_1" xmlns="http://www.w3.org/2000/svg" xmlns:xlink="http://www.w3.org/1999/xlink" x="0px" y="0px" viewBox="0 0 100 100" enable-background="new 0 0 100 100" xml:space="preserve">
    <g>
        <g>
            <polygon fill="#FFFFFF" points="0,50 50,0 100,50 50,100"/>
        </g>
        <g>
            <polygon fill="#25AEE4" points="0,50 35,15 35,50"/>
        </g>
        <g>
            <polygon fill="#73C35C" points="0,50 35,85 35,50"/>
        </g>
        <g>
            <polygon fill="#E75153" points="50,0 65.2,15.2 46,34.4 46,4"/>
        </g>
        <g>
            <polygon fill="#FDC35C" points="50,100 65.2,84.8 46,65.6 46,96"/>
        </g>
        <g>
            <polygon fill="#FA9426" points="46,50 73,77 100,50 73,23"/>
        </g>
    </g>
</svg>
