<?xml version="1.0" encoding="iso-8859-1"?>
<!-- Generator: Adobe Illustrator 19.0.0, SVG Export Plug-In . SVG Version: 6.00 Build 0)  -->
<svg version="1.1" id="Layer_1" xmlns="http://www.w3.org/2000/svg" xmlns:xlink="http://www.w3.org/1999/xlink" x="0px" y="0px"
	 viewBox="0 0 512 512" style="enable-background:new 0 0 512 512;" xml:space="preserve">
<circle style="fill:#FF6262;" cx="256" cy="256" r="256"/>
<path style="fill:#FF314F;" d="M512,256c0-0.843-0.024-1.679-0.031-2.52l-119.42-119.625L239.413,281.791l-119.887,96.32
	l134.237,133.861c0.746,0.007,1.491,0.028,2.239,0.028C397.384,512,512,397.384,512,256z"/>
<path style="fill:#FFFFFF;" d="M378.54,384H133.458c-10.869,0-19.682-8.811-19.682-19.682V147.68c0-10.869,8.811-19.68,19.682-19.68
	H378.54c10.869,0,19.682,8.811,19.682,19.68v216.638C398.222,375.189,389.411,384,378.54,384z"/>
<path style="fill:#D0D1D3;" d="M378.54,128H254.85v256h123.69c10.869,0,19.682-8.811,19.682-19.682V147.682
	C398.222,136.811,389.411,128,378.54,128z"/>
<path style="fill:#386895;" d="M398.222,147.682c0-10.869-8.811-19.682-19.682-19.682H133.458c-10.869,0-19.68,8.811-19.68,19.682
	v20.744h284.444V147.682z"/>
<path style="fill:#273B7A;" d="M398.222,147.682c0-10.869-8.811-19.682-19.682-19.682H254.85v40.426h143.372V147.682z"/>
<path style="fill:#808183;" d="M113.988,367.049c1.333,9.575,9.528,16.951,19.47,16.951H378.54c9.942,0,18.137-7.378,19.47-16.951
	L113.988,367.049L113.988,367.049z"/>
<path style="fill:#59595B;" d="M254.85,367.049V384h123.69c9.942,0,18.137-7.378,19.47-16.951L254.85,367.049L254.85,367.049z"/>
<path style="fill:#D0D1D3;" d="M373.226,158.599H138.774c-4.046,0-7.327-3.281-7.327-7.327l0,0c0-4.046,3.281-7.327,7.327-7.327
	h234.451c4.046,0,7.327,3.281,7.327,7.327l0,0C380.552,155.319,377.272,158.599,373.226,158.599z"/>
<path style="fill:#A6A8AA;" d="M373.226,143.946H254.85v14.653h118.375c4.046,0,7.327-3.281,7.327-7.327
	S377.272,143.946,373.226,143.946z"/>
<rect x="142.222" y="212.558" style="fill:#E09112;" width="25.753" height="128.776"/>
<g>
	<rect x="241.778" y="212.558" style="fill:#FFC61B;" width="25.753" height="128.776"/>
	<rect x="254.845" y="212.558" style="fill:#FFC61B;" width="12.681" height="128.776"/>
</g>
<g>
	<rect x="191.991" y="264.068" style="fill:#C92F00;" width="25.753" height="77.262"/>
	<rect x="341.333" y="264.068" style="fill:#C92F00;" width="25.753" height="77.262"/>
</g>
<rect x="291.547" y="238.313" style="fill:#FF5419;" width="25.753" height="103.015"/>
<path style="fill:#D0D1D3;" d="M387.394,249.051l-9.757-21.499c-0.981-2.165-3.534-3.129-5.706-2.143
	c-2.167,0.983-3.125,3.539-2.143,5.706l4.61,10.157l-120.472-61.088c-1.583-0.802-3.486-0.557-4.811,0.621l-43.406,38.536
	l-49.743-39.55c-1.862-1.479-4.572-1.171-6.056,0.691c-1.481,1.862-1.172,4.574,0.691,6.056l52.579,41.805
	c1.634,1.303,3.975,1.243,5.544-0.152l43.92-38.995l117.622,59.644l-11.076,2.003c-2.341,0.422-3.898,2.665-3.474,5.008
	c0.378,2.082,2.191,3.543,4.236,3.543c0.253,0,0.514-0.022,0.772-0.069l23.514-4.253c1.307-0.236,2.432-1.062,3.05-2.239
	C387.905,251.656,387.944,250.261,387.394,249.051z"/>
<path style="fill:#A6A8AA;" d="M387.394,249.051l-9.757-21.499c-0.981-2.165-3.534-3.129-5.706-2.143
	c-2.167,0.983-3.125,3.539-2.143,5.706l4.61,10.157l-119.549-60.621v9.664l115.415,58.525l-11.076,2.003
	c-2.341,0.422-3.898,2.665-3.474,5.008c0.378,2.082,2.191,3.543,4.236,3.543c0.253,0,0.514-0.022,0.772-0.069l23.514-4.253
	c1.307-0.236,2.432-1.062,3.05-2.239C387.905,251.656,387.944,250.261,387.394,249.051z"/>
<g>
</g>
<g>
</g>
<g>
</g>
<g>
</g>
<g>
</g>
<g>
</g>
<g>
</g>
<g>
</g>
<g>
</g>
<g>
</g>
<g>
</g>
<g>
</g>
<g>
</g>
<g>
</g>
<g>
</g>
</svg>
