@startuml

[clamav] <<ClamAV Server>> as clamavserver

package "Service: clamav" as service {
  [Virtual resource]
}

package "Deployment: clamav" as deployment {
  [clamav-01] <<Pod>> as pod1
  [clamav-02] <<Pod>> as pod2
  [clamav-03] <<Pod>> as pod3
}
[clamav-lib-shared] <<PersistentVolumeClaim>> as definitions

service-->deployment : "ok"
pod1-->definitions : "reads from"
pod2-->definitions : "reads from"
pod3-->definitions : "reads from"
package "CronJob: clamav-updater" as updater {
  [clamav-updater] <<Job>> as updaterjob
  [clamav-updater-01] <<Pod>> as updaterpod
  updaterjob-->updaterpod : "spawns"
  updaterpod-->definitions : "updates"
  updaterpod-->clamavserver : "retrieve updates"
}
note top of updater : "CronJob runs '0 */2 * * *'"

[Consumer] as consumer #LightBlue
consumer==>service #Green : "'scan this file leh'"

@enduml
