{
  "defaultConnection": "default",
  "connections": {
    "default": {
      "connector": "bookshelf",
      "settings": {
        "client": "mysql",
        "database": "api-skills",
        "host": "127.0.0.1",
        "port": "53306",
        "username": "root",
        "password": "toor"
      },
      "options": {}
    }
  }
}
