"filename", "language", "Python", "SQL", "XML", "comment", "blank", "total"
"/home/jihungmycena/Documents/Mycena_Project/YLM/developing/warehourse_poc/backend/.idea/backend.iml", "XML", 0, 0, 10, 0, 0, 10
"/home/jihungmycena/Documents/Mycena_Project/YLM/developing/warehourse_poc/backend/.idea/inspectionProfiles/Project_Default.xml", "XML", 0, 0, 53, 0, 0, 53
"/home/jihungmycena/Documents/Mycena_Project/YLM/developing/warehourse_poc/backend/.idea/inspectionProfiles/profiles_settings.xml", "XML", 0, 0, 6, 0, 0, 6
"/home/jihungmycena/Documents/Mycena_Project/YLM/developing/warehourse_poc/backend/.idea/misc.xml", "XML", 0, 0, 4, 0, 0, 4
"/home/jihungmycena/Documents/Mycena_Project/YLM/developing/warehourse_poc/backend/.idea/modules.xml", "XML", 0, 0, 8, 0, 0, 8
"/home/jihungmycena/Documents/Mycena_Project/YLM/developing/warehourse_poc/backend/.idea/vcs.xml", "XML", 0, 0, 6, 0, 0, 6
"/home/jihungmycena/Documents/Mycena_Project/YLM/developing/warehourse_poc/backend/agent/__init__.py", "Python", 0, 0, 0, 0, 1, 1
"/home/jihungmycena/Documents/Mycena_Project/YLM/developing/warehourse_poc/backend/agent/authentication.py", "Python", 9, 0, 0, 0, 4, 13
"/home/jihungmycena/Documents/Mycena_Project/YLM/developing/warehourse_poc/backend/agent/ros_get_state.py", "Python", 85, 0, 0, 0, 11, 96
"/home/jihungmycena/Documents/Mycena_Project/YLM/developing/warehourse_poc/backend/agent/socketio_agent.py", "Python", 30, 0, 0, 1, 9, 40
"/home/jihungmycena/Documents/Mycena_Project/YLM/developing/warehourse_poc/backend/agent/sql_lite_db.py", "Python", 28, 0, 0, 1, 7, 36
"/home/jihungmycena/Documents/Mycena_Project/YLM/developing/warehourse_poc/backend/app.py", "Python", 39, 0, 0, 3, 13, 55
"/home/jihungmycena/Documents/Mycena_Project/YLM/developing/warehourse_poc/backend/config.py", "Python", 7, 0, 0, 0, 3, 10
"/home/jihungmycena/Documents/Mycena_Project/YLM/developing/warehourse_poc/backend/controller/__init__.py", "Python", 0, 0, 0, 0, 1, 1
"/home/jihungmycena/Documents/Mycena_Project/YLM/developing/warehourse_poc/backend/controller/amr_status_con.py", "Python", 11, 0, 0, 0, 4, 15
"/home/jihungmycena/Documents/Mycena_Project/YLM/developing/warehourse_poc/backend/controller/ros_api_con.py", "Python", 116, 0, 0, 1, 19, 136
"/home/jihungmycena/Documents/Mycena_Project/YLM/developing/warehourse_poc/backend/controller/section_state_con.py", "Python", 21, 0, 0, 27, 9, 57
"/home/jihungmycena/Documents/Mycena_Project/YLM/developing/warehourse_poc/backend/controller/sys_log_con.py", "Python", 10, 0, 0, 0, 4, 14
"/home/jihungmycena/Documents/Mycena_Project/YLM/developing/warehourse_poc/backend/database.sqlite", "SQL", 0, 21, 0, 0, 0, 21
"/home/jihungmycena/Documents/Mycena_Project/YLM/developing/warehourse_poc/backend/domain/__init__.py", "Python", 0, 0, 0, 0, 1, 1
"/home/jihungmycena/Documents/Mycena_Project/YLM/developing/warehourse_poc/backend/domain/amr_status.py", "Python", 42, 0, 0, 0, 3, 45
"/home/jihungmycena/Documents/Mycena_Project/YLM/developing/warehourse_poc/backend/domain/section_state.py", "Python", 5, 0, 0, 0, 2, 7
"/home/jihungmycena/Documents/Mycena_Project/YLM/developing/warehourse_poc/backend/domain/sys_log.py", "Python", 13, 0, 0, 0, 5, 18
"/home/jihungmycena/Documents/Mycena_Project/YLM/developing/warehourse_poc/backend/repository/__init__.py", "Python", 0, 0, 0, 0, 1, 1
"/home/jihungmycena/Documents/Mycena_Project/YLM/developing/warehourse_poc/backend/repository/section_state_rep.py", "Python", 18, 0, 0, 0, 9, 27
"/home/jihungmycena/Documents/Mycena_Project/YLM/developing/warehourse_poc/backend/repository/sys_log_rep.py", "Python", 15, 0, 0, 0, 5, 20
"/home/jihungmycena/Documents/Mycena_Project/YLM/developing/warehourse_poc/backend/service/__init__.py", "Python", 0, 0, 0, 0, 1, 1
"/home/jihungmycena/Documents/Mycena_Project/YLM/developing/warehourse_poc/backend/service/amr_status_service.py", "Python", 5, 0, 0, 0, 1, 6
"/home/jihungmycena/Documents/Mycena_Project/YLM/developing/warehourse_poc/backend/service/section_state_service.py", "Python", 29, 0, 0, 0, 8, 37
"/home/jihungmycena/Documents/Mycena_Project/YLM/developing/warehourse_poc/backend/service/sys_log_service.py", "Python", 10, 0, 0, 0, 5, 15
"/home/jihungmycena/Documents/Mycena_Project/YLM/developing/warehourse_poc/backend/stores/__init__.py", "Python", 0, 0, 0, 0, 1, 1
"/home/jihungmycena/Documents/Mycena_Project/YLM/developing/warehourse_poc/backend/stores/state.py", "Python", 33, 0, 0, 0, 5, 38
"/home/jihungmycena/Documents/Mycena_Project/YLM/developing/warehourse_poc/backend/test.py", "Python", 4, 0, 0, 0, 2, 6
"Total", "-", 530, 21, 87, 33, 134, 805