{
  "Version": "2012-10-17",
  "Statement": [
    {
      "Effect":"Allow",
      "Action": [
        "s3:*"
      ],
      "Resource": [
        "arn:aws:s3:::cicd-poc-bucket",
        "arn:aws:s3:::cicd-poc-bucket/*"
      ]
    },
    {
      "Effect": "Allow",
      "Action": [
        "codebuild:BatchGetBuilds",
        "codebuild:StartBuild",
        "codedeploy:*",
	"tag:GetTags",
	"tag:GetResources"
      ],
      "Resource": "*"
    }
  ]
}
