<?xml version="1.0" encoding="utf-8"?>
<!-- Generator: Adobe Illustrator 25.0.0, SVG Export Plug-In . SVG Version: 6.00 Build 0)  -->
<svg version="1.1" id="haut" xmlns="http://www.w3.org/2000/svg" xmlns:xlink="http://www.w3.org/1999/xlink" x="0px" y="0px"
	 viewBox="0 0 981 838.9" style="enable-background:new 0 0 981 838.9;" xml:space="preserve">
<style type="text/css">
	.st0{display:none;}
	.st1{display:inline;fill:#FFFFFF;stroke:#999999;stroke-width:6;stroke-miterlimit:10;}
	.st2{display:inline;fill:#FFFFFF;stroke:#999999;stroke-width:6;stroke-linecap:round;stroke-miterlimit:10;}
	.st3{display:inline;fill:#FFFFFF;}
	
		.st4{display:inline;fill:#FFFFFF;stroke:#999999;stroke-width:6;stroke-linecap:round;stroke-linejoin:round;stroke-miterlimit:10;}
	.st5{display:inline;fill:none;stroke:#999999;stroke-width:6;stroke-linecap:round;stroke-miterlimit:10;}
	.st6{fill:#FFFFFF;stroke:#999999;stroke-width:6;stroke-miterlimit:10;}
	.st7{fill:#FFFFFF;stroke:#999999;stroke-width:6;stroke-linecap:round;stroke-linejoin:round;stroke-miterlimit:10;}
</style>
<g class="st0">
	<path class="st1" d="M847.55,321.4c-17.49-6.39-29.42,33.39-66.95,49.04c-30.18,12.59-62.78,4.22-66.59,17.46
		c-0.53,1.83-0.35,4.22,0,9c0.86,11.75,4.58,20.8,5.74,22.98c8.76,16.46,71.76,17.88,115.24-16.46
		c26.64-21.04,34.91-48.43,32.32-56.28c-3.1-9.39-10.18-17.36-10.18-17.36C854.74,327.1,851.11,322.7,847.55,321.4z"/>
	<path class="st1" d="M244.09,714.61c-6.39,6.79-22.91,24.31-21.08,46.12c2.27,27.11,32.18,52.2,42.17,47.44
		c3.67-1.75,1.79-6.16,5.27-9.22c15.62-13.76,83.64,48.67,101.46,34.26c3.27-2.65,2.53-5.27,4.29-8.07c0,0,1.11-1.38,2.3-2.47
		c5.41-4.97,36.8,14.09,62.51,14.24c23.54,0.14,25.82-15.68,53.45-16.88c16.34-0.71,19.69,5.27,43.48,10.54
		c5.88,1.3,86.08,18.45,101.46-9.22c4.19-7.53-0.44-11.17,3.95-17.13c15.37-20.88,83.67,8.05,88.29-2.64
		c2.17-5.02-12.04-13.41-9.22-19.77c2.81-6.36,18.23-0.67,32.94-10.54c4.78-3.21,9.99-8.39,11.86-13.18
		c8.59-21.98-43.17-61.61-48.75-65.88C607.41,607.19,314,640.42,244.09,714.61z"/>
	<path class="st1" d="M138,324.9c15.05-6.67,31.03,24.16,70.07,44.47c30.36,15.79,51.32,12.49,55.93,27.53c2.9,9.46-2.33,20.67-9,27
		c-21.41,20.31-70.68,2.57-99-18c-20.8-15.1-39.93-38.73-36-54c2.47-9.58,9-18,9-18C131.2,331.06,134.53,326.44,138,324.9z"/>
	<path class="st1" d="M404.85,12.28c12.13-0.18,22.65,6.51,43.48,19.77c17.55,11.16,21.42,16.94,31.62,17.13
		c8.72,0.16,15.6-4.28,28.99-13.18c24.02-15.95,26.45-25.04,35.58-25.04c12.59,0.01,16.29,17.31,32.94,36.9
		c21.93,25.8,49.73,36.02,84.33,48.75c42.34,15.58,45.68,6.4,67.2,18.45c29.34,16.42,35.88,40.62,61.93,90.92
		c51.09,98.65,76.17,102.59,69.84,131.77c-12.07,55.63-114.63,93.77-146.26,67.2c-18.67-15.68-9.24-51.06-13.18-51.39
		c-6.61-0.55-42.13,98.73-18.45,209.51c19.64,91.87,62.09,107.88,51.39,143.63c-31.73,105.97-450.3,117.49-490.18,7.91
		c-13.21-36.28,26.18-55.41,46.12-162.08c20.43-109.27,0.08-201.45-7.91-201.61c-5.44-0.1,0.45,42.61-23.72,57.98
		c-34.06,21.67-117.95-17.25-129.13-69.84c-3.64-17.12,2.99-23.63,42.17-104.1c41.07-84.34,42.56-95.2,61.93-108.05
		c33.54-22.25,53.93-6.19,84.33-34.26c15.83-14.62,16.17-24.38,44.8-52.71C388.32,14.59,398.2,12.38,404.85,12.28z"/>
	<path class="st1" d="M468.98,90.9c-22.65,4.55-13.5,167.5-16.69,280.23c-3.54,124.98,6.48,250.24,0,375.1
		c-0.41,7.96-1.79,31.1,12.3,42.17c10.46,8.22,28.03,8.65,38.65,0.88c16.33-11.95,13.31-41.22,12.3-51.83
		c-7.91-83.25-11.1-268.39-10.54-316.25c0.09-7.72,3.72-305.13-2.64-316.24c-4.57-8-11.42-11.42-11.42-11.42
		C490.94,93.54,481.44,88.39,468.98,90.9z"/>
	<path class="st1" d="M471.61,215.64c-6.04,5.43-5.65,14.96-0.88,20.64c5.5,6.54,16.49,7.62,22.4,1.32
		c5.47-5.83,4.43-15.65-1.32-21.08C486.55,211.54,477.48,210.36,471.61,215.64z"/>
	<path class="st1" d="M468.1,463.37c-6.04,5.43-5.65,14.96-0.88,20.64c5.5,6.54,16.49,7.62,22.4,1.32
		c5.47-5.83,4.43-15.65-1.32-21.08C483.04,459.27,473.97,458.09,468.1,463.37z"/>
	<path class="st1" d="M468.77,340.89c-6.04,5.43-5.65,14.96-0.88,20.64c5.5,6.54,16.49,7.62,22.4,1.32
		c5.47-5.83,4.43-15.65-1.32-21.08C483.71,336.78,474.64,335.61,468.77,340.89z"/>
	<path class="st1" d="M472.93,596.01c-6.04,5.43-5.65,14.96-0.88,20.64c5.5,6.54,16.49,7.62,22.4,1.32
		c5.47-5.83,4.43-15.65-1.32-21.08C487.87,591.91,478.8,590.73,472.93,596.01z"/>
	<path class="st1" d="M503.24,132.19c7.77,20.8,14.87,31.95,31.62,60.61c36.95,63.23,43.36,79.1,54.46,78.18
		c11.4-0.94,10.35-18.15,32.5-36.9c24.46-20.7,45.65-16.55,47.44-26.35c2.75-15.08-47.36-25.23-102.78-67.64
		c-45.65-34.93-65.43-69.21-73.79-64.13C484.17,81.15,498.81,120.33,503.24,132.19z"/>
	<path class="st1" d="M469.85,78.6c-17.25-6.27-35.12,37.47-81.7,73.79c-37.56,29.28-67.03,32.88-67.64,52.71
		c-0.23,7.42,3.81,9.71,20.2,34.26c26.04,38.99,24.32,45.92,31.62,47.44c24.08,5.01,42.81-70.27,92.24-151.97
		c5.88-9.72,21.84-35.47,12.3-50.07C476.06,83.49,473.8,80.04,469.85,78.6z"/>
	<path class="st1" d="M501.48,57.52c5.39-5.66,20.2-20.39,62.37-41.29C591.6,2.48,598.41,2.3,604.26,3.93
		c5.4,1.51,10.84,4.79,24.6,22.84c20.86,27.36,31.3,41.04,28.99,50.95c-5.95,25.59-67.28,29.27-77.3,29.87
		c-40.14,2.41-92.04-7.28-94.87-26.35C484.75,75.09,490.33,69.23,501.48,57.52z"/>
	<path class="st1" d="M461.07,66.3c-10.66-15.03-25.63-25.57-59.74-38.65c-40.04-15.36-60.06-23.03-69.4-14.06
		c-6.48,6.24-2.28,14.69-2.64,40.41c-0.6,43.35-13.02,52.64-6.15,63.25c19.22,29.69,143.8-0.97,145.82-34.26
		C469.29,77.88,466.55,74.02,461.07,66.3z"/>
	<path class="st1" d="M483.03,54.01c10.44-1.63,15.66-2.45,20.2-0.88c16.99,5.89,25.35,40.3,14.93,50.07
		c-6.37,5.98-14.79-1.91-37.77,2.64c-13.96,2.76-17.15,6.92-21.96,4.39c-11.38-5.98-12.26-39.02,2.64-50.07
		C465.7,56.72,471.48,55.81,483.03,54.01z"/>
	<path class="st1" d="M474.04,730.92c-6.04,5.43-5.65,14.96-0.88,20.64c5.5,6.54,16.49,7.62,22.4,1.32
		c5.47-5.83,4.43-15.65-1.32-21.08C488.98,726.82,479.91,725.64,474.04,730.92z"/>
</g>
<g class="st0">
	<path class="st1" d="M804.98,707.85c16.05,2.66,31.96,27.3,27.65,45.12c-10,41.4-133.3,63.52-152.82,32.02
		c-10.36-16.73,5.68-53.15,27.65-61.13c17.82-6.47,28.49,9.78,53.85,4.37C785.34,723.1,790.26,705.42,804.98,707.85z"/>
	<path class="st1" d="M136.94,710.76c-11.11,1.03-22.13,19.5-20.38,34.93c3.99,35.08,75.26,65.34,103.34,43.66
		c14.58-11.26,18.73-37.46,10.19-45.12c-9.03-8.1-25.53,10.59-48.03,4.37C156.11,741.42,152.08,709.36,136.94,710.76z"/>
	<path class="st1" d="M403.28,52.91c-23.91,6.48-21.56,29.29-49.48,55.31c-37.09,34.55-68.42,19.6-98.97,48.03
		c-26.81,24.95-29.21,61.18-32.02,93.15c0,0-10.29,117-36.39,250.33c-28.36,144.88-83.18,196.64-49.48,243.06
		c12.06,16.61,44.36,30.16,75.68,30.56c13.57,0.17,27.23,0.35,39.38-8.45c9.83-7.12,16.31-18.41,29.02-86.16
		c3.86-20.55,5.79-30.83,6.98-39.84c8.77-66.44,7.62-123.64,9-171c2.25-77.52,11.7-142.93,13.13-142.83
		c1.83,0.13,8.71,107.52-17.47,237.24C266.08,694.04,234,717.14,251.92,755.88c50.27,108.72,385.51,105.43,430.81,0
		c15.66-36.45-15.17-57.54-45.12-173.2c-35.99-138.98-29.59-255.8-26.2-256.16c2.46-0.26,4.5,60.65,26.2,164.46
		c22.43,107.33,37.61,125.26,33.47,184.84c-3.01,43.4-13,61.91,0,77.14c25.96,30.4,120.89,21.25,154.28-27.65
		c40.04-58.66-45.71-120-82.96-328.93c-10.7-60-35.36-117.18-43.66-177.56c-3.55-25.81-6.54-57.14-30.56-77.14
		c-24.24-20.18-45.01-8.08-74.23-30.56c-30.87-23.75-23.52-49.45-48.03-58.22c-24.9-8.91-36.33,16.23-77.14,14.55
		C433.65,66.02,426.09,46.73,403.28,52.91z"/>
	<path class="st1" d="M474.6,114.04c-20.07,30.95,86.87,143.34,106.25,130.99c9.25-5.9-9.89-34.81,7.28-62.58
		c12.62-20.41,32.07-19.56,33.47-33.47c1.55-15.35-21.87-19.07-45.12-52.4c-15.57-22.32-16.8-37.47-26.2-37.84
		c-10.51-0.42-12.49,18.4-33.47,34.93C495.53,110.42,481.05,104.09,474.6,114.04z"/>
	<path class="st1" d="M465.86,116.95c19.85,31.35-79.74,139.72-96.06,129.53c-1.85-1.16-1.66-3.24-2.91-13.1
		c-2.27-17.85-6.5-39.46-10.19-49.48c-11.48-31.24-48.03-32.78-46.57-48.03c1.07-11.21,20.76-9.86,45.12-29.11
		c30.46-24.07,35.71-54.67,46.57-52.4c8.94,1.87,4.5,21.72,20.38,39.3C439.23,112.51,458.39,105.15,465.86,116.95z"/>
	<path class="st1" d="M471.69,135.87c6.79,232.38,13.58,464.77,20.38,697.15"/>
	<path class="st1" d="M673.99,148.97c-0.46-0.17-17.72,45.69-32.02,85.87c-14.08,39.57-29.57,85.71-29.11,85.87
		C613.75,321.02,674.87,149.29,673.99,148.97z"/>
	<path class="st1" d="M254.83,156.25c-0.36,0.18,23.87,38.89,40.75,97.51c11.65,40.45,14.32,71.36,14.55,71.32
		c0.26-0.04-2.47-38.92-17.47-85.87C276.73,189.32,255.16,156.08,254.83,156.25z"/>
	<path class="st1" d="M441.59,236.16c-1.45,1.46,0.14,4.47,0,11.53c-0.16,8.34-2.51,11.08-0.92,13.83c0.34,0.6,1.32,1.98,9.24,2.31
		c7.99,0.33,11.98,0.49,13.86-2.31c1.21-1.81,1.13-5.46,0.92-12.68c-0.22-7.6-0.36-11.43-1.85-12.68
		c-2.63-2.22-5.46,2.83-12.01,2.31C445.61,238.04,443.24,234.5,441.59,236.16z"/>
	<path class="st1" d="M443,467.69c-1.45,1.46,0.14,4.47,0,11.53c-0.16,8.34-2.51,11.08-0.92,13.83c0.34,0.6,1.32,1.98,9.24,2.31
		c7.99,0.33,11.98,0.49,13.86-2.31c1.21-1.81,1.13-5.46,0.92-12.68c-0.22-7.6-0.36-11.43-1.85-12.68
		c-2.63-2.22-5.46,2.83-12.01,2.31C447.02,469.58,444.65,466.03,443,467.69z"/>
	<path class="st1" d="M446.44,721.56c-1.45,1.46,0.14,4.47,0,11.53c-0.16,8.34-2.51,11.08-0.92,13.83c0.34,0.6,1.32,1.98,9.24,2.31
		c7.99,0.33,11.98,0.49,13.86-2.31c1.21-1.81,1.13-5.46,0.92-12.68c-0.22-7.6-0.36-11.43-1.85-12.68
		c-2.63-2.22-5.46,2.83-12.01,2.31C450.46,723.44,448.09,719.9,446.44,721.56z"/>
	<path class="st1" d="M443.53,589.11c-1.45,1.46,0.14,4.47,0,11.53c-0.16,8.34-2.51,11.08-0.92,13.83c0.34,0.6,1.32,1.98,9.24,2.31
		c7.99,0.33,11.98,0.49,13.86-2.31c1.21-1.81,1.13-5.46,0.92-12.68c-0.22-7.6-0.36-11.43-1.85-12.68
		c-2.63-2.22-5.46,2.83-12.01,2.31C447.55,591,445.18,587.45,443.53,589.11z"/>
	<path class="st1" d="M440.16,351.88c-1.45,1.46,0.14,4.47,0,11.53c-0.16,8.34-2.51,11.08-0.92,13.83c0.34,0.6,1.32,1.98,9.24,2.31
		c7.99,0.33,11.98,0.49,13.86-2.31c1.21-1.81,1.13-5.46,0.92-12.68c-0.22-7.6-0.36-11.43-1.85-12.68
		c-2.63-2.22-5.46,2.83-12.01,2.31C444.18,353.76,441.81,350.22,440.16,351.88z"/>
	<path class="st2" d="M547.04,185.52c2.98,5.58,6,11.19,9.06,16.82c4.36,8.02,8.73,15.94,13.1,23.77"/>
	<path class="st2" d="M570.33,188.75c-10.78,6.47-21.56,12.94-32.34,19.41"/>
	<path class="st2" d="M400.53,183.66c-2.98,5.58-6,11.19-9.06,16.82c-4.36,8.02-8.73,15.94-13.1,23.77"/>
	<path class="st2" d="M377.24,186.89c10.78,6.47,21.56,12.94,32.34,19.41"/>
	<path class="st3" d="M287,551.9c6.45,2.08,2.22,36.16,0,54c-1.38,11.11-4.6,25.91-11.05,55.5c-5.06,23.25-4.57,19.54-6.96,31.06
		c-9.76,46.98-7.73,59.06-17.99,66.44c-9.58,6.88-27,7.61-36,0C178.13,727.71,271.26,546.84,287,551.9z"/>
	<path class="st3" d="M675,710.9c-2.25-12.32-3.69-20.25,0-27c0.21-0.38,4.96-8.85,11-9c16.41-0.42,38.7,60.61,27,69
		c-7.22,5.17-30.22-7.61-36-24C676.26,717.8,675.84,715.5,675,710.9z"/>
	<path class="st3" d="M720,764.9c-4.66,7.16-42.07-0.04-45-18c-1.12-6.89,2.72-15.98,9-18C698.44,724.26,724.98,757.26,720,764.9z"
		/>
</g>
<g class="st0">
	<path class="st1" d="M365.35,242.91c-2.36-15.97-8.54-26.69-10.72-35.17c-13.71-53.39-23.04-89.74-46.26-98.69
		c-16.42-6.33-42.49,0-52.05,16.09c-18.79,31.6,44.37,70.09,47.03,143.53c1.97,54.36-32.05,49.5-42.32,122.68
		c-10.1,71.92,18.77,105-6.59,172.2c-7.01,18.57-9.59,16.95-24.45,45.89c-32.22,62.72-67.69,129.48-51.54,181.38
		c6.05,19.46,15.67,25.14,19.24,26.88c10.49,5.13,18.66,0.68,32.23-0.95c44.35-5.34,66.12,29.1,97.84,15.36
		c6.92-3,4.11-3.87,12.72-8.23c28.88-14.63,46.85,2.08,85.49-3.02c29-3.83,27.9-14.43,47.79-11.94c16.12,2.01,20.5,9.43,52.97,18.94
		c12,3.52,18.63,5.42,27.93,5.99c20.7,1.28,35.86-5.17,43.53-7.8c56.21-19.27,118.54,26.68,134.41,4.67
		c3.25-4.5,1.06-7.02,5.8-13.93c10.44-15.23,26.98-11.63,36.68-19.1c33.16-25.54-32.53-165.73-43.59-189.7
		c-18.1-39.24-21.49-35.21-29.97-60.65c-22.02-66.07,0.84-93.33-10.18-175.23c-7.36-54.7-1.86-98.86-25.09-109.61
		c-13.6-6.29-25.14,3.23-63.56,17.04c0,0-52.1,18.73-106.52,25.42c-68.98,8.48-123.88-6.63-129.95-22.81
		C362.63,272.6,368.84,266.48,365.35,242.91z"/>
	<path class="st1" d="M480.37,332.75c-7.07,6.61-6.8,21.78-0.43,30.81c8.56,12.14,22.3,4.9,39.02,14.55
		c26.71,15.41,17.1,48.58,42.56,62.22c18.81,10.08,33.07-3.2,41.94,6.18c18.64,19.73-28.96,94.79-23.77,97.72
		c2.79,1.58,13.67-21.66,26.9-20.64c16.81,1.3,21.89,40.53,30.27,39.64c8.81-0.94,11.51-45.23,9.53-81.11
		c-2.13-38.75-3.48-58.31-17.27-67.47c-19.91-13.23-44.38,9.01-61.56-5.06c-13.75-11.26-2.32-28.99-16.11-50.65
		C534.57,332.45,493.14,320.81,480.37,332.75z"/>
	<path class="st1" d="M470.58,335.5c6.88,6.8,6.19,21.96-0.43,30.81c-8.89,11.89-22.43,4.28-39.41,13.46
		c-27.12,14.67-18.44,48.09-44.27,61.02c-19.08,9.55-32.97-4.11-42.09,5.02c-19.18,19.2,26.32,95.55,21.05,98.34
		c-2.83,1.5-13.06-22.03-26.32-21.38c-16.84,0.83-23.01,39.91-31.35,38.79c-8.78-1.18-10.25-45.53-7.28-81.34
		c3.21-38.68,5.1-58.19,19.14-66.97c20.27-12.67,44.12,10.24,61.68-3.35c14.06-10.87,3.12-28.92,17.51-50.18
		C416.41,333.7,458.15,323.2,470.58,335.5z"/>
	<path class="st1" d="M477.61,329.92c-2.86-21,22.28-44.55,44.15-52.62c17.15-6.32,44.92-7.78,44.93-7.78l0,0
		c0,0.01,19.47,74.51-4.1,93.79C541.89,380.24,481.68,359.8,477.61,329.92z"/>
	<path class="st1" d="M407.02,268.7c47.92,5.29,74.8,40.1,70.59,61.21c-3.96,19.86-37.91,39.88-80.29,32.5
		c-3.52-6.55-13.41-26.95-9.06-53.35C391.63,288.51,401.95,274.69,407.02,268.7z"/>
	<path class="st1" d="M464.15,289.86c-4.22,3.09-2.89,6.14-3.17,26.73c-0.26,19.33-1.51,22.22,2.44,25.74
		c8.14,7.23,28.13,8.06,36.4,1.58c6.85-5.37-0.33-11.06,1.91-36.39c0.67-7.63,1.63-10.58-1.21-13.94
		C493.86,285.68,472.97,283.41,464.15,289.86z"/>
	<path class="st1" d="M274.56,224.84c6.18,19.43,9.28,29.14,12.06,39.39c7.65,28.15,8.39,38.47,18.6,47.18
		c11.35,9.69,25.08,9.43,26.87,9.37c18.71-0.63,30.54-15.23,32.43-17.65c11.32-14.52,8.93-33.61-1.67-81.27
		c-15.64-70.3-23.91-105.62-46.04-114.1c-20.62-7.89-49.78,0.18-62.47,21.58C241.86,150.41,258.39,174.06,274.56,224.84z"/>
	<path class="st1" d="M600.87,280.03c-5.47-15.95-0.46-29.05,4.78-47.32c21.21-73.99,6.26-93.37,28.14-110.27
		c15.47-11.95,40.21-15.59,58.92-6.19c3.44,1.73,15.86,8.52,22.1,22.72c8.94,20.34-3.81,35.42-15.03,74.03
		c-16.23,55.82-5.4,78.71-26.51,93.48c-16.46,11.52-36.31,6.88-37.91,6.48C610.5,306.76,601.4,281.59,600.87,280.03z"/>
	<path class="st4" d="M278.34,659.12c-5.57,18.37-11.43,36.97-17.58,55.79c-11.32,34.63-23.04,68.09-35.01,100.37"/>
	<path class="st4" d="M385.2,629.79c-4.95,25.5-10.43,51.58-16.49,78.21c-8.83,38.78-18.29,76.02-28.16,111.67"/>
	<path class="st4" d="M556.13,626.56c5.46,23.03,10.75,46.55,15.83,70.56c8.99,42.53,16.77,83.97,23.49,124.22"/>
	<path class="st4" d="M693.05,652.27c11.75,26.28,23.82,59.36,32.25,98.5c5.83,27.08,8.82,51.98,10.18,73.81"/>
	<path class="st1" d="M479.56,794.99c-3.19-22.79,27.55-40.77,41.29-48.45c4.62-2.58,36.51-21.06,47.77-10.54
		c5.29,4.94,1.09,11.65,0.86,39.23c-0.23,27.42,2.98,31.73-1.94,39.19c-9.17,13.88-31.63,15-44.46,13.07
		C506.52,824.99,482.2,813.82,479.56,794.99z"/>
	<path class="st1" d="M464.48,794.89c3.97-22.54-26.24-41.42-39.93-49.58c-4.55-2.71-35.91-22.06-47.46-11.86
		c-5.43,4.79-1.41,11.62-1.94,39.19c-0.52,26.77-4.06,31.5,0.86,39.23c9.87,15.54,35.85,14.27,39.09,14.11
		C433.96,825.06,461.04,814.41,464.48,794.89z"/>
	<path class="st1" d="M457.58,763.86c-3.59,4.54-1.86,7.39-4.51,22.35c-3.21,18.12-6.98,20.89-4.55,25.15
		c5.73,10.04,35.74,10.5,44.87-3.58c3.54-5.45,2.94-11.57,1.73-23.79c-1.36-13.73-2.08-21.08-8.05-25.32
		C478.6,752.65,463.85,755.93,457.58,763.86z"/>
	<path class="st1" d="M642.89,254.07c4.8,1.2,7.25-6.35,15.61-7.4c4.9-0.62,11.15,1.09,14.55,5.75c5.29,7.26,0.27,17.03-0.25,18
		c-2.36,4.42-5.82,6.75-9.12,8.87c-18.62,11.98-27.94,17.96-33.26,16.03c-2.68-0.98-6.52-8.34-14.08-23.03
		c-6.33-12.29-7.87-16.34-6.28-20.75c2.02-5.61,7.83-8.28,9.12-8.87c1.31-0.6,8.04-3.7,13.72-0.84
		C639.38,245.08,638.11,252.87,642.89,254.07z"/>
	<path class="st2" d="M474.59,430.98c-2.69-0.63-2.28-3.74-5.42-5.57c-4.56-2.65-13.3-0.71-16.55,5.26
		c-2.59,4.77-0.54,10-0.15,10.99c1.81,4.62,4.62,4.88,10.83,11.14c7.25,7.3,7.55,11.09,10.83,11.14s3.69-3.74,11.14-10.83
		c6.4-6.09,9.16-6.23,11.14-10.83c0.52-1.21,2.72-6.35,0.15-10.99c-2.13-3.84-6.86-6.12-10.91-5.64
		C480.09,426.3,478.26,431.85,474.59,430.98z"/>
	<path class="st2" d="M476.92,526.96c-2.69-0.63-2.28-3.74-5.42-5.57c-4.56-2.65-13.3-0.71-16.55,5.26
		c-2.59,4.77-0.54,10-0.15,10.99c1.81,4.62,4.62,4.88,10.83,11.14c7.25,7.3,7.55,11.09,10.83,11.14c3.28,0.05,3.69-3.74,11.14-10.83
		c6.4-6.09,9.16-6.23,11.14-10.83c0.52-1.21,2.72-6.35,0.15-10.99c-2.13-3.84-6.86-6.12-10.91-5.64
		C482.42,522.27,480.59,527.83,476.92,526.96z"/>
	<path class="st2" d="M475.42,634.95c-2.69-0.63-2.28-3.74-5.42-5.57c-4.56-2.65-13.3-0.71-16.55,5.26
		c-2.59,4.77-0.54,10-0.15,10.99c1.81,4.62,4.62,4.88,10.83,11.14c7.25,7.3,7.55,11.09,10.83,11.14c3.28,0.05,3.69-3.74,11.14-10.83
		c6.4-6.09,9.16-6.23,11.14-10.83c0.52-1.21,2.72-6.35,0.15-10.99c-2.13-3.84-6.86-6.12-10.91-5.64
		C480.92,630.26,479.09,635.82,475.42,634.95z"/>
	<path class="st1" d="M329.25,260.82c-4.83,1.07-7.07-6.55-15.4-7.84c-4.88-0.75-11.17,0.78-14.7,5.35
		c-5.49,7.11-0.74,17.02-0.25,18c2.24,4.49,5.63,6.91,8.87,9.12c18.29,12.49,27.43,18.73,32.8,16.94c2.71-0.9,6.75-8.16,14.72-22.63
		c6.67-12.11,8.32-16.11,6.85-20.57c-1.87-5.66-7.6-8.49-8.87-9.12c-1.29-0.64-7.93-3.92-13.69-1.22
		C333.01,251.93,334.06,259.75,329.25,260.82z"/>
	<path class="st2" d="M322.5,268.97c6.47,4.88,12.93,9.75,19.4,14.63"/>
	<path class="st2" d="M339.52,266.58c-4.88,6.47-9.75,12.93-14.63,19.4"/>
	<path class="st2" d="M632.22,259.31c3.53,7.29,7.06,14.58,10.59,21.87"/>
	<path class="st2" d="M648.45,264.95c-7.29,3.53-14.58,7.06-21.87,10.59"/>
</g>
<g class="st0">
	<path class="st1" d="M215,702.9c-13.88,7-38.76,23.68-36,36c2.49,11.1,25.18,8.59,36,27c9.25,15.74,0.61,31.07,9,36
		c8.87,5.21,19.16-11.54,36-9c17.65,2.66,17.78,22.8,36,27c18.64,4.3,28.24-14.51,45-9c15.58,5.12,13.5,23.41,27,27
		c18.41,4.89,29.36-27.27,54-27c23.7,0.26,30.64,29.01,54,27c17.13-1.47,18.69-17.5,36-18c20.04-0.58,26.92,20.64,45,18
		c13.32-1.95,12.36-13.87,27-18c22.78-6.42,42.15,17.64,54,9c6.66-4.86,2.13-13.81,9-18c11.18-6.82,25.28,13.26,45,9
		c12.15-2.63,10.36-11.02,27-18c18.6-7.8,33.9-2.79,36-9c1.97-5.83-10.85-12.2-9-18c2.67-8.39,31.02-0.02,36-9
		c6.58-11.85-27.04-54.82-63-54c-14.15,0.32-24.48,7.34-27,9c-43.2,28.57-129.88,33.33-180,36C366.35,764.66,295.14,662.5,215,702.9
		z"/>
	<path class="st1" d="M962,369.9c-49.52-32.86-267.95,174.68-242.98,254.44c2.19,6.99,12.95,34.42,21.36,33.23
		c5.09-0.72,4.01-11.19,13.05-17.8c12.12-8.86,25.21,1.78,34.42-5.93c10.1-8.46-0.37-25.71,9.49-34.42
		c10.43-9.21,29.16,3.89,36.79-4.75c7.36-8.32-6.11-24.92,1.19-33.23c7.95-9.05,29.82,3.92,36.79-4.75
		c6.56-8.14-8.83-24.5-2.37-33.23c7.45-10.08,33.61,4.09,41.54-5.93c7.79-9.84-11.26-31.28-3.56-40.35
		c7.54-8.89,30.85,5.78,39.16-3.56c8.03-9.01-7.78-29.27,1.19-39.16c6.07-6.7,15.78-1.27,22.55-7.12
		C982.26,417.26,977.36,380.1,962,369.9z"/>
	<path class="st1" d="M371.29,102.14c26.93,12.93,17.15,46.26,45.1,73.58c35.03,34.24,108.68,38.86,144.79,8.31
		c28.19-23.84,21.96-59.34,52.22-70.02c22.39-7.9,44.56,4.9,46.29,5.93c30.11,17.98,35.54,60.42,40.35,103.25
		c7.92,70.53-6.51,109.33,18.97,128.7c6.54,4.98,13.36,6.32,27,9c42.09,8.28,71.88-4.06,99-9c53.42-9.74,119.96,4.95,126,27
		c7.56,27.6-100.67,34.29-139.23,119.64C792.94,584.49,779,649.9,779,649.9c-1.6,7.5-3.06,15.09-9,18
		c-36.41,17.86-159.91-180.04-159-253c0.01-0.93,0.07-4.28,0-9c-0.7-44.47-11.61-90.39-18-90c-6.51,0.4-11.13,48.94-8.09,92.44
		c3.55,50.77,17.09,88.93,22.55,103.25c52.28,137.13,130.53,168.22,121.05,206.51c-22.27,90.01-494.97,80.49-515.08-15.43
		c-7.6-36.25,54.37-61.29,117.56-196.96l0,0c31.49-62.98,41.26-178.31,28-180.81c-7.8-1.47-25.64,35.7-27,72
		c-0.17,4.61-0.25,7.97,0,9c5.59,23.23-70.37,212.54-216,261c-12.96,4.31-24.57,6.88-34.3,1.35c-27.73-15.76,0.81-75.24-17.8-151.91
		C45.76,441.64,4.85,422.51,17,396.9c21.76-45.85,151.35,18.79,214.24-41.97c62.72-60.59-6.24-182.42,66.46-237.36
		C316.58,103.31,348.42,91.17,371.29,102.14z"/>
	<path class="st1" d="M17.62,420.21c5.07,10.2-2.92,15.98,1.19,28.48c4.3,13.1,14.78,11.96,17.8,23.74
		c3.26,12.67-8.06,17.17-5.93,30.86c2.45,15.78,18.68,17.52,18.99,30.86c0.31,13.14-15.29,18.14-13.05,28.48
		c2.31,10.71,20.21,10.76,21.36,20.18c1.15,9.46-16.48,13.02-17.8,26.11C39,620.48,52.18,623.65,53.22,637.4
		c1.26,16.67-17.19,24.72-14.24,34.42c3.1,10.21,28.52,17.56,42.73,10.68c54.56-26.41,4.32-292.15-51.03-296.7
		c-12.25-1.01-31.32,10.24-30.86,17.8C0.18,409.51,12.26,409.44,17.62,420.21z"/>
	<path class="st1" d="M529.13,302.71c11.3,4.66,18.28,7.65,20.18,14.24c4.28,14.89-23.62,26.65-21.36,45.1
		c2.07,16.92,26.88,17.86,29.67,35.6c2.81,17.87-20.98,25.71-18.99,45.1c1.84,17.87,22.77,18.23,27.3,37.98
		c4.82,21.04-17,29.16-14.24,54.59c2.29,21.11,18.29,24.47,16.62,42.73c-1.67,18.16-18.13,21.76-16.62,35.6
		c1.84,16.78,26.68,17.34,30.86,35.6c4.2,18.36-18.68,27.49-15.43,47.47c3.27,20.12,28.42,22.88,28.48,40.35
		c0.05,14.57-17.39,25.64-23.74,29.67c-14.61,9.28-28.77,10.7-45.1,11.87c-54.83,3.92-82.79,5.69-109.19-3.56
		c-15.46-5.42-36.82-12.91-39.16-27.3c-2.45-15.01,18.46-21.3,20.18-42.73c1.81-22.65-20.36-30.44-16.62-49.85
		c3.59-18.61,25.2-17.76,29.67-36.79c4.84-20.64-18.47-30.55-14.24-53.41c3.42-18.51,19.86-18.25,22.55-36.79
		c2.94-20.3-15.7-27.81-11.87-47.47c3.23-16.55,17.39-16.09,20.18-32.04c3.63-20.78-18.79-30.7-14.24-48.66
		c4.11-16.26,24.2-14.95,27.3-29.67c4.24-20.16-30.72-35.42-26.11-53.41c2.46-9.61,14.63-13.81,29.67-18.99
		C483.68,284.59,516.38,297.46,529.13,302.71z"/>
	<path class="st1" d="M521,342.9c1.25,9.92-18.02,14.16-18,27c0.02,12.92,19.54,16.34,20.2,30.13c0.6,12.47-14.89,14.91-16.62,28.48
		c-2.49,19.57,29.17,32.47,24.92,46.29c-3.37,10.95-25.6,10.53-26.11,18.99c-0.45,7.5,16.92,9.45,18.99,20.18
		c2.55,13.26-21.6,22.9-18.99,34.42c2.66,11.7,29.68,10.89,30.86,20.18c1.34,10.58-32.87,18.74-32.04,30.86
		c0.74,10.8,28.42,11.62,30.86,24.92c2.55,13.92-25.85,23.63-23.74,39.16c1.88,13.79,25.8,17.36,24.92,27.3
		c-0.89,10.08-25.89,11-27.3,21.36c-1.65,12.13,31.46,19.27,32.04,35.6c0.53,14.72-25.73,26.13-28.48,27.3
		c-28.85,12.2-57.75,0.04-74.77-7.12c-6.99-2.94-38.4-16.16-36.79-28.48c1.32-10.13,23.72-10.24,26.11-22.55
		c2.45-12.63-19.38-21.59-16.62-33.23c2.82-11.86,27.75-12.02,28.48-21.36c0.68-8.7-20.58-13.3-20.18-22.55
		c0.45-10.24,26.77-11.94,28.48-23.74c1.73-11.93-23.86-19.44-22.55-32.04c1.3-12.51,27.36-13.39,29.67-27.3
		c2.13-12.83-18.84-19.26-17.8-34.42c1.03-15.04,22.39-19.32,21.36-32.04c-0.92-11.49-18.77-13.6-18.99-23.74
		c-0.28-13.02,29.01-16.62,30.86-32.04c1.71-14.29-22.17-21.78-20.18-36.79c1.69-12.69,19.71-14.51,20.18-26.11
		c0.53-13.31-22.87-18.92-21.36-29.67c1.29-9.18,19.8-14.47,32.28-15.18C498.2,325.7,519.73,332.78,521,342.9z"/>
	<path class="st1" d="M457.92,777.44c-10.92-10.3-7.11-28.08-3.56-56.97c3.58-29.12,3.05-58.62,5.93-87.82
		c6.49-65.66-0.38-62.3,5.93-167.34c4.1-68.19,5.45-57.74,4.75-75.96c-1.9-49.36-13.13-84.41,5.93-99.69
		c2.92-2.34,7.33-5.87,11.87-4.75c16.87,4.18,11.27,66.57,9.49,186.33c-1.27,86.02-1.73,129.02,0,149.54
		c3.56,42.19-6.34,85.56,2.37,126.99c1.28,6.07,4.93,22.18-3.56,30.86C488.3,787.62,468.08,787.02,457.92,777.44z"/>
	<path class="st1" d="M484.03,204.21c3.81-0.93,45.45,99.6,17.8,121.05c-6.95,5.39-18.59,6.04-23.74,1.19
		c-9.23-8.7,7.45-30.3,10.68-68.84C491.55,224.6,482.32,204.62,484.03,204.21z"/>
	<path class="st1" d="M489.97,197.09c-1.94-0.51-6.4,15.8-17.8,43.91c-20.49,50.55-34.17,67.17-26.11,78.33
		c4.91,6.8,16.44,9.53,23.74,5.93c11.61-5.72,7.95-26.99,11.87-68.84C485.12,219.4,492.22,197.68,489.97,197.09z"/>
	<path class="st1" d="M486.41,187.59c30.67,3.36,45.63,38.06,48.66,45.1c2.27,5.26,10.16,23.98,3.12,37.86
		c-0.26,0.52-0.52,0.95-0.74,1.3c-7.07,11.29-24.28,15.62-32.04,13.05c-22.36-7.39-13.24-87.23-20.18-87.82
		c-5.65-0.49-8.85,52.8-27.3,55.78c-6.19,1-13.29-3.8-15.43-9.49c-6.02-16.03,22.17-52.7,46.29-47.47
		c21.56,4.67,34.86,41.74,23.74,56.97c-3.22,4.41-9.93,8.98-15.43,7.12c-15.21-5.13-9.9-55.61-13.05-55.78
		c-3.79-0.2,0.72,73.26-24.92,83.08c-15.77,6.04-42.46-11.85-47.47-33.23c-6.72-28.67,27.97-53.43,48.66-61.71
		C466.91,189.69,475.43,186.39,486.41,187.59z"/>
	<path class="st1" d="M272.78,408.34c-5.29-1.93-12.37,12.56-25.44,27.17c-26.23,29.32-54.47,60.34-95.34,78.39
		c-4.79,2.11-17.92,6.18-44.19,14.31C59.49,543.16,35.77,548.3,35,558.9c-0.73,10.11,20.06,16.31,18,27c-1.64,8.54-15.61,8.29-18,18
		c-2.53,10.27,11.57,16.78,9,27c-2.27,9.03-14.32,8.14-18,18c-3.46,9.27,3.13,20.96,9,27c15.14,15.58,42.55,10.94,54,9
		c69.33-11.73,119.02-80.13,132-98c0,0,42.86-59,54-144C276.27,433.24,279.09,410.64,272.78,408.34z"/>
	<path class="st1" d="M674,387.9c13.12-2.38,19.48,35.22,52.14,75.03c50.65,61.72,129.43,86.02,124.86,96.97
		c-1.61,3.86-11.63,1.34-15,8c-4.34,8.58,9.54,18.2,6,28c-3.7,10.26-21.32,6.4-27,18c-4.96,10.13,5.41,19.34,0,27
		c-5.71,8.1-19.69,1.23-27,9c-9.54,10.13,5.31,31.16,0,36c-8.51,7.76-79.33-28.96-114-100c-24.44-50.07-21.31-96.74-18-135
		C658.07,426.9,661.25,390.21,674,387.9z"/>
	<path class="st5" d="M80,540.9c-1.12,7.52-1.29,17.74,4,27c6.3,11.02,14.13,9.82,18,18c8.55,18.08-20.99,42.47-13,54
		c5.42,7.82,22.01,0.94,27,9c3.95,6.37-5.19,18.53-12,28"/>
	<path class="st1" d="M366.54,102.14c3.08-9.65,34.38-12.56,40.35-2.37c3.97,6.77-7.15,16.72-2.37,24.92
		c4.46,7.66,16.18,2.47,23.74,10.68c9.2,10,0.22,26.83,7.12,30.86c6.79,3.97,16.33-11.86,29.67-9.49
		c13.65,2.42,17.13,21.36,26.11,20.18c7.66-1.01,7.24-15.07,16.62-17.8c11.45-3.34,22.72,14.5,29.67,10.68
		c5.45-2.99-0.71-14.36,5.93-22.55c8.23-10.14,24.54-1.15,33.23-10.68c8.8-9.65-2.43-24.63,5.93-33.23
		c9.14-9.4,34.7-3.86,37.46,5.57c2.1,7.17-10.7,10.67-16.1,27.66c-5.19,16.34,3.09,24.83-3.56,32.04c-7.87,8.53-20-1.19-34.42,7.12
		c-14.55,8.38-10.28,22.95-23.74,28.48c-11.9,4.9-18.65-5.09-34.42,0c-12.11,3.9-11.54,10.88-20.18,11.87
		c-15.51,1.77-20.03-20.44-41.54-24.92c-17.41-3.63-28.7,7.96-35.6,1.19c-6.58-6.46,2.57-18.11-4.75-28.48
		c-6.8-9.63-18.09-4.4-24.92-14.24c-5.65-8.14,0.57-13.89-4.75-28.48C371.59,108.95,365.04,106.85,366.54,102.14z"/>
	<path class="st5" d="M134,522.9c-3.03,8.54-5.08,19.14,0,27c7.27,11.27,23.39,7.98,27,18c2.31,6.43-1.99,14.26-9,27
		c-6.13,11.14-4.15,15.02-3,19c1.13,3.9,15.94,16.95,36,18"/>
	<path class="st5" d="M224,459.9c-1.14,3.38-1.82,7.13,0,9c3.6,3.7,13.45-3.51,18,0c4.06,3.13-3.51,12.82,0,18
		c1.99,2.94,7.72,4.96,24,1"/>
	<path class="st2" d="M710,441.9c-1.82,3.85-4.69,8.21-9,9c-3.96,0.73-5.45-2.25-9-2c-8.26,0.59-9.35,17.41-18,20
		c-3.21,0.96-8.68,0.33-18-9"/>
	<path class="st2" d="M656,522.9c20.23,12.86,30.42,12.22,36,9c10.75-6.19,8.12-24.06,18-27c8.96-2.66,15.76,10.63,27,9
		c8.42-1.22,14.25-10.08,18-18"/>
	<path class="st2" d="M683,603.9c13.18,4.03,30.04,7.49,36,0c7.14-8.98-7.53-25.98,0-36c8.19-10.91,30.16,3.14,45-9
		c13.19-10.79,6.73-30.8,18-36c7.8-3.6,18.47,2.49,27,9"/>
	<path class="st2" d="M242,351.9c4.29,8.62,17.3,31.79,45,45c14.13,6.74,27.21,8.56,36,9"/>
	<path class="st2" d="M620,396.9c13.37-4.19,28.66-9.96,45-18c17.85-8.78,32.84-18.25,45-27"/>
	<path class="st2" d="M743,667.9c17.88-8.69,24.77-18.42,27-27c4-15.38-6.83-27.54,0-36c6.73-8.34,20.67-0.79,27-9
		c6.88-8.93-5.5-22.33,0-36c4.24-10.53,16.84-15.47,27-18"/>
	<path class="st1" d="M185,496.9c-6.88,24.52-4.19,33.03,0,36c7.45,5.29,21.49-5.62,27,0c5.57,5.67-5.5,20.07,0,27
		c3.48,4.38,12.48,4.38,27,0"/>
</g>
<g>
	<path class="st6" d="M707.14,418.92c0.45,8.18,5.05,17.89,10.34,18.19c7.07,0.4,8.24-16.42,19.02-19.02
		c11.34-2.74,20.76,13.29,28.54,9.51c6.49-3.15,2.69-15.64,9.51-19.02c7.45-3.69,16.18,9.12,25.42,5.59
		c7.35-2.81,5.57-12.37,12.63-15.1c10.33-3.99,22.27,13.35,28.54,9.51c4.01-2.45,3.56-12.26,0-19.02
		c-2.93-5.58-8.36-9.82-19.75-13.47c-7.79-2.5-26.2-7.59-56.33-1.59c-19.92,3.97-34,6.97-46.02,19.04
		C715.05,397.54,706.48,406.69,707.14,418.92z"/>
	<path class="st6" d="M125.18,389.56c-2.35,6.99-1.87,16.58,2.54,19.01c7.18,3.95,20.04-13.68,28.54-9.51
		c6.61,3.24,2.94,15.92,9.51,19.02c8.34,3.94,20.55-13.5,28.54-9.51c6.46,3.22,3.37,17.04,9.51,19.02c4.95,1.6,8.86-6.76,14.98-5.5
		c6.99,1.44,6.69,13.33,13.56,15.01c5.32,1.31,13.17-3.95,15.01-10.25c3.34-11.43-13.4-25.19-26.98-36.5
		c-18.25-15.2-28.81-24-45.22-25.39C155.05,363.26,130.78,372.88,125.18,389.56z"/>
	<path class="st6" d="M508.9,169.7c25.14-21.84,50.27-43.68,75.41-65.52c0.63-2.11,1.32-5.72,0-9.51c0,0-2.03-5.82-9.51-9.51
		c-14.11-6.97-76.11,56.76-85.61,66.59c-52.12-46.33-85.6-76.09-85.61-76.1c-8.89-0.87-16.6,3.22-19.02,9.51
		c-1.49,3.85-0.63,7.58,0,9.51c0,0,29.74,26.43,85.61,76.1c-38.75,27.16-65.93,45.2-85.61,57.07c-5.85,3.53-20.35,12.13-18.97,20.1
		c0.84,4.88,7.29,7.54,9.46,8.44c22.83,9.42,90.95-46.83,114.15-66.59c6.86,6.98,16.64,16.85,28.54,28.54
		c3.11,3.05,52.62,51.54,57.07,47.56c1.29-1.15-2.21-5.79,0.24-9.22c2.52-3.52,8.5-1.59,9.52-3.17
		C590.32,244.54,562.15,219.97,508.9,169.7z"/>
	<path class="st6" d="M310.84,137.65c3.82,2.48,6.41,5.09,31.74,49.19c34.24,59.61,35.36,66.07,46.02,71.41
		c24.83,12.43,37.23-5.58,93.62-7.93c58.08-2.43,77.89,15.29,99.97-1.59c3.62-2.77,4.8-5.32,25.39-55.54
		c15.49-37.77,16-39.6,19.04-42.84c23.28-24.82,84.98-15.36,125.36,7.93c93.18,53.77,111.18,203.42,79.34,223.74
		c-13.54,8.64-28.15-11.09-61.89-3.17c-34.12,8.01-43.64,34.17-65.06,30.15c-21.76-4.08-30.25-37.26-36.5-34.91
		c-5.57,2.1-0.31,28.58,0,30.15c16.92,85.49-35.16,136.36-14.28,211.05c18.23,65.21,67.75,71.36,63.47,114.25
		c-3.23,32.31-41.16,52.64-76.17,71.41c-13.88,7.44-96.34,51.64-131.71,20.63c-23.08-20.24-14.95-62.76-23.8-63.47
		c-9.16-0.74-8.05,45.6-33.32,66.65c-47.93,39.91-191.13-11.43-204.7-82.51c-9.31-48.75,52.3-57.85,57.92-130.12
		c5.98-77.01-59.37-124.05-37.29-203.11c1.99-7.11,10.16-34.09,7.93-34.91c-2.89-1.06-14.05,45.52-34.91,47.6
		c-19.44,1.94-26.44-36.84-60.3-44.43c-22.1-4.96-30.88,8.93-42.84,3.17c-28.93-13.91-32.48-121.45,25.39-188.83
		C203.8,144.4,276.09,115.05,310.84,137.65z"/>
	<path class="st6" d="M467.71,286.92c-2,0-1.85-7.7-5.73-9.24c-3.49-1.38-9.65,2.43-11.11,7.14c-2.46,7.95,7.55,21.5,18.25,20.63
		c11.01-0.9,18.39-16.75,14.68-23.41c-1.86-3.33-7.1-5.45-10.31-3.97C469.46,279.93,469.62,286.93,467.71,286.92z"/>
	<path class="st6" d="M479.8,724.91c-2,0-1.85-7.7-5.73-9.24c-3.49-1.38-9.65,2.43-11.11,7.14c-2.46,7.95,7.55,21.5,18.25,20.63
		c11.01-0.9,18.39-16.75,14.68-23.41c-1.86-3.33-7.1-5.45-10.31-3.97C481.55,717.92,481.71,724.91,479.8,724.91z"/>
	<path class="st6" d="M476.73,619.2c-2,0-1.85-7.7-5.73-9.24c-3.49-1.38-9.65,2.43-11.11,7.14c-2.46,7.95,7.55,21.5,18.25,20.63
		c11.01-0.9,18.39-16.75,14.68-23.41c-1.86-3.33-7.1-5.45-10.31-3.97C478.48,612.21,478.64,619.2,476.73,619.2z"/>
	<path class="st6" d="M475.68,508.85c-2,0-1.85-7.7-5.73-9.24c-3.49-1.38-9.65,2.43-11.11,7.14c-2.46,7.95,7.55,21.5,18.25,20.63
		c11.01-0.9,18.39-16.75,14.68-23.41c-1.86-3.33-7.1-5.45-10.31-3.97C477.43,501.86,477.59,508.85,475.68,508.85z"/>
	<path class="st6" d="M474.62,393.63c-2,0-1.85-7.7-5.73-9.24c-3.49-1.38-9.65,2.43-11.11,7.14c-2.46,7.95,7.55,21.5,18.25,20.63
		c11.01-0.9,18.39-16.75,14.68-23.41c-1.86-3.33-7.1-5.45-10.31-3.97C476.37,386.64,476.53,393.63,474.62,393.63z"/>
	<path class="st7" d="M608.76,566.89c-5.97,21.08-11.95,52.02-9.52,89.26c3.93,60.1,27.68,104.2,41.65,126.15"/>
	<path class="st7" d="M350.51,570.46c7.48,18.66,16.73,49.04,15.47,86.88c-2.25,67.56-36.53,114.35-49.98,130.91"/>
	<path class="st7" d="M312.82,233.53c-4.37,6.24,0.61,14.09,1.97,23.9c2.68,19.23-9.95,35.71-19.02,47.56
		c-26.11,34.09-58.87,31.13-62.69,54.69c-1.7,10.53,3.17,21.41,5.61,21.41c3.2,0,4.45-18.7,9.51-19.02
		c3.77-0.24,6.09,9.92,9.51,9.51c4.03-0.48,1.98-14.7,9.51-19.02c6.47-3.72,13.07,3.84,19.02,0c6.53-4.2,2.96-16.09,9.51-19.02
		c3.68-1.65,5.83,1.65,9.51,0c6.5-2.91,3.03-14.63,9.51-19.02c6.6-4.47,17.29,2.84,19.02,0c1.91-3.12-11.48-11.18-9.51-19.02
		c0.35-1.38,3.4-4.09,9.51-9.51c6.16-5.47,9.25-8.23,9.51-9.51c1.46-7.17-11.01-12.17-9.51-19.02c1.18-5.41,9.82-6.33,9.51-9.51
		c-0.45-4.55-18.28-4.47-19.02-9.51c-0.59-4.01,10.17-7.45,9.51-9.51C333.09,226.59,318.12,225.97,312.82,233.53z"/>
	<path class="st7" d="M688.5,174.15c8.23,20.57,33.26,18.87,54.75,32.13c49.3,30.42,34.81,111.73,63.08,115.44
		c12.33,1.62,26.66-12.34,25.31-17.79c-1.34-5.39-18.62-4.84-19.02-9.51c-0.31-3.62,9.91-6.05,9.51-9.51
		c-0.49-4.35-16.98-3.17-19.02-9.51c-1.97-6.12,11.51-13.02,9.51-19.02c-2-6-16.89-3.41-19.02-9.51
		c-2.16-6.19,11.54-13.5,9.51-19.02c-2.43-6.61-23.58-0.38-28.54-9.51c-1.75-3.22-1.17-8.49,0-19.02c0.66-5.94,1.4-7.96,0-9.51
		c-3.48-3.85-12.38,3.7-19.02,0c-7.25-4.04-3.91-17.08-9.51-19.02c-6-2.08-13.33,11.68-19.02,9.51c-5.36-2.04-2.22-15.52-9.51-19.02
		c-3.04-1.46-4.29,0.54-9.51,0c-10.93-1.14-15.48-10.95-19.02-9.51C685.45,153.16,684.74,164.76,688.5,174.15z"/>
	<path class="st6" d="M394.06,311.33c16.32,8.46,3.72,55.43,0,95.12c-9.66,103.06,39.43,169.25,19.02,180.73
		c-10.65,5.99-34.74-6.01-38.05-19.02c-1.6-6.3,2.35-9.8,0-19.02c-2.65-10.42-9.29-11.38-9.51-19.02c-0.25-8.75,8.4-9.73,9.51-19.02
		c1.49-12.42-12.91-19.44-9.51-28.54c2.03-5.44,7.65-4.15,9.51-9.51c3.36-9.67-13-19.41-9.51-28.54c2.03-5.31,8.53-4.51,9.51-9.51
		c1.39-7.09-11.01-12.17-9.51-19.02c1.18-5.41,9.85-6.39,9.51-9.51c-0.46-4.3-16.96-3.16-19.02-9.51
		c-1.81-5.57,9.76-9.83,9.51-19.02c-0.24-8.83-11.13-12.56-9.51-19.02c1.26-5.01,8.22-4.51,9.51-9.51
		c1.69-6.53-9.37-10.39-9.51-19.02c-0.14-8.54,10.49-16.27,19.02-19.02C380.74,309.49,389.04,308.72,394.06,311.33z"/>
	<path class="st6" d="M555.25,313.23c-16.32,8.46-3.72,55.43,0,95.12c9.66,103.06-39.43,169.25-19.02,180.73
		c10.65,5.99,34.74-6.01,38.05-19.02c1.6-6.3-2.35-9.8,0-19.02c2.65-10.42,9.29-11.38,9.51-19.02c0.25-8.75-8.4-9.73-9.51-19.02
		c-1.49-12.42,12.91-19.44,9.51-28.54c-2.03-5.44-7.65-4.15-9.51-9.51c-3.36-9.67,13-19.41,9.51-28.54
		c-2.03-5.31-8.53-4.51-9.51-9.51c-1.39-7.09,11.01-12.17,9.51-19.02c-1.18-5.41-9.85-6.39-9.51-9.51
		c0.46-4.3,16.96-3.16,19.02-9.51c1.81-5.57-9.76-9.83-9.51-19.02c0.24-8.83,11.13-12.56,9.51-19.02c-1.26-5.01-8.22-4.51-9.51-9.51
		c-1.69-6.53,9.37-10.39,9.51-19.02c0.14-8.54-10.49-16.27-19.02-19.02C568.57,311.39,560.27,310.62,555.25,313.23z"/>
	<path class="st6" d="M409.92,627.35c16.8,5.77,13.09,59.97,9.51,85.61c-6.2,44.51-25.04,96.57-38.05,95.12
		c-5.87-0.65-12.09-12.38-9.51-19.02c2-5.14,8.32-4.79,9.51-9.51c1.8-7.14-11.27-13.29-9.51-19.02c1.82-5.92,17.01-3.47,19.02-9.51
		c2-6.01-11.52-13.01-9.51-19.02c2.01-6.02,17.02-3.45,19.02-9.51c1.8-5.43-9.53-9.67-9.51-19.02c0.02-8.64,9.69-10.61,9.51-19.02
		c-0.19-8.9-11.14-12.55-9.51-19.02c1.26-5.02,8.26-4.53,9.51-9.51c1.74-6.91-10.64-12.22-9.51-19.02
		C391.87,630.95,402.86,624.92,409.92,627.35z"/>
	<path class="st6" d="M546.04,617.56c-16.8,5.77-13.09,59.97-9.51,85.61c6.2,44.51,25.04,96.57,38.05,95.12
		c5.87-0.65,12.09-12.38,9.51-19.02c-2-5.14-8.32-4.79-9.51-9.51c-1.8-7.14,11.27-13.29,9.51-19.02
		c-1.82-5.92-17.01-3.47-19.02-9.51c-2-6.01,11.52-13.01,9.51-19.02c-2.01-6.02-17.02-3.45-19.02-9.51
		c-1.8-5.43,9.53-9.67,9.51-19.02c-0.02-8.64-9.69-10.61-9.51-19.02c0.19-8.9,11.14-12.55,9.51-19.02
		c-1.26-5.02-8.26-4.53-9.51-9.51c-1.74-6.91,10.64-12.22,9.51-19.02C564.08,621.16,553.1,615.13,546.04,617.56z"/>
	<path class="st7" d="M270.62,174.83c-8.23,20.57-33.26,18.87-54.75,32.13c-49.3,30.42-34.81,111.73-63.08,115.44
		c-12.33,1.62-26.66-12.34-25.31-17.79c1.34-5.39,18.62-4.84,19.02-9.51c0.31-3.62-9.91-6.05-9.51-9.51
		c0.49-4.35,16.98-3.17,19.02-9.51c1.97-6.12-11.51-13.02-9.51-19.02c2-6,16.89-3.41,19.02-9.51c2.16-6.19-11.54-13.5-9.51-19.02
		c2.43-6.61,23.58-0.38,28.54-9.51c1.75-3.22,1.17-8.49,0-19.02c-0.66-5.94-1.4-7.96,0-9.51c3.48-3.85,12.38,3.7,19.02,0
		c7.25-4.04,3.91-17.08,9.51-19.02c6-2.08,13.33,11.68,19.02,9.51c5.36-2.04,2.22-15.52,9.51-19.02c3.04-1.46,4.29,0.54,9.51,0
		c10.93-1.14,15.48-10.95,19.02-9.51C273.67,153.84,274.37,165.45,270.62,174.83z"/>
	<path class="st7" d="M653.26,232.23c4.37,6.24-0.61,14.09-1.97,23.9c-2.68,19.23,9.95,35.71,19.02,47.56
		c26.11,34.09,58.87,31.13,62.69,54.69c1.7,10.53-3.17,21.41-5.61,21.41c-3.2,0-4.45-18.7-9.51-19.02
		c-3.77-0.24-6.09,9.92-9.51,9.51c-4.03-0.48-1.98-14.7-9.51-19.02c-6.47-3.72-13.07,3.84-19.02,0c-6.53-4.2-2.96-16.09-9.51-19.02
		c-3.68-1.65-5.83,1.65-9.51,0c-4.39-1.97-2.84-11.25-9.51-19.02c-4.41-5.15-8.58-4.53-9.9-9.27c-1.13-4.05,1.6-5.62,0.39-9.75
		c-0.92-3.14-3.13-3.85-9.51-9.51c-6.16-5.47-9.25-8.23-9.51-9.51c-1.46-7.17,11.01-12.17,9.51-19.02
		c-1.18-5.41-9.82-6.33-9.51-9.51c0.45-4.55,18.28-4.47,19.02-9.51c0.59-4.01-10.17-7.45-9.51-9.51
		C633,225.29,647.96,224.67,653.26,232.23z"/>
	<path class="st7" d="M298.94,199.3c-15.54,11-37.4,29.25-57.07,57.07c-23.57,33.33-33.53,65.58-38.05,85.61"/>
	<path class="st7" d="M669.54,208.32c15.54,11,37.4,29.25,57.07,57.07c23.57,33.33,33.53,65.58,38.05,85.61"/>
</g>
</svg>
