<svg width="50" height="18" viewBox="0 0 50 18" fill="none" xmlns="http://www.w3.org/2000/svg">
<path fill-rule="evenodd" clip-rule="evenodd" d="M14.0543 5.70272C12.9858 5.70272 9.97332 5.45332 8.44934 4.56203C10.858 3.24677 15.17 1.66635 17.3412 1.66635C19.2734 1.66504 21.6414 1.66504 23.5145 1.66504C26.443 1.66504 28.9344 2.7204 31.3496 4.06848C30.9559 4.46359 30.7393 4.95714 30.7196 5.51632C30.717 5.57933 30.7196 5.64102 30.7275 5.70272H14.0543Z" fill="#6D6D6D"/>
<path d="M5.46058 15.1951C2.97444 15.1951 0.364915 13.5136 0.253341 13.4414L0 13.276V9.49564L0.081379 9.36306C0.208705 9.15041 0.539489 8.48228 0.539489 7.95197L0.685192 4.45772L2.79198 4.03768C5.64041 2.7001 13.024 0 18.1564 0H24.5529C26.0126 0.126013 27.253 0.350475 28.2848 0.669446C30.3889 1.31658 35.1262 4.15844 35.9165 4.63756C36.6647 4.72419 40.6262 5.20724 43.8724 6.03683C47.7131 7.01868 49.0166 8.55841 49.1689 9.23573L49.5036 14.7383L49.0363 14.846C48.1319 15.056 47.3902 15.1925 45.4081 15.1925H43.5416V14.0767H45.4081C46.9269 14.0767 47.6436 13.9967 48.3183 13.8602L48.2946 13.5583L48.0662 9.388C47.994 9.22261 46.9229 7.96904 43.5954 7.11845C40.092 6.22323 35.7143 5.73755 35.671 5.73361L35.44 5.65485C35.3875 5.62204 30.0739 2.38769 27.9566 1.73531C26.9984 1.44128 25.838 1.23126 24.5044 1.11443L18.1564 1.11706C13.1763 1.11706 5.93313 3.78434 3.20678 5.07598L3.07682 5.1193L1.76418 5.38051L1.65523 7.97429C1.65654 8.71855 1.2877 9.48251 1.11705 9.79885V12.6591C1.81013 13.0647 3.83159 14.1017 5.59315 14.0767H7.06987V15.1925H5.6089C5.55902 15.1938 5.50914 15.1951 5.46058 15.1951ZM37.2593 15.1925H13.3522V14.0767H37.2593V15.1925Z" fill="#6D6D6D"/>
<path fill-rule="evenodd" clip-rule="evenodd" d="M1.15836 7.41809C1.13736 7.96546 1.11899 8.54696 1.11768 8.89087H1.81992C2.72826 8.89087 3.93062 8.20436 3.96737 7.41809V6.69482H1.13343V7.41809H1.15836Z" fill="#6D6D6D"/>
<path fill-rule="evenodd" clip-rule="evenodd" d="M44.929 8.75098L45.9935 10.6622C46.344 10.4627 46.8585 10.334 47.255 10.334H47.2812C47.8364 10.3406 48.3891 10.334 48.9443 10.334L48.9233 10.2434C48.8787 10.0584 48.3484 9.15264 47.8023 8.75098H44.929Z" fill="#6D6D6D"/>
<path d="M26.201 7.19775H23.627V7.94202H26.201V7.19775Z" fill="#6D6D6D"/>
<path d="M14.7578 7.19775H12.1824V7.94202H14.7578V7.19775Z" fill="#6D6D6D"/>
<path fill-rule="evenodd" clip-rule="evenodd" d="M16.9656 11.8359V12.7889H34.4631L16.9656 11.8359Z" fill="#6D6D6D"/>
<path d="M48.9359 12.2378H47.6783V12.9834H48.9359V12.2378Z" fill="#6D6D6D"/>
<path fill-rule="evenodd" clip-rule="evenodd" d="M47.4887 11.9922H46.9361C46.7169 11.9922 46.5383 12.1707 46.5383 12.3899V12.8218C46.5383 13.041 46.7169 13.2182 46.9361 13.2182H47.4887C47.7079 13.2182 47.8864 13.041 47.8864 12.8218V12.3899C47.8864 12.1707 47.7079 11.9922 47.4887 11.9922Z" fill="#6D6D6D"/>
<path fill-rule="evenodd" clip-rule="evenodd" d="M31.7734 4.41582L31.7629 4.425C31.4518 4.72822 31.2864 5.09839 31.2719 5.52762C31.2654 5.6812 31.3165 5.81509 31.4229 5.92535C31.5305 6.03561 31.6618 6.09206 31.8167 6.09206H33.0492C33.2527 6.09206 33.4247 5.98967 33.5244 5.81378C33.6242 5.63657 33.6189 5.43574 33.5152 5.26378C33.2895 4.89362 32.9206 4.49457 32.3325 4.2898C32.133 4.22023 31.9243 4.26749 31.7734 4.41582Z" fill="#6D6D6D"/>
<path d="M32.7806 6.65316C32.6664 6.65316 32.5535 6.59935 32.48 6.49959L31.7895 5.55317C31.6688 5.38778 31.7055 5.15544 31.8709 5.03337C32.0376 4.91392 32.27 4.94805 32.3907 5.11475L33.0812 6.06116C33.2033 6.22787 33.1665 6.46021 32.9998 6.58097C32.9342 6.62954 32.858 6.65316 32.7806 6.65316Z" fill="#6D6D6D"/>
<path fill-rule="evenodd" clip-rule="evenodd" d="M0.871704 13.166V14.7372H4.96582V14.6152C3.2594 14.4563 1.5569 13.5624 0.871704 13.166Z" fill="#6D6D6D"/>
<path fill-rule="evenodd" clip-rule="evenodd" d="M10.2257 8.47168C11.5304 8.47168 12.7171 9.00592 13.5782 9.8657L13.5808 9.86833C14.4406 10.7294 14.9748 11.9174 14.9748 13.2208V15.1976H13.204C13.5007 14.6883 13.67 14.0963 13.67 13.4636C13.67 11.5616 12.1277 10.0193 10.2257 10.0193C8.32367 10.0193 6.78133 11.5616 6.78133 13.4636C6.78133 14.0963 6.95065 14.6883 7.24731 15.1976H5.47656V13.2208C5.47656 11.916 6.01081 10.7294 6.87059 9.86833L6.87321 9.8657C7.7343 9.00592 8.92224 8.47168 10.2257 8.47168Z" fill="#6D6D6D"/>
<path fill-rule="evenodd" clip-rule="evenodd" d="M7.36921 10.6213C8.09641 9.89408 9.10189 9.44385 10.2124 9.44385C11.3216 9.44385 12.327 9.89408 13.0542 10.6213L13.0569 10.6239C13.7841 11.3511 14.2343 12.3566 14.2343 13.4658C14.2343 14.5763 13.7841 15.5818 13.0569 16.309H13.0542C12.327 17.0362 11.3216 17.4864 10.2124 17.4864C9.10189 17.4864 8.09641 17.0362 7.36921 16.309C6.64201 15.5818 6.19177 14.5763 6.19177 13.4658C6.19177 12.3566 6.64201 11.3511 7.36921 10.6239V10.6213ZM10.2124 10.6541C8.65953 10.6541 7.40072 11.9129 7.40072 13.4658C7.40072 15.0186 8.65953 16.2774 10.2124 16.2774C11.7652 16.2774 13.024 15.0186 13.024 13.4658C13.024 11.9129 11.7652 10.6541 10.2124 10.6541Z" fill="#6D6D6D"/>
<path fill-rule="evenodd" clip-rule="evenodd" d="M10.2293 14.4879C10.7898 14.4879 11.2479 14.0298 11.2479 13.4693C11.2479 12.9088 10.7898 12.4507 10.2293 12.4507C9.66746 12.4507 9.20935 12.9088 9.20935 13.4693C9.20935 14.0298 9.66746 14.4879 10.2293 14.4879Z" fill="#6D6D6D"/>
<path fill-rule="evenodd" clip-rule="evenodd" d="M40.4016 8.47168C41.705 8.47168 42.893 9.00592 43.7541 9.8657L43.7567 9.86833C44.6165 10.7294 45.1507 11.9174 45.1507 13.2208V15.1976H43.3786C43.6753 14.6883 43.8459 14.0963 43.8459 13.4636C43.8459 11.5616 42.3036 10.0193 40.4016 10.0193C38.4983 10.0193 36.9559 11.5616 36.9559 13.4636C36.9559 14.0963 37.1266 14.6883 37.4232 15.1976H35.6525V13.2208C35.6525 11.916 36.1867 10.7294 37.0465 9.86833L37.0491 9.8657C37.9102 9.00592 39.0968 8.47168 40.4016 8.47168Z" fill="#6D6D6D"/>
<path fill-rule="evenodd" clip-rule="evenodd" d="M37.5676 10.6213C38.2948 9.89408 39.3003 9.44385 40.4107 9.44385C41.5199 9.44385 42.5254 9.89408 43.2526 10.6213L43.2539 10.6239C43.9811 11.3511 44.4327 12.3566 44.4327 13.4658C44.4327 14.5763 43.9824 15.5818 43.2539 16.309H43.2526C42.5254 17.0362 41.5199 17.4864 40.4107 17.4864C39.3003 17.4864 38.2948 17.0362 37.5676 16.309C36.8404 15.5818 36.3901 14.5763 36.3901 13.4658C36.3901 12.3566 36.8404 11.3511 37.5676 10.6239V10.6213ZM40.4107 10.6541C38.8579 10.6541 37.5991 11.9129 37.5991 13.4658C37.5991 15.0186 38.8579 16.2774 40.4107 16.2774C41.9636 16.2774 43.2224 15.0186 43.2224 13.4658C43.2224 11.9129 41.9636 10.6541 40.4107 10.6541Z" fill="#6D6D6D"/>
<path fill-rule="evenodd" clip-rule="evenodd" d="M40.4041 14.4879C40.9659 14.4879 41.4227 14.0298 41.4227 13.4693C41.4227 12.9088 40.9659 12.4507 40.4041 12.4507C39.8436 12.4507 39.3855 12.9088 39.3855 13.4693C39.3855 14.0298 39.8436 14.4879 40.4041 14.4879Z" fill="#6D6D6D"/>
</svg>
