<svg width="64" height="64" viewBox="0 0 64 64" fill="none" xmlns="http://www.w3.org/2000/svg">
<path d="M19.824 8.19513C19.7888 8.23353 19.664 8.35193 19.5456 8.46073C19.312 8.67833 19.2576 8.79993 19.2096 9.21593C19.1936 9.33113 19.1904 19.6415 19.2 32.1279L19.216 54.8319L19.3312 55.0719C19.4432 55.3055 19.568 55.4591 19.7696 55.6063L19.8656 55.6799H44.704L44.8352 55.5615C45.072 55.3471 45.1904 55.0783 45.264 54.5983C45.3312 54.1535 45.3376 9.21913 45.2704 8.97593C45.2032 8.73273 45.168 8.67833 44.8864 8.39033L44.624 8.12793H19.888L19.824 8.19513ZM43.92 8.77113C44.0896 8.81913 44.3008 8.96633 44.3776 9.09433C44.4416 9.19673 44.4416 9.26393 44.4512 12.5759C44.4608 15.2607 44.4544 15.9775 44.4192 16.0703L44.3776 16.1919H32.3232C23.6512 16.1919 20.2368 16.1823 20.1632 16.1567L20.064 16.1215L20.0576 12.9983C20.0512 11.2767 20.0512 9.72153 20.0544 9.53913C20.0672 9.07513 20.0928 9.00153 20.2944 8.85753L20.464 8.73913L32.128 8.73593C40.5472 8.73593 43.8272 8.74553 43.92 8.77113ZM44.4256 31.6703C44.416 39.6767 44.3968 46.2367 44.384 46.2527C44.368 46.2687 39.0496 46.2687 32.2112 46.2559L20.064 46.2303V17.1519L25.8016 17.1423C28.9536 17.1391 34.4416 17.1327 37.9904 17.1263L44.4416 17.1199L44.4256 31.6703ZM44.448 50.7423C44.448 52.9791 44.4352 54.3295 44.416 54.4575C44.3648 54.7711 44.2688 54.9983 44.176 55.0207C43.8816 55.0943 42.752 55.1039 32.0352 55.1039L20.576 55.1071L20.416 55.0367C20.24 54.9599 20.1568 54.8543 20.096 54.6303C20.0704 54.5279 20.0608 53.5103 20.0608 50.8895C20.064 48.9119 20.0704 47.2767 20.08 47.2607C20.0928 47.2447 24.8416 47.2319 32.2752 47.2319H44.448V50.7423Z" fill="black"/>
<path d="M21.7152 9.62563C21.696 9.65443 21.7408 13.04 21.776 14.2432C21.792 14.8 21.7856 14.9408 21.7408 15.1296C21.712 15.2512 21.696 15.392 21.7088 15.4368C21.728 15.52 21.7312 15.52 22.0416 15.52C22.2112 15.52 22.3712 15.5072 22.3968 15.4912C22.4288 15.472 22.432 15.4272 22.416 15.3248C22.3776 15.0976 22.3616 12.5056 22.4 12.4672C22.4224 12.4448 22.464 12.4672 22.5312 12.5312C22.7168 12.704 23.4112 13.5264 23.8432 14.0832C24.08 14.3872 24.4064 14.7808 24.5696 14.9536C24.7328 15.1296 24.8896 15.312 24.9184 15.3632C24.9504 15.4144 24.9952 15.4624 25.024 15.472C25.1264 15.504 25.5904 15.5424 25.7056 15.5264C25.8112 15.5136 25.824 15.504 25.8048 15.4432C25.7664 15.3152 25.6352 15.1456 25.4432 14.9728C25.3344 14.8768 25.0784 14.5824 24.8736 14.32C24.2176 13.4752 23.9584 13.1712 23.4976 12.6976C23.264 12.4576 23.1968 12.3744 23.2064 12.3136C23.216 12.2432 23.2256 12.24 23.616 12.224C23.9744 12.2112 24.032 12.1984 24.16 12.1248C24.336 12.0192 24.5216 11.8432 24.624 11.68C24.864 11.3024 24.8992 10.7616 24.7168 10.368C24.5504 10.0128 24.352 9.84003 23.984 9.72803C23.904 9.70243 23.4816 9.68003 22.848 9.66403C22.2944 9.65123 21.8176 9.62883 21.7888 9.61923C21.7568 9.60643 21.7248 9.60963 21.7152 9.62563ZM23.552 10.2752C23.9072 10.3296 24.1088 10.4896 24.1984 10.7904C24.2464 10.9568 24.1664 11.2224 24.0096 11.3952C23.84 11.5808 23.6864 11.616 23.0048 11.616C22.496 11.616 22.4352 11.6096 22.416 11.5584C22.3776 11.4656 22.3584 10.3904 22.3936 10.304L22.4256 10.224L22.8832 10.2336C23.136 10.2368 23.4368 10.256 23.552 10.2752Z" fill="black"/>
<path d="M32.6111 9.6289C32.5823 9.6481 32.5759 9.6769 32.5919 9.7153C32.6111 9.7665 32.6815 14.2529 32.6687 14.9121C32.6687 15.0241 32.6463 15.1649 32.6239 15.2225C32.5983 15.2865 32.5887 15.3601 32.6047 15.4145C32.6271 15.4945 32.6431 15.5041 32.7871 15.5137C32.8735 15.5201 33.3471 15.5169 33.8399 15.5041L34.7359 15.4817L34.9375 15.1809C35.0463 15.0145 35.1359 14.8577 35.1359 14.8321C35.1359 14.7681 35.0719 14.7713 34.5567 14.8513C34.2751 14.8961 34.0447 14.9121 33.8879 14.9025C33.6287 14.8865 33.3919 14.8065 33.3471 14.7233C33.2415 14.5249 33.2223 13.8433 33.2543 11.5041C33.2703 10.2497 33.2799 10.0129 33.3247 9.9009C33.3663 9.8017 33.3695 9.7505 33.3471 9.6865C33.3151 9.6001 33.3119 9.6001 32.9855 9.6001C32.8031 9.6001 32.6367 9.6129 32.6111 9.6289Z" fill="black"/>
<path d="M28.2816 9.66405C28.2528 9.68325 28.0512 9.72485 27.8336 9.75685C27.5296 9.80165 27.392 9.84005 27.232 9.92005C26.592 10.2432 26.1344 10.7136 25.824 11.3696C25.6192 11.7984 25.584 11.9712 25.5872 12.576C25.5872 13.0656 25.5936 13.1232 25.6768 13.376C25.856 13.92 26.0864 14.288 26.496 14.688C26.8768 15.0624 27.3056 15.3056 27.84 15.4464C28.1696 15.5328 28.7968 15.5168 29.184 15.4144C30.3168 15.1168 31.0944 14.336 31.3664 13.2256C31.456 12.8544 31.4624 12.3072 31.3792 11.9584C31.1296 10.88 30.2784 10.0224 29.1712 9.74405C28.8288 9.65765 28.3616 9.61605 28.2816 9.66405ZM29.0528 10.3392C29.7024 10.4896 30.2368 10.912 30.528 11.504C30.7168 11.8816 30.768 12.1088 30.7648 12.56C30.7648 13.1392 30.6304 13.5488 30.2944 14.0064C29.8048 14.6656 28.8544 15.0336 28.064 14.8672C27.7696 14.8064 27.3088 14.5824 27.072 14.3872C26.7168 14.0928 26.4224 13.664 26.2848 13.232C26.1824 12.9216 26.1504 12.448 26.208 12.1536C26.3168 11.5872 26.6848 11.0304 27.184 10.672C27.4752 10.464 27.632 10.3936 27.984 10.3136C28.3552 10.2304 28.6208 10.2368 29.0528 10.3392Z" fill="black"/>
<path d="M36.6144 9.66071C36.5792 9.68311 36.576 9.75671 36.608 10.0831C36.6336 10.3327 36.6528 11.3183 36.6592 12.7519C36.672 14.7903 36.6688 15.0399 36.6208 15.1903C36.592 15.2831 36.576 15.3919 36.5888 15.4367L36.608 15.5199L37.5616 15.5167C38.0832 15.5135 38.5536 15.5039 38.6048 15.4911C38.6752 15.4751 38.7424 15.4047 38.8992 15.1711C39.0112 15.0079 39.104 14.8511 39.104 14.8287C39.104 14.7679 39.0176 14.7711 38.624 14.8511C38.24 14.9247 37.8656 14.9407 37.68 14.8863C37.6096 14.8671 37.4816 14.8063 37.3984 14.7519L37.248 14.6559V12.3871C37.248 10.4127 37.2544 10.0959 37.2992 9.96791C37.3248 9.88471 37.344 9.78231 37.3376 9.73431L37.328 9.64791L36.992 9.63831C36.8064 9.63511 36.6368 9.64471 36.6144 9.66071Z" fill="black"/>
<path d="M41.0144 9.91368C40.8608 9.97768 40.6848 10.0705 40.6272 10.1185C40.384 10.3137 40.2496 10.8225 40.3168 11.2865C40.3936 11.8113 40.6272 12.1153 41.4048 12.6977C42.2688 13.3441 42.5376 13.6833 42.5344 14.1249C42.5312 14.5857 42.2112 14.9697 41.7824 15.0273C41.5968 15.0529 41.3184 14.9793 40.9056 14.7937C40.6944 14.6977 40.5632 14.6561 40.544 14.6753C40.5248 14.6945 40.528 14.7873 40.5568 14.9281C40.5824 15.0529 40.6112 15.2193 40.624 15.3025C40.6368 15.4113 40.6624 15.4657 40.7104 15.4913C40.7488 15.5105 40.9888 15.5361 41.2448 15.5425C41.6352 15.5553 41.7632 15.5489 42.032 15.4913C43.0976 15.2705 43.4944 14.6113 43.1648 13.6193C43.0208 13.1841 42.7808 12.9121 42.096 12.3905C41.2768 11.7665 41.0304 11.4433 40.9984 10.9601L40.9824 10.7201L41.1104 10.5953C41.1968 10.5089 41.2896 10.4545 41.4176 10.4161C41.584 10.3681 41.616 10.3681 41.792 10.4129C42.0224 10.4737 42.1792 10.5505 42.3808 10.7009C42.5472 10.8321 42.592 10.8385 42.6656 10.7585C42.7552 10.6593 42.8928 10.2689 42.8576 10.2113C42.7552 10.0449 42.0512 9.82408 41.568 9.80488C41.3152 9.79528 41.2768 9.80168 41.0144 9.91368Z" fill="black"/>
<path d="M22.9568 18.9183C22.9664 18.9759 23.0432 19.1327 23.1264 19.2639C23.2064 19.3951 23.3056 19.5615 23.3408 19.6319L23.408 19.7599L23.4336 28.8959C23.4464 33.9199 23.4656 38.2175 23.4752 38.4479C23.5104 39.2639 23.3984 40.5151 23.2448 41.0559C23.168 41.3247 22.9952 41.6639 22.8512 41.8271C22.7584 41.9359 22.7296 41.9935 22.7424 42.0415L22.7584 42.1119H24.4992C26.3808 42.1119 26.3264 42.1183 26.2368 41.9455C26.2176 41.9039 26.1408 41.7983 26.0672 41.7119C25.9776 41.6063 25.8784 41.4175 25.7696 41.1519L25.6096 40.7519L25.5904 36.9279C25.5776 34.8255 25.5776 33.0751 25.5872 33.0367C25.6032 32.9759 25.6384 32.9695 26.3936 32.9343C27.6672 32.8735 28.448 32.7647 29.632 32.4831C29.9936 32.3967 30.448 32.2879 30.64 32.2431C30.8352 32.1983 31.0976 32.1087 31.2256 32.0447C31.4368 31.9423 31.4688 31.9327 31.5552 31.9679C31.7664 32.0575 32.0992 32.4895 32.5824 33.3119C33.2384 34.4223 33.6576 35.4431 33.9648 36.6559C34.208 37.6223 34.288 38.3007 34.2624 39.1487C34.2368 40.0031 34.0928 40.5855 33.7728 41.1295C33.6224 41.3919 33.2928 41.7631 33.104 41.8911C33.0272 41.9423 32.992 41.9903 32.9984 42.0319C33.008 42.0959 33.0368 42.0959 35.2768 42.1055C36.6112 42.1087 37.5616 42.0991 37.5776 42.0831C37.6224 42.0383 37.5648 41.9583 37.4144 41.8591C37.248 41.7503 37.152 41.6223 36.9952 41.3119C36.7616 40.8511 36.672 40.4703 36.576 39.5551C36.4128 38.0127 36.368 37.7823 36 36.6623C35.3408 34.6463 34.4288 32.8095 33.3856 31.3983L33.2064 31.1551L33.3376 31.0399C33.408 30.9759 33.7216 30.7455 34.0352 30.5247C34.6624 30.0863 35.1168 29.6767 35.5008 29.2031C35.9712 28.6239 36.384 27.9231 36.6208 27.3055C36.8608 26.6719 37.1296 25.5487 37.184 24.9631C37.328 23.2959 36.4896 21.3983 35.12 20.2975C34.4416 19.7535 33.5392 19.3215 32.5184 19.0527C31.6672 18.8287 32.0032 18.8415 27.2512 18.8255L22.9344 18.8127L22.9568 18.9183ZM28.688 20.2559C30.8832 20.2911 31.3408 20.3231 31.792 20.4767C32.8064 20.8255 33.4976 21.4111 33.92 22.2847C34.192 22.8415 34.304 23.4015 34.304 24.2015C34.304 24.9919 34.2048 25.6159 33.9648 26.3359C33.1584 28.7583 31.2992 30.2015 28.1184 30.8767C27.6384 30.9791 27.2512 31.0399 27.024 31.0559C26.832 31.0655 26.5344 31.0975 26.368 31.1231C26.2016 31.1455 25.9744 31.1679 25.8656 31.1679C25.696 31.1679 25.6608 31.1583 25.6192 31.0975C25.5744 31.0335 25.568 30.4703 25.568 25.7055C25.568 22.3295 25.5808 20.3583 25.6 20.3071L25.632 20.2239H26.1984C26.512 20.2271 27.632 20.2399 28.688 20.2559Z" fill="black"/>
<path d="M27.136 21.1295C27.136 21.1999 27.184 21.2863 27.3984 21.5871C27.5872 21.8591 27.5872 21.7855 27.584 26.3199C27.584 28.6495 27.5968 30.4671 27.6128 30.4927C27.648 30.5471 27.8656 30.5247 28.384 30.4095C28.784 30.3231 29.568 30.0767 29.68 30.0031C29.7184 29.9775 29.76 29.9167 29.7664 29.8655C29.776 29.8175 29.776 28.1759 29.7632 26.2239C29.7504 24.2687 29.7472 22.6303 29.7568 22.5791L29.7696 22.4863L31.4688 22.5087C33.2096 22.5343 33.504 22.5247 33.504 22.4415C33.504 22.2239 32.88 21.4399 32.5152 21.1999L32.3872 21.1135L30.2976 21.0847C29.1488 21.0719 27.968 21.0591 27.6736 21.0559H27.136V21.1295Z" fill="black"/>
<path d="M36.768 21.3601C36.768 21.3665 36.864 21.5553 36.9792 21.7761C37.2384 22.2657 37.52 23.0401 37.6032 23.4849C37.6576 23.7921 37.6768 23.8369 37.8272 24.0417C38.1344 24.4641 38.3776 25.0657 38.4832 25.6641C38.5472 26.0417 38.5312 27.0593 38.448 27.5041C38.0352 29.7697 36.9248 31.2929 34.9792 32.2689L34.624 32.4481L34.672 32.5601C34.6976 32.6241 34.7616 32.7361 34.8128 32.8097C34.864 32.8833 35.04 33.2353 35.2 33.5905C35.4656 34.1697 35.504 34.2401 35.5712 34.2401C35.616 34.2401 35.6768 34.2241 35.7088 34.2017C35.76 34.1697 35.792 34.1793 35.904 34.2561C36.1568 34.4321 36.4192 34.8001 36.9504 35.7313C37.5008 36.6945 37.8848 37.6545 38.1728 38.7841C38.5664 40.3393 38.6016 41.7633 38.2688 42.7777C38.1024 43.2929 37.7568 43.8177 37.3984 44.0961C37.2576 44.2049 37.2288 44.2465 37.2416 44.3073L37.2544 44.3841H39.5392C40.7968 44.3841 41.824 44.3745 41.824 44.3649C41.824 44.2977 41.6928 44.1473 41.5584 44.0577C41.4144 43.9617 41.3824 43.9169 41.2 43.5329C40.9184 42.9441 40.8736 42.7329 40.784 41.5841C40.7552 41.2321 40.7072 40.8065 40.672 40.6401C40.5312 39.9457 40.0512 38.4257 39.68 37.4977C39.44 36.9025 38.9248 35.8497 38.6496 35.3921C38.5376 35.2065 38.3392 34.8545 38.2112 34.6081C37.9168 34.0513 37.7376 33.7697 37.5648 33.5969L37.4336 33.4657L37.4944 33.3793C37.5648 33.2865 37.8624 33.0689 38.2944 32.8001C38.5024 32.6689 38.7104 32.4897 39.088 32.1121C39.8336 31.3729 40.3616 30.6401 40.688 29.8945C40.9696 29.2545 41.0912 28.8897 41.1712 28.4481C41.3312 27.5745 41.3472 27.4625 41.3664 27.0401C41.4496 25.1329 40.5216 23.3249 38.896 22.2369C38.5344 21.9937 37.8432 21.6513 37.4848 21.5361C37.3152 21.4817 37.136 21.4177 37.0848 21.3921C37.0016 21.3473 36.768 21.3249 36.768 21.3601Z" fill="black"/>
<path d="M29.4112 33.0591C29.3152 33.1071 29.1552 33.1327 28.8672 33.1551C28.6464 33.1743 28.3648 33.2095 28.24 33.2351C28.1184 33.2639 27.952 33.2927 27.872 33.2991C27.792 33.3087 27.6928 33.3215 27.6512 33.3311L27.5776 33.3471L27.5872 37.9135C27.5968 42.7039 27.5968 42.7007 27.456 43.2511C27.3824 43.5391 27.1744 43.9455 27.0048 44.1407C26.8288 44.3391 26.8384 44.3711 27.0752 44.3967C27.4016 44.4287 30.4256 44.4191 30.448 44.3839C30.4736 44.3391 30.4128 44.2303 30.2688 44.0767C30.1344 43.9263 29.9168 43.4975 29.8432 43.2319C29.8016 43.0815 29.792 42.4863 29.7664 39.2543C29.7472 37.1647 29.744 35.4143 29.7568 35.3663L29.7792 35.2799L30.3552 35.2639C30.6848 35.2511 31.3312 35.1967 31.8784 35.1359L32.8288 35.0239L32.8128 34.8959C32.7712 34.6207 32.624 34.2655 32.3424 33.7759C32.1824 33.4943 32.048 33.2575 32.0448 33.2511C32.0384 33.2479 31.6352 33.2863 31.1456 33.3407C30.1536 33.4527 29.8528 33.4623 29.7952 33.3951C29.7728 33.3695 29.76 33.2767 29.7664 33.1775L29.776 33.0079L29.664 33.0015C29.6032 32.9983 29.488 33.0239 29.4112 33.0591Z" fill="black"/>
<path d="M21.3216 48.2528C21.312 48.2944 21.3184 48.5536 21.3408 48.8288C21.3632 49.1296 21.376 50.1696 21.376 51.456C21.376 53.2064 21.3664 53.6224 21.328 53.808C21.3024 53.9296 21.2928 54.0384 21.3056 54.0544C21.3184 54.0672 21.4944 54.08 21.696 54.0864C22.048 54.096 22.064 54.0928 22.0576 54.032C22.0512 53.9968 22.0384 53.3088 22.0288 52.5024C22.0128 51.5232 22.016 51.04 22.0384 51.04C22.1248 51.04 22.3424 51.2512 22.544 51.536C22.6656 51.7088 23.1872 52.3488 23.7056 52.9568L24.6432 54.064L24.8576 54.0896C25.0816 54.1184 25.392 54.1056 25.4304 54.0704C25.488 54.0096 25.3088 53.7536 24.976 53.424C24.7808 53.2288 24.4224 52.8192 24.176 52.512C23.696 51.9072 23.488 51.6608 23.0816 51.2192C22.9344 51.0592 22.816 50.9056 22.816 50.8768C22.816 50.832 22.8544 50.816 23.0016 50.8C23.824 50.7072 24.096 50.5856 24.2976 50.2144C24.5568 49.7376 24.448 48.9792 24.0608 48.56C23.7536 48.2272 23.5296 48.1792 22.2944 48.1792L21.3408 48.176L21.3216 48.2528ZM23.3152 48.8768C23.664 48.9856 23.84 49.1968 23.8656 49.5392C23.9008 50.0128 23.5648 50.176 22.5344 50.176H21.9808L21.9904 49.5264C21.9968 49.1712 22.0128 48.8608 22.0288 48.8352C22.0704 48.7712 23.088 48.8032 23.3152 48.8768Z" fill="black"/>
<path d="M37.072 48.3167C36.6912 48.4159 36.5376 48.4831 36.24 48.6815C35.392 49.2575 34.8256 50.4191 34.8896 51.4495C34.9568 52.4991 35.6608 53.4975 36.6976 54.0159C37.0976 54.2175 37.376 54.2783 37.904 54.2783C38.5184 54.2815 38.9984 54.1855 39.4144 53.9775L39.5616 53.9039L39.5424 53.5583C39.536 53.3695 39.5168 53.2031 39.5072 53.1935C39.4816 53.1679 39.2256 53.2927 38.976 53.4527C38.7072 53.6255 38.4608 53.6799 37.936 53.6799C37.5904 53.6799 37.4432 53.6671 37.2992 53.6223C36.6304 53.4143 36.1632 52.9983 35.824 52.3039C35.2864 51.2095 35.3984 50.3935 36.1888 49.5967C36.5088 49.2767 36.8544 49.0399 37.1872 48.9151C37.792 48.6879 38.7552 48.8319 39.1712 49.2063C39.328 49.3503 39.4048 49.3375 39.4176 49.1679C39.4304 49.0207 39.3696 48.7263 39.3024 48.6079C39.1648 48.3583 38.7936 48.2527 38 48.2367C37.4496 48.2239 37.408 48.2271 37.072 48.3167Z" fill="black"/>
<path d="M31.2 48.3328C31.2 48.4416 31.3472 48.736 31.6032 49.1296C31.7152 49.2992 32.0064 49.8048 32.2528 50.2496L32.6976 51.056L32.7136 52.336C32.7264 53.392 32.72 53.6448 32.6816 53.776C32.5984 54.064 32.5952 54.1024 32.6592 54.1376C32.752 54.1856 33.3024 54.2048 33.3568 54.1632C33.392 54.1344 33.3952 54.048 33.3728 53.664C33.36 53.408 33.3472 52.7136 33.3472 52.1216L33.344 51.0432L33.6032 50.6336C33.744 50.4096 33.9904 49.9648 34.1504 49.648C34.4608 49.0304 34.6688 48.6848 34.8224 48.5216C34.9152 48.4256 34.9184 48.416 34.8704 48.3424C34.8256 48.272 34.8096 48.2688 34.5376 48.2784C34.384 48.288 34.24 48.2976 34.2208 48.304C34.2016 48.3104 33.936 48.7616 33.6288 49.3088C33.3216 49.856 33.0528 50.304 33.0304 50.304C32.9824 50.304 32.8768 50.1344 32.7648 49.872C32.72 49.7664 32.5088 49.376 32.2944 49.0016L31.9008 48.3264L31.7504 48.3072C31.1904 48.2432 31.2 48.2432 31.2 48.3328Z" fill="black"/>
<path d="M27.424 48.3968C27.1008 48.4704 26.928 48.5312 26.736 48.6368C25.9968 49.0368 25.4496 49.7472 25.2672 50.5536C25.2032 50.8384 25.2 51.44 25.2608 51.7344C25.568 53.1872 26.8032 54.2496 28.096 54.1664C28.6496 54.128 29.3504 53.9008 29.8048 53.6096C30.56 53.1296 30.992 52.3296 31.0304 51.344C31.0432 51.0432 31.0336 50.8576 30.9984 50.672C30.7648 49.4432 29.7504 48.5024 28.4672 48.3232C28.0928 48.272 27.8976 48.2848 27.424 48.3968ZM28.6432 48.976C28.7552 49.0048 28.9632 49.0848 29.104 49.1488C30.3264 49.7248 30.784 51.0592 30.1824 52.288C30.096 52.4672 29.9968 52.5952 29.792 52.8032C29.4144 53.184 29.0048 53.4016 28.4384 53.5232C27.4304 53.7344 26.4032 53.1136 25.9744 52.032C25.8048 51.6 25.7632 51.0624 25.8688 50.656C26.08 49.8208 26.8512 49.088 27.6704 48.944C27.968 48.8896 28.3648 48.9056 28.6432 48.976Z" fill="black"/>
<path d="M40.7265 50.2305C40.7329 51.3025 40.7521 52.4705 40.7681 52.8321C40.7841 53.2129 40.7841 53.5617 40.7649 53.6641C40.7489 53.7601 40.7265 53.9169 40.7169 54.0097L40.6945 54.1793L41.6833 54.1697C42.8801 54.1569 42.8385 54.1729 43.1137 53.7089C43.2449 53.4913 43.2641 53.3953 43.1777 53.4209C43.1457 53.4305 42.9345 53.4753 42.7041 53.5233C42.1793 53.6289 41.8177 53.6225 41.6097 53.5073C41.5361 53.4657 41.4625 53.3921 41.4433 53.3473C41.4273 53.3025 41.4049 52.8001 41.3985 52.2337C41.3825 51.2417 41.3857 51.1969 41.4465 51.1201L41.5073 51.0401H42.7617L42.7425 50.7521C42.7329 50.5953 42.7137 50.4481 42.7041 50.4289C42.6881 50.4065 42.4961 50.3969 42.1089 50.4033C41.3921 50.4161 41.4177 50.4321 41.3697 49.9393C41.3441 49.6897 41.3441 49.5265 41.3697 49.3345C41.4113 49.0369 41.4721 48.9569 41.7025 48.8929C41.9681 48.8225 42.5441 48.8641 42.7329 48.9665C42.7905 48.9985 42.9409 49.0049 42.9697 48.9761C42.9729 48.9729 42.9409 48.8161 42.8929 48.6273L42.8097 48.2881H40.7137L40.7265 50.2305Z" fill="black"/>
</svg>
