<svg width="64" height="64" viewBox="0 0 64 64" fill="none" xmlns="http://www.w3.org/2000/svg">
<path d="M29.4838 13.7774C28.2232 13.921 25.9394 14.495 24.7722 14.963C21.521 16.2736 18.5568 18.5014 16.4476 21.2284C14.8314 23.3188 13.2712 26.5202 12.6972 28.9478C12.223 30.926 12.1668 33.9152 12.5412 36.4174C13.2588 41.16 15.5864 45.4098 19.0624 48.324C21.9142 50.7204 25.9518 52.5674 29.047 52.9044C29.565 52.9606 30.2452 53.048 30.5634 53.0978C32.161 53.3536 34.8444 53.0604 37.615 52.3428C40.4918 51.5878 43.7868 49.6096 46.0894 47.2444C48.6356 44.6298 50.5824 41.1412 51.2564 37.9588C52.0738 34.121 51.7494 29.3782 50.4638 26.3518C50.1456 25.6154 49.403 23.9992 49.147 23.4938C48.4856 22.1958 46.6446 19.8806 45.328 18.7012C43.2436 16.8354 41.0596 15.5686 38.4636 14.726C37.1032 14.2828 36.0736 14.0582 34.4136 13.8336C33.44 13.6962 30.4572 13.665 29.4838 13.7774ZM32.6976 14.183C37.2968 14.495 40.9474 15.8054 43.9926 18.2392C46.4014 20.1676 48.779 23.3314 49.8586 26.0396C50.4764 27.5934 50.9756 29.241 50.8882 29.4656C50.8508 29.553 50.8446 29.553 50.7884 29.4592C50.7572 29.403 50.6448 29.0224 50.545 28.6168C50.4014 28.0178 50.233 27.5996 49.6588 26.3828C48.467 23.8742 48.055 23.169 47.2626 22.2954C47.0628 22.0708 46.6884 21.634 46.4326 21.3282C43.874 18.2392 40.5418 16.2922 35.8178 15.1252C34.3888 14.7696 33.8146 14.6822 32.6976 14.6384C28.136 14.4636 23.2248 16.292 19.493 19.5496C17.1654 21.5902 15.2496 24.704 14.2074 28.1612C13.4336 30.7136 13.1652 34.4328 13.571 36.8104C13.9892 39.238 15.0998 42.0772 16.5226 44.355C17.1466 45.3534 17.4962 45.809 18.4634 46.8698C19.5304 48.043 19.568 48.0992 18.8128 47.5002C17.571 46.5018 15.5552 43.6 14.5506 41.3596C13.6832 39.425 13.0154 37.1724 12.9094 35.8182C12.8782 35.4126 12.8408 35.0568 12.8282 35.0318C12.8096 35.007 12.7658 34.5826 12.7284 34.0834C12.5412 31.7182 13.1466 28.467 14.2636 25.8024C15.9236 21.8398 19.2372 18.289 23.1998 16.2234C24.9346 15.3186 25.9518 14.969 28.2358 14.501C29.927 14.1454 31.0252 14.0704 32.6976 14.1828V14.183ZM32.086 17.9646C32.1172 19.4686 32.1546 23.425 32.1796 26.7574L32.2296 32.8106L32.3794 32.7918C32.5916 32.773 33.1594 32.4734 34.1204 31.887L34.9442 31.3754V30.9886C34.9442 30.7702 34.8756 30.2648 34.7882 29.859C34.7008 29.4596 34.5198 28.4424 34.3826 27.6C34.2516 26.7576 34.058 25.6592 33.952 25.1538C33.846 24.6484 33.6026 23.132 33.4092 21.784C33.222 20.436 32.9724 18.851 32.8538 18.2706C32.7352 17.684 32.623 17.01 32.6042 16.773C32.5854 16.5296 32.5356 16.1864 32.498 15.9992C32.4606 15.787 32.4606 15.6436 32.498 15.606C32.5854 15.5186 34.1954 15.6622 35.1688 15.8432C36.6354 16.1116 38.1142 16.6356 39.8678 17.5218C43.8804 19.5312 46.4826 22.2706 48.3234 26.4144C48.9724 27.881 49.303 28.9916 49.5778 30.6204C49.9772 32.998 49.921 35.176 49.4218 37.1104C49.1846 38.0278 48.6168 39.6628 48.2236 40.5676C48.055 40.9732 47.868 41.4038 47.818 41.5286C47.7618 41.6596 47.6994 41.7658 47.6744 41.7658C47.5746 41.7658 47.0192 41.354 46.42 40.8298C46.0644 40.5178 45.2406 39.8376 44.5854 39.3134C43.9364 38.7892 42.6696 37.7534 41.7772 37.017C40.8848 36.2806 39.7802 35.3882 39.3184 35.0264C38.8566 34.6644 37.777 33.7908 36.922 33.0732C35.755 32.0996 35.3308 31.7814 35.206 31.7814C35.05 31.7814 34.5756 32.0248 34.2948 32.2494C34.17 32.343 34.17 32.343 34.2948 32.5114C34.3696 32.605 34.6068 32.7922 34.8252 32.9232C35.0436 33.0606 35.73 33.541 36.3478 33.9966C36.9656 34.446 37.7394 34.995 38.064 35.2134C38.9314 35.7938 39.6304 36.2992 41.0594 37.3976C42.7132 38.6644 45.7086 40.8672 46.551 41.4352C46.913 41.6786 47.306 41.9656 47.4246 42.0718L47.643 42.2652L47.4246 42.184C47.306 42.134 46.9378 41.9156 46.6134 41.6972C46.2888 41.4726 45.6774 41.1106 45.253 40.8922C44.8286 40.6676 44.0174 40.2246 43.4434 39.9062C42.8692 39.5816 41.3654 38.758 40.0922 38.0716C38.8254 37.3852 37.515 36.6676 37.1904 36.474C34.9188 35.1386 32.4728 33.7782 32.3542 33.7782H32.2106L32.2418 35.2572C32.2668 36.212 32.3042 36.7736 32.3478 36.8298C32.4662 36.9796 33.2464 37.3102 34.2262 37.616C34.7442 37.7782 36.3416 38.3836 37.7832 38.9576C39.2248 39.5316 41.1218 40.2682 41.9954 40.5988C45.1594 41.772 46.6694 42.3274 46.7444 42.3274C46.9004 42.3274 47.175 42.5458 47.175 42.6706C47.175 42.8328 47.1314 42.8952 46.1204 44.1682C44.7164 45.9406 43.5682 47.0014 41.7272 48.2182C39.4496 49.7284 37.9144 50.3462 35.2248 50.8516C33.7584 51.1262 33.5898 51.145 32.3668 51.1762C30.8254 51.2074 30.2762 51.1512 28.4166 50.783C26.5944 50.421 25.284 49.9468 23.7426 49.0856C22.3012 48.2868 20.2168 46.7704 19.3432 45.8904C18.8002 45.3476 17.5024 43.7188 17.1092 43.101C16.8658 42.7142 16.8534 42.6704 16.9468 42.5706C16.9968 42.5144 17.1154 42.4332 17.209 42.402C17.3026 42.3644 17.7706 42.196 18.2512 42.015C18.7318 41.834 19.7488 41.4658 20.5102 41.1974C22.6194 40.4548 24.5352 39.7122 26.1514 39.0132C26.9564 38.67 28.3106 38.1458 29.1656 37.8588C30.0142 37.5716 30.9628 37.216 31.2686 37.0724L31.824 36.8166V35.7432C31.824 35.1504 31.8052 34.4514 31.7866 34.1894C31.743 33.7402 31.7366 33.7152 31.6118 33.7526C31.537 33.7714 31.381 33.865 31.2624 33.9586C31.1438 34.0584 30.551 34.4016 29.952 34.7262C29.353 35.057 28.5106 35.525 28.0798 35.7746C27.649 36.0242 26.6258 36.592 25.802 37.0352C24.9782 37.4846 23.7302 38.1896 23.025 38.614C21.1092 39.756 20.56 40.0618 19.1248 40.7856C17.8892 41.4034 16.9844 41.9338 16.6848 42.2146C16.5912 42.2958 16.535 42.3144 16.5038 42.2646C16.4414 42.1648 16.5786 42.0274 16.9718 41.809C17.3338 41.5968 20.3042 39.4938 23.1498 37.422C25.8082 35.4874 26.476 34.982 27.518 34.1458C28.6288 33.2472 29.1404 32.8914 29.6084 32.6794C29.933 32.5296 29.9454 32.517 29.8768 32.3674C29.7956 32.1988 29.1466 31.7808 28.9594 31.7808C28.7222 31.7808 28.1856 32.1864 26.8002 33.4032C26.3884 33.7652 25.7456 34.3018 25.3712 34.5888C24.9968 34.8822 24.1418 35.581 23.4678 36.1426C21.4272 37.8524 20.903 38.283 20.1854 38.8446C19.811 39.138 19.1932 39.6372 18.8126 39.9554C18.4382 40.2736 17.8766 40.698 17.5708 40.9102C17.2588 41.1162 16.8906 41.397 16.7408 41.5342C16.4724 41.7776 16.4662 41.7838 16.3414 41.6654C15.9232 41.2846 14.956 38.645 14.5754 36.8478C14.2634 35.3812 14.201 34.7198 14.201 33.1224C14.201 31.3876 14.2822 30.8448 14.7502 29.2096C16.3476 23.637 19.4116 19.8178 24.2418 17.3654C25.2902 16.8288 26.3448 16.4606 27.961 16.0612C29.053 15.7928 30.8316 15.5496 31.3122 15.5994C31.5806 15.6306 31.5868 15.6368 31.5494 15.8302C31.5308 15.9362 31.15 18.4386 30.7008 21.3904C29.7398 27.7306 29.4154 29.7524 29.2904 30.2268C29.153 30.776 29.1718 31.2316 29.3466 31.3876C29.5838 31.6122 30.0082 31.8432 30.1578 31.8432C30.3074 31.8432 30.3076 31.8306 30.3514 31.0132C30.4138 29.8026 30.4948 29.0724 30.7008 27.818C30.8132 27.1378 30.9254 26.0894 30.9878 25.1658C31.0378 24.3296 31.1002 23.6182 31.1126 23.5932C31.1314 23.5682 31.1688 23.0878 31.2 22.5324C31.2312 21.9708 31.3872 20.4356 31.5432 19.1128C31.6992 17.79 31.824 16.5542 31.824 16.367C31.824 15.7554 31.8988 15.1752 31.9738 15.2C32.0236 15.2186 32.055 16.0612 32.0862 17.9644L32.086 17.9646ZM44.5856 20.0238C45.765 20.8476 47.8992 23.6932 49.01 25.9022C49.8586 27.5996 50.5514 29.6838 50.6388 30.8134C50.6574 31.1254 50.72 31.6684 50.7762 32.0302C50.8946 32.8166 50.9072 34.7322 50.801 35.3688C50.6638 36.1676 50.1022 38.7948 49.971 39.2378C49.2658 41.6342 47.7682 44.199 45.9334 46.1646C44.3108 47.9058 42.2328 49.4408 40.1174 50.4704C39.481 50.7824 37.2468 51.525 36.1798 51.7808C33.2532 52.486 29.8458 52.4484 27.2312 51.681C25.9582 51.3128 24.7974 50.851 23.5556 50.227C20.9846 48.929 19.3808 47.5498 17.5524 45.0724C17.0344 44.3672 16.5414 43.6496 16.454 43.4812C16.3604 43.3064 16.2294 43.0756 16.1546 42.9696C16.0298 42.7762 16.0298 42.7636 16.1358 42.72C16.2856 42.6638 16.6226 43.057 17.3902 44.1678C18.4822 45.753 18.994 46.3394 20.061 47.2568C22.0892 48.998 24.2546 50.2084 26.2764 50.7452C27.1438 50.976 29.0346 51.4068 29.5464 51.494C30.6448 51.6812 32.4606 51.7374 33.7898 51.625C34.938 51.5252 35.6182 51.3942 36.86 51.026C39.3936 50.2834 40.8352 49.5908 42.832 48.1678C44.4606 47.001 45.5278 45.9274 46.545 44.4236C47.2252 43.4252 47.8056 42.745 48.0552 42.67C48.1488 42.6388 48.1738 42.5702 48.1738 42.358C48.1738 41.9774 48.3672 41.3908 48.7416 40.6732C49.4094 39.3752 49.5778 38.7886 50.0272 36.2114C50.3142 34.5516 50.3268 34.4578 50.3206 33.3096C50.3206 32.3112 50.2956 31.968 50.1458 31.138C49.7776 29.0038 49.11 26.8072 48.361 25.2408C47.4998 23.456 46.9506 22.6884 45.403 21.1096C43.8554 19.537 43.8116 19.4746 44.5854 20.0238H44.5856ZM14.819 39.6312C15.0686 40.3614 15.5616 41.4408 15.8548 41.9028C15.9984 42.1212 16.0296 42.221 15.986 42.3022C15.9298 42.3958 15.9174 42.3958 15.805 42.2836C15.7364 42.215 15.6302 42.0214 15.5678 41.853C15.5054 41.6846 15.3056 41.2102 15.1248 40.7984C14.713 39.8498 14.3822 38.8514 14.2262 38.0776C14.014 37.0416 14.0952 36.998 14.351 38.009C14.482 38.5332 14.6942 39.2634 14.819 39.6316V39.6312Z" fill="black"/>
<path d="M31.6118 21.9957C31.4746 23.7929 31.1126 30.6073 31.1126 31.4313L31.1064 32.4173L31.3248 32.5983C31.4434 32.6981 31.5994 32.7793 31.6742 32.7793H31.8052L31.8426 28.7355C31.8862 24.2737 31.8364 21.5403 31.7178 21.5029C31.6742 21.4841 31.6366 21.6465 31.6116 21.9959L31.6118 21.9957Z" fill="black"/>
<path d="M32.9284 33.0039C32.735 33.1225 32.5728 33.2535 32.5728 33.2847C32.5728 33.3907 33.1718 33.7715 34.0392 34.2207C34.813 34.6201 39.2812 37.2723 40.498 38.0523C40.7538 38.2209 41.2904 38.5203 41.6836 38.7263C42.0768 38.9323 42.576 39.2255 42.7944 39.3753C43.1938 39.6499 43.3686 39.7061 43.3686 39.5625C43.3686 39.3629 42.701 38.8573 41.5278 38.1771C41.1846 37.9711 39.2126 36.6795 37.147 35.2941C35.0814 33.9087 33.3716 32.7793 33.3404 32.7793C33.3092 32.7793 33.1282 32.8791 32.9286 33.0039H32.9284Z" fill="black"/>
<path d="M30.6694 33.0038C30.5696 33.0538 30.3448 33.2346 30.1702 33.397C30.0016 33.5592 29.3714 34.0522 28.7848 34.489C28.0422 35.0382 27.7052 35.3252 27.7052 35.4062C27.7052 35.6434 28.0484 35.5186 28.61 35.088C28.7786 34.957 29.4962 34.5202 30.2014 34.1208C30.9066 33.7152 31.487 33.3782 31.4994 33.372C31.5556 33.3284 31.4058 33.1412 31.231 33.0288C30.9876 32.879 30.9128 32.8728 30.6694 33.0038Z" fill="black"/>
</svg>
