<svg width="64" height="64" viewBox="0 0 64 64" fill="none" xmlns="http://www.w3.org/2000/svg">
<path d="M6.48022 29.0281V36.5487H8.76722V31.5753L11.536 36.5487H15.027V29.0281H13.101V34.3655L10.3322 29.0281H6.48042H6.48022ZM16.7118 36.5489H19.3604V29.0283H16.7118V36.5489ZM43.9174 29.0281H40.9078L37.5378 36.5487H39.945L40.5466 35.2147H44.3988L45.1212 36.5487H47.529L43.9172 29.0281H43.9174ZM41.3896 33.2741L42.4726 31.0903L43.5564 33.2741H41.3896ZM48.1308 29.0281V36.5487H50.4182V31.4541L53.3072 36.5487H56.9186V29.0281H54.6306V34.2443L52.103 29.0281H48.131H48.1308ZM20.9254 34.7301V36.5493H27.4258C28.8704 35.9429 28.75 34.3659 28.75 34.3659V34.0021C28.75 32.5461 27.3054 32.0611 27.3054 32.0611H23.2128V30.9695H28.148V29.0285H22.731C20.6844 29.5137 20.805 31.4547 20.805 31.4547V31.8185C21.0456 33.6383 22.4904 33.7595 22.4904 33.7595H26.5832V34.7303H20.9254V34.7301ZM29.5926 34.7301V36.5493H36.093C37.538 35.9429 37.4172 34.3659 37.4172 34.3659V34.0021C37.4172 32.5461 35.9722 32.0611 35.9722 32.0611H31.8796V30.9695H36.8156V29.0285H31.3982C29.3518 29.5137 29.4722 31.4547 29.4722 31.4547V31.8185C29.7132 33.6383 31.1576 33.7595 31.1576 33.7595H35.2502V34.7303H29.5928L29.5926 34.7301Z" fill="black"/>
<path d="M58.2426 39.5033C58.771 39.5035 59.2756 39.2847 59.6367 38.8991C59.992 38.5237 60.2118 37.9983 60.2118 37.3983V28.6639C60.2118 28.0501 59.983 27.4879 59.6143 27.0795C59.2584 26.6843 58.772 26.4373 58.2422 26.4373H5.75715C5.22735 26.4373 4.74115 26.6843 4.38495 27.0795C4.01675 27.4875 3.78795 28.0499 3.78795 28.6639V37.3983C3.78795 37.9983 4.00815 38.5235 4.36295 38.8991C4.72415 39.2849 5.22895 39.5037 5.75755 39.5033H58.2426ZM60.2729 39.5103C59.7467 40.0711 59.0116 40.3889 58.2426 40.3879H49.5542C48.1242 43.7421 45.6568 46.5161 42.5634 48.4597C39.4254 50.4305 35.6394 51.5479 31.6388 51.5479C27.6318 51.5479 23.9244 50.4313 20.842 48.4949C17.7176 46.5327 15.2334 43.7273 13.7264 40.3881H5.75735C4.98815 40.3893 4.25275 40.0717 3.72675 39.5105C3.22415 38.9779 2.91235 38.2395 2.91235 37.3985V28.6639C2.91235 27.8193 3.22775 27.0447 3.73515 26.4819C4.25075 25.9101 4.96635 25.5529 5.75755 25.5529H12.926C14.4958 21.6593 17.082 18.3797 20.3414 16.0763C23.592 13.7793 27.5112 12.4519 31.7594 12.4519C35.984 12.4519 39.9356 13.7723 43.218 16.0919C46.4532 18.3785 49.038 21.6347 50.5952 25.5529H58.2427C59.034 25.5529 59.7492 25.9101 60.2648 26.4819C60.7724 27.0443 61.0877 27.8189 61.0877 28.6639V37.3983C61.0874 38.2393 60.7764 38.9781 60.2729 39.5103ZM13.8726 25.5529H49.6484C48.1434 21.9431 45.7238 18.9413 42.7188 16.8175C39.5794 14.5989 35.8008 13.3363 31.7596 13.3363C27.697 13.3363 23.949 14.6053 20.841 16.8017C17.8118 18.9423 15.3892 21.9651 13.8728 25.5529H13.8726ZM42.0986 47.7061C44.8996 45.9473 47.1586 43.4795 48.5406 40.5091H14.7532C16.2034 43.4707 18.4796 45.9657 21.307 47.7417C24.257 49.5945 27.8044 50.6631 31.6386 50.6631C35.4696 50.6631 39.094 49.5929 42.0984 47.7061H42.0986Z" fill="black"/>
</svg>
