<svg width="56" height="56" viewBox="0 0 56 56" fill="none" xmlns="http://www.w3.org/2000/svg">
<path fill-rule="evenodd" clip-rule="evenodd" d="M49.9818 36.0101C49.9818 35.7632 50.1794 35.5659 50.426 35.5659C50.6974 35.5659 50.8946 35.7635 50.8946 36.0101C50.8946 36.282 50.6971 36.4793 50.426 36.4793C50.1794 36.4793 49.9818 36.282 49.9818 36.0101ZM50.426 36.3808C50.6236 36.3808 50.7959 36.2077 50.7959 36.0104C50.7959 35.8131 50.6233 35.665 50.426 35.665C50.2529 35.665 50.0806 35.8131 50.0806 36.0104C50.0806 36.2077 50.2532 36.3808 50.426 36.3808ZM50.3766 36.2326H50.2779V35.8129H50.4504C50.4754 35.8129 50.5248 35.8129 50.5492 35.8378C50.5986 35.8622 50.5986 35.8872 50.5986 35.9366C50.5986 35.986 50.5742 36.0354 50.5248 36.0354L50.6236 36.2329H50.4998L50.4504 36.0598H50.3766V36.2326V35.9857H50.4754C50.4998 35.9857 50.4998 35.9607 50.4998 35.9363C50.4998 35.9113 50.4998 35.9113 50.4754 35.8869H50.3766V36.2326Z" fill="#FBB812"/>
<path fill-rule="evenodd" clip-rule="evenodd" d="M49.9818 31.3451C49.9818 31.0737 50.1794 30.8765 50.426 30.8765C50.6974 30.8765 50.8946 31.074 50.8946 31.3451C50.8946 31.592 50.6971 31.8143 50.426 31.8143C50.1794 31.8143 49.9818 31.5917 49.9818 31.3451ZM50.426 31.6905C50.6236 31.6905 50.7959 31.5423 50.7959 31.3451C50.7959 31.1478 50.6233 30.9996 50.426 30.9996C50.2529 30.9996 50.0806 31.1478 50.0806 31.3451C50.0806 31.5423 50.2532 31.6905 50.426 31.6905ZM50.3766 31.5423H50.2779V31.1475H50.5492C50.5986 31.1725 50.5986 31.2219 50.5986 31.2713C50.5986 31.2957 50.5742 31.3451 50.5248 31.3701L50.6236 31.5426H50.4998L50.4504 31.3945H50.3766V31.5423V31.3204H50.426C50.4504 31.3204 50.4754 31.3204 50.4754 31.2954C50.4998 31.2954 50.4998 31.271 50.4998 31.246C50.4998 31.246 50.4998 31.2216 50.4754 31.2216C50.4754 31.1966 50.4504 31.2216 50.426 31.2216H50.3766V31.5423Z" fill="white"/>
<g clip-path="url(#clip0_254_1732)">
<path d="M12.1914 29.4056C11.445 32.4004 8.41283 34.2222 5.41855 33.4756C2.42583 32.7291 0.603871 29.6963 1.35061 26.7022C2.09665 23.7074 5.12865 21.8851 8.12189 22.6316C11.1158 23.3781 12.9376 26.4114 12.1912 29.4056H12.1914Z" fill="#FBB812"/>
<path d="M9.2347 27.2571C9.34595 26.5134 8.77978 26.1135 8.00563 25.8468L8.25675 24.8394L7.64361 24.6865L7.39912 25.6675C7.23581 25.6273 7.07211 25.5888 6.90805 25.5518L7.15428 24.5645L6.54132 24.4116L6.29019 25.4187C6.15677 25.3883 6.02579 25.3583 5.89866 25.3267L5.89936 25.3235L5.05378 25.1124L4.89067 25.7674C4.89067 25.7674 5.34559 25.8716 5.33599 25.8781C5.58432 25.9401 5.6292 26.1045 5.62169 26.2348L5.33564 27.3825C5.35275 27.3868 5.37493 27.3933 5.39938 27.4029L5.33459 27.3868L4.93363 28.9946C4.90324 29.0701 4.82623 29.1833 4.65247 29.1403C4.65876 29.1492 4.20698 29.029 4.20698 29.029L3.90259 29.7312L4.70049 29.9303C4.84893 29.9673 4.9944 30.0063 5.1376 30.043L4.88386 31.062L5.4963 31.2148L5.74743 30.2065C5.91473 30.252 6.07714 30.2938 6.23605 30.3334L5.98563 31.3369L6.5986 31.4897L6.85252 30.4726C7.89805 30.6705 8.68426 30.5907 9.01519 29.6451C9.28186 28.8835 9.00192 28.4443 8.45182 28.1576C8.85243 28.0651 9.1542 27.8015 9.2347 27.2571ZM7.83361 29.2217C7.64413 29.9832 6.36214 29.5717 5.94651 29.4683L6.28321 28.1183C6.69884 28.2223 8.03165 28.4277 7.83361 29.2217ZM8.02326 27.2462C7.85038 27.9388 6.78336 27.5868 6.43723 27.5006L6.7425 26.2762C7.08862 26.3624 8.20331 26.5235 8.02326 27.2461V27.2462Z" fill="white"/>
<path d="M17.5594 25.8461C18.0126 25.8461 18.4041 25.9273 18.733 26.0868C19.0637 26.2478 19.3365 26.4648 19.5553 26.7376C19.7712 27.0118 19.9318 27.3323 20.0356 27.6996C20.1386 28.0682 20.1903 28.464 20.1903 28.8877C20.1903 29.5392 20.071 30.154 19.8302 30.7339C19.5892 31.3147 19.2626 31.8186 18.847 32.2482C18.4317 32.6774 17.9413 33.0155 17.3759 33.2655C16.8113 33.5156 16.1974 33.6407 15.5384 33.6407C15.4532 33.6407 15.3033 33.6382 15.0917 33.6338C14.88 33.6295 14.6367 33.6076 14.3643 33.571C14.0715 33.5291 13.781 33.4721 13.4941 33.4001C13.1938 33.3276 12.9021 33.2234 12.6239 33.0892L15.0709 22.8054L17.2625 22.4658L16.3864 26.1151C16.5686 26.0327 16.7577 25.9666 16.9515 25.9174C17.1504 25.869 17.3545 25.8451 17.5592 25.8461H17.5594ZM15.721 31.9017C16.0511 31.9017 16.362 31.8205 16.6543 31.6612C16.9481 31.5005 17.206 31.2814 17.412 31.0174C17.6273 30.7421 17.7968 30.4338 17.9138 30.1044C18.0364 29.764 18.0987 29.4047 18.0978 29.0428C18.0978 28.5901 18.0222 28.2376 17.8715 27.9821C17.7208 27.7279 17.4419 27.6001 17.0367 27.6001C16.904 27.6001 16.7332 27.6254 16.5212 27.6706C16.3085 27.7187 16.1182 27.8184 15.9475 27.9684L15.0145 31.8439C15.0707 31.8538 15.1205 31.8633 15.1629 31.8722C15.2045 31.8818 15.2502 31.8886 15.2962 31.8933C15.3445 31.8987 15.3999 31.9015 15.4668 31.9015L15.7209 31.9017H15.721ZM22.4632 33.444H20.3698L22.1376 26.0038H24.2453L22.4632 33.444ZM23.4818 25.0973C23.1962 25.0997 22.9178 25.0078 22.6897 24.836C22.4527 24.6627 22.3352 24.396 22.3352 24.0366C22.3352 23.8389 22.3753 23.6534 22.4551 23.4783C22.5323 23.3088 22.6404 23.1552 22.774 23.0254C22.9079 22.8976 23.0634 22.7945 23.2333 22.721C23.4101 22.6454 23.6006 22.607 23.7928 22.6082C24.0848 22.6082 24.3482 22.6952 24.5843 22.8695C24.8193 23.0447 24.9376 23.3114 24.9376 23.6689C24.9387 23.8619 24.8976 24.0528 24.8171 24.2282C24.7407 24.3979 24.6328 24.5516 24.4992 24.6811C24.3656 24.8091 24.21 24.9119 24.0399 24.9847C23.865 25.0612 23.6795 25.0973 23.4818 25.0973ZM26.0798 24.1501L28.2724 23.8104L27.734 26.0035H30.0821L29.6581 27.7288H27.3241L26.7024 30.3313C26.6451 30.5481 26.6127 30.7507 26.6036 30.9391C26.5931 31.1283 26.6172 31.2907 26.6738 31.4275C26.73 31.5646 26.8309 31.6703 26.9776 31.7449C27.1238 31.8208 27.3328 31.8591 27.607 31.8591C27.8328 31.8591 28.053 31.8376 28.2654 31.795C28.4836 31.7517 28.6984 31.6928 28.908 31.6186L29.0645 33.2316C28.7641 33.3404 28.4571 33.4299 28.1452 33.4997C27.8147 33.5759 27.4233 33.6124 26.971 33.6124C26.3207 33.6124 25.8165 33.5158 25.4573 33.3236C25.0986 33.1301 24.845 32.8653 24.6932 32.5303C24.5436 32.1967 24.4767 31.8119 24.4954 31.3782C24.5146 30.9437 24.5803 30.4867 24.6932 30.0059L26.0798 24.1501ZM29.9901 30.4731C29.9901 29.8321 30.0938 29.2279 30.3009 28.662C30.5079 28.0958 30.806 27.6006 31.1926 27.1758C31.578 26.7531 32.0476 26.4179 32.6005 26.172C33.1503 25.9275 33.7664 25.8042 34.445 25.8042C34.8701 25.8042 35.2496 25.8443 35.5836 25.9249C35.9189 26.0061 36.2221 26.1111 36.4964 26.2428L35.7747 27.8846C35.5823 27.8073 35.3864 27.7388 35.1877 27.6795C34.9852 27.6172 34.738 27.5871 34.4455 27.5871C33.7466 27.5871 33.1945 27.8282 32.7834 28.3082C32.3737 28.7887 32.1674 29.4354 32.1674 30.2469C32.1674 30.7278 32.2713 31.1164 32.4795 31.4139C32.6866 31.7113 33.0692 31.8594 33.6248 31.8594C33.8988 31.8594 34.1635 31.8308 34.4169 31.7749C34.6722 31.7183 34.8977 31.647 35.0962 31.5629L35.2527 33.2459C34.9663 33.3558 34.6735 33.4482 34.3759 33.5226C34.0545 33.6012 33.6726 33.6417 33.2296 33.6417C32.6449 33.6417 32.1496 33.5563 31.7448 33.3876C31.3397 33.2166 31.0049 32.9893 30.741 32.7015C30.4759 32.4129 30.2857 32.0758 30.168 31.6893C30.0503 31.3028 29.9899 30.8963 29.9899 30.4731H29.9901ZM39.2894 33.6412C38.7897 33.6412 38.3556 33.565 37.9875 33.4143C37.6204 33.2637 37.3165 33.052 37.0759 32.7778C36.8349 32.505 36.6548 32.1817 36.5314 31.8091C36.4079 31.4367 36.3485 31.0244 36.3485 30.5725C36.3485 30.0059 36.4393 29.4393 36.6234 28.8739C36.8066 28.308 37.0782 27.799 37.4372 27.3468C37.794 26.8939 38.2341 26.5236 38.7517 26.2349C39.2691 25.9481 39.8641 25.8038 40.5328 25.8038C41.0233 25.8038 41.4548 25.8802 41.8282 26.0309C42.1997 26.1813 42.5056 26.3945 42.7475 26.6674C42.9867 26.9416 43.1687 27.2635 43.2906 27.6368C43.4139 28.0083 43.4747 28.4217 43.4747 28.8739C43.4747 29.4388 43.3849 30.0057 43.2069 30.5723C43.0286 31.1365 42.7641 31.6465 42.4148 32.0996C42.0662 32.552 41.6305 32.9219 41.1068 33.2094C40.5841 33.4971 39.9776 33.6412 39.2894 33.6412ZM40.3354 27.5873C40.0251 27.5873 39.7508 27.6773 39.5159 27.8553C39.2801 28.0353 39.0823 28.2619 38.9226 28.5347C38.7613 28.8089 38.6418 29.1079 38.561 29.433C38.4806 29.7587 38.4413 30.067 38.4413 30.3592C38.4413 30.8314 38.5177 31.1994 38.6672 31.4638C38.8187 31.7269 39.0915 31.8594 39.4876 31.8594C39.799 31.8594 40.0721 31.7698 40.3082 31.5901C40.5426 31.4114 40.7409 31.1849 40.9016 30.9112C41.0619 30.6387 41.1826 30.3386 41.2634 30.0129C41.3426 29.6882 41.3829 29.3785 41.3829 29.0865C41.3829 28.6156 41.3071 28.247 41.1559 27.9828C41.0053 27.7195 40.7313 27.5871 40.3354 27.5871V27.5873ZM45.7559 33.444H43.661L45.4288 26.0038H47.5374L45.7559 33.444ZM46.773 25.0973C46.4877 25.0997 46.2095 25.0079 45.9817 24.836C45.7456 24.6627 45.6272 24.396 45.6272 24.0366C45.6272 23.8389 45.6681 23.6534 45.7477 23.4783C45.8243 23.3086 45.9324 23.1549 46.0662 23.0254C46.2003 22.8976 46.356 22.7945 46.5261 22.721C46.7022 22.6454 46.892 22.607 47.0837 22.6082C47.3765 22.6082 47.6407 22.6952 47.8763 22.8695C48.1119 23.0447 48.2307 23.3114 48.2307 23.6689C48.2307 23.8673 48.1884 24.0535 48.1093 24.2282C48.0302 24.4028 47.9238 24.5532 47.7922 24.6811C47.6583 24.8088 47.5028 24.9116 47.3329 24.9847C47.1574 25.0612 46.9719 25.0973 46.773 25.0973ZM49.046 26.3421C49.2049 26.2957 49.3824 26.2398 49.5752 26.179C49.7897 26.1125 50.0072 26.0563 50.2271 26.0106C50.4662 25.9582 50.736 25.9154 51.0327 25.8824C51.3292 25.8487 51.6675 25.8323 52.0429 25.8323C53.147 25.8323 53.908 26.1539 54.3282 26.795C54.748 27.4362 54.8207 28.3136 54.5482 29.426L53.5853 33.4433H51.4782L52.4116 29.5104C52.4683 29.265 52.5129 29.0274 52.5461 28.7955C52.5796 28.5656 52.5775 28.3628 52.5387 28.1876C52.5045 28.0197 52.4121 27.8692 52.2778 27.7627C52.1397 27.6546 51.931 27.6002 51.6481 27.6002C51.3679 27.6014 51.0885 27.6301 50.814 27.6862L49.4419 33.4428H47.3341L49.046 26.3421Z" fill="#FBB812"/>
</g>
<defs>
<clipPath id="clip0_254_1732">
<rect width="53.5278" height="11.1785" fill="white" transform="translate(1.18237 22.4644)"/>
</clipPath>
</defs>
</svg>
