<svg width="56" height="20" viewBox="0 0 56 20" fill="none" xmlns="http://www.w3.org/2000/svg">
<path fill-rule="evenodd" clip-rule="evenodd" d="M15.8862 6.52282C13.6649 6.52282 12.4933 6.43575 11.2772 5.97635C13.4199 4.40897 16.7148 1.90629 19.6043 1.90629C21.79 1.90479 24.4687 1.90479 26.5876 1.90479C29.9003 1.90479 32.7186 3.11184 35.4507 4.65369C35.0053 5.10558 34.7603 5.67008 34.738 6.30964C34.7351 6.3817 34.738 6.45226 34.7469 6.52282H15.8862Z" fill="#6D6D6D"/>
<path d="M6.17702 17.3792C3.3647 17.3792 0.412804 15.456 0.286591 15.3734L0 15.1843V10.8605L0.0905834 10.7074C0.2361 10.4657 0.610294 9.70148 0.610294 9.09495L0.775102 4.60152L6.85264 4.20217L7.07239 4.09558C10.0555 2.66483 15.6118 0 18.7761 0H27.7743C29.4255 0.144126 30.8272 0.400851 31.9973 0.76567C34.376 1.50582 39.7349 4.75616 40.6287 5.30414C41.4736 5.40323 45.9564 5.95571 49.6285 6.90454C53.9732 8.02752 55.4477 9.78856 55.6199 10.5632L56 16.8567L55.4699 16.9798C54.4468 17.2201 53.6079 17.3762 51.3658 17.3762H49.1489V16.1001H51.3658C53.0838 16.1001 53.8945 16.0085 54.6562 15.8524L54.3726 10.7374C54.291 10.5482 53.0793 9.11447 49.3152 8.14162C45.3521 7.11773 40.4001 6.56224 40.3511 6.55773L40.0897 6.46766C40.0303 6.43012 34.0196 2.73089 31.6261 1.98474C30.5406 1.64844 29.2265 1.40823 27.7194 1.27461L18.7761 1.27762C15.8955 1.27762 10.5084 3.86138 7.61288 5.25009L7.05458 5.46778L1.99567 5.80107L1.87391 9.11747C1.87391 9.97022 1.45814 10.8455 1.26214 11.2073V14.4787C2.04912 14.9426 4.33728 16.1286 6.32699 16.1001H8.10141V17.3762H6.34482C6.2884 17.3777 6.23196 17.3792 6.17702 17.3792ZM42.2517 17.3762H15V16.1001H42.2517V17.3762Z" fill="#6D6D6D"/>
<path fill-rule="evenodd" clip-rule="evenodd" d="M1.28505 8.48396C1.2613 9.11001 1.2405 9.77509 1.23901 10.1684H2.03342C3.06096 10.1684 4.4211 9.38325 4.46268 8.48396V7.65674H1.25682V8.48396H1.28505Z" fill="#6D6D6D"/>
<path fill-rule="evenodd" clip-rule="evenodd" d="M50.7983 10.0088L52.0026 12.1947C52.399 11.9665 52.9811 11.8194 53.4295 11.8194H53.4592C54.0873 11.8269 54.7124 11.8194 55.3406 11.8194L55.3168 11.7158C55.2663 11.5041 54.6664 10.4682 54.0487 10.0088H50.7983Z" fill="#6D6D6D"/>
<path d="M29.6385 8.23193H26.7267V9.08318H29.6385V8.23193Z" fill="#6D6D6D"/>
<path d="M16.6938 8.23193H13.7805V9.08318H16.6938V8.23193Z" fill="#6D6D6D"/>
<path fill-rule="evenodd" clip-rule="evenodd" d="M19.1663 13.5371V14.6271H38.9595L19.1663 13.5371Z" fill="#6D6D6D"/>
<path d="M55.3562 13.9971H53.9337V14.8498H55.3562V13.9971Z" fill="#6D6D6D"/>
<path fill-rule="evenodd" clip-rule="evenodd" d="M53.6924 13.7158H53.0673C52.8193 13.7158 52.6189 13.92 52.6189 14.1707V14.6646C52.6189 14.9154 52.8193 15.118 53.0673 15.118H53.6924C53.9404 15.118 54.1423 14.9154 54.1423 14.6646V14.1707C54.1423 13.92 53.9404 13.7158 53.6924 13.7158Z" fill="#6D6D6D"/>
<path fill-rule="evenodd" clip-rule="evenodd" d="M35.9169 5.05027L35.905 5.06078C35.553 5.40758 35.366 5.83096 35.3496 6.32188C35.3422 6.49754 35.4001 6.65067 35.5204 6.77678C35.6422 6.90289 35.7907 6.96745 35.9659 6.96745H37.3602C37.5903 6.96745 37.7863 6.85035 37.8977 6.64917C38.0105 6.44649 38.0046 6.21679 37.8873 6.02012C37.6319 5.59675 37.2147 5.14035 36.5494 4.90615C36.3237 4.82658 36.0876 4.88062 35.9169 5.05027Z" fill="#6D6D6D"/>
<path d="M37.0566 7.60957C36.9274 7.60957 36.7997 7.54801 36.7166 7.43391L35.9355 6.35147C35.7989 6.1623 35.839 5.89657 36.0276 5.75695C36.2162 5.62033 36.479 5.65936 36.6156 5.85003L37.3967 6.93247C37.5348 7.12314 37.4932 7.38887 37.3046 7.52699C37.2303 7.58254 37.1427 7.60957 37.0566 7.60957Z" fill="#6D6D6D"/>
<path fill-rule="evenodd" clip-rule="evenodd" d="M0.986084 15.0581V16.8552H5.61736V16.7156C3.68704 16.5339 1.76118 15.5115 0.986084 15.0581Z" fill="#6D6D6D"/>
<path fill-rule="evenodd" clip-rule="evenodd" d="M11.5419 9.68945C13.0178 9.68945 14.3602 10.3005 15.3342 11.2838L15.3372 11.2868C16.3098 12.2717 16.9141 13.6304 16.9141 15.1212V17.3822H14.9095C15.2466 16.7997 15.4382 16.1226 15.4382 15.3989C15.4382 13.2235 13.6935 11.4595 11.5419 11.4595C9.38885 11.4595 7.64414 13.2235 7.64414 15.3989C7.64414 16.1226 7.83717 16.7997 8.17275 17.3822H6.16968V15.1212C6.16968 13.6289 6.77401 12.2717 7.74659 11.2868L7.74956 11.2838C8.72363 10.3005 10.0674 9.68945 11.5419 9.68945Z" fill="#6D6D6D"/>
<path fill-rule="evenodd" clip-rule="evenodd" d="M8.33595 12.1479C9.15856 11.3162 10.296 10.8013 11.5521 10.8013C12.8069 10.8013 13.9442 11.3162 14.7669 12.1479L14.7698 12.1509C15.591 12.9827 16.1018 14.1327 16.1018 15.4013C16.1018 16.6714 15.5925 17.8214 14.7698 18.6531H14.7669C13.9442 19.4849 12.8069 19.9998 11.5521 19.9998C10.296 19.9998 9.15856 19.4849 8.33595 18.6531C7.51334 17.8214 7.00403 16.6714 7.00403 15.4013C7.00403 14.1327 7.51334 12.9827 8.33595 12.1509V12.1479ZM11.5521 12.1855C9.79556 12.1855 8.37159 13.6252 8.37159 15.4013C8.37159 17.1773 9.79556 18.6171 11.5521 18.6171C13.3087 18.6171 14.7327 17.1773 14.7327 15.4013C14.7327 13.6252 13.3087 12.1855 11.5521 12.1855Z" fill="#6D6D6D"/>
<path fill-rule="evenodd" clip-rule="evenodd" d="M11.5446 16.5703C12.1801 16.5703 12.6968 16.0463 12.6968 15.4053C12.6968 14.7642 12.1801 14.2402 11.5446 14.2402C10.9106 14.2402 10.3923 14.7642 10.3923 15.4053C10.3923 16.0463 10.9106 16.5703 11.5446 16.5703Z" fill="#6D6D6D"/>
<path fill-rule="evenodd" clip-rule="evenodd" d="M45.7024 9.68945C47.1769 9.68945 48.5207 10.3005 49.4948 11.2838L49.4977 11.2868C50.4703 12.2717 51.0746 13.6304 51.0746 15.1212V17.3822H49.0701C49.4056 16.7997 49.5987 16.1226 49.5987 15.3989C49.5987 13.2235 47.854 11.4595 45.7024 11.4595C43.5494 11.4595 41.8047 13.2235 41.8047 15.3989C41.8047 16.1226 41.9977 16.7997 42.3333 17.3822H40.3302V15.1212C40.3302 13.6289 40.9346 12.2717 41.9071 11.2868L41.9101 11.2838C42.8842 10.3005 44.2265 9.68945 45.7024 9.68945Z" fill="#6D6D6D"/>
<path fill-rule="evenodd" clip-rule="evenodd" d="M42.4965 12.1479C43.3191 11.3162 44.4565 10.8013 45.7127 10.8013C46.9674 10.8013 48.1048 11.3162 48.9274 12.1479L48.9289 12.1509C49.7515 12.9827 50.2623 14.1327 50.2623 15.4013C50.2623 16.6714 49.753 17.8214 48.9289 18.6531H48.9274C48.1048 19.4849 46.9674 19.9998 45.7127 19.9998C44.4565 19.9998 43.3191 19.4849 42.4965 18.6531C41.6739 17.8214 41.1646 16.6714 41.1646 15.4013C41.1646 14.1327 41.6739 12.9827 42.4965 12.1509V12.1479ZM45.7127 12.1855C43.9561 12.1855 42.5321 13.6252 42.5321 15.4013C42.5321 17.1773 43.9561 18.6171 45.7127 18.6171C47.4693 18.6171 48.8933 17.1773 48.8933 15.4013C48.8933 13.6252 47.4693 12.1855 45.7127 12.1855Z" fill="#6D6D6D"/>
<path fill-rule="evenodd" clip-rule="evenodd" d="M45.7051 16.5703C46.3406 16.5703 46.8574 16.0463 46.8574 15.4053C46.8574 14.7642 46.3406 14.2402 45.7051 14.2402C45.0711 14.2402 44.5529 14.7642 44.5529 15.4053C44.5529 16.0463 45.0711 16.5703 45.7051 16.5703Z" fill="#6D6D6D"/>
</svg>
