<svg width="24" height="24" viewBox="0 0 24 24" fill="none" xmlns="http://www.w3.org/2000/svg">
<mask id="mask0_233_3825" style="mask-type:alpha" maskUnits="userSpaceOnUse" x="0" y="0" width="24" height="24">
<rect width="24" height="24" fill="#D9D9D9"/>
</mask>
<g mask="url(#mask0_233_3825)">
<path d="M4 21V9L12 3L20 9V21H17V11H7V21H4ZM9 19H15V17H9V19ZM9 15H15V13H9V15Z" fill="#1C1B1F"/>
</g>
</svg>
