<svg width="64" height="64" viewBox="0 0 64 64" fill="none" xmlns="http://www.w3.org/2000/svg">
<path d="M37.5494 2.71092C35.1714 1.33632 33.5192 0.941318 32.0018 0.940918C30.4848 0.941318 28.829 1.33672 26.451 2.71092C19.5302 6.71052 9.69197 15.8837 9.68237 31.9999C9.69177 48.1165 19.53 57.2893 26.451 61.2893C28.8286 62.6635 30.4848 63.0589 32.0018 63.0589C33.5188 63.0589 35.1712 62.6635 37.5494 61.2893C44.4702 57.2893 54.3084 48.1165 54.318 31.9999C54.308 15.8837 44.4702 6.71052 37.5494 2.71092ZM37.246 60.0175C34.9982 61.3163 33.436 61.8287 32.002 61.8293C30.568 61.8287 29.0024 61.3163 26.7546 60.0175C20.2124 56.2361 10.9122 47.2319 10.9034 31.9969C10.9124 16.7625 20.2124 7.75732 26.7546 3.97652C29.0024 2.67772 30.5676 2.17172 32.002 2.17132C33.4364 2.17172 34.9984 2.67732 37.246 3.97652C43.7878 7.75732 53.088 16.7625 53.0976 31.9969C53.088 47.2319 43.788 56.2363 37.246 60.0175Z" fill="black"/>
<path d="M17.778 13.7336L17.7766 13.735C17.7776 13.7354 17.7784 13.7358 17.7794 13.7362C17.779 13.7354 17.7784 13.7346 17.778 13.7336Z" fill="black"/>
<path d="M46.2223 13.7336C46.2219 13.7344 46.2213 13.7352 46.2209 13.7362C46.2219 13.7358 46.2227 13.7354 46.2237 13.735L46.2223 13.7336Z" fill="black"/>
<path d="M22.9065 33.6564H41.0935C41.2031 33.653 41.2867 33.598 41.2847 33.4698L41.2867 32.6418C41.2867 32.5276 41.2239 32.4582 41.0793 32.4568H22.9207C22.7755 32.4582 22.7133 32.5276 22.7133 32.6418L22.7147 33.4698C22.7133 33.5984 22.7967 33.6534 22.9065 33.6564Z" fill="black"/>
<path d="M22.9208 35.6128C22.7756 35.6134 22.7134 35.6828 22.7134 35.797L22.7148 36.6258C22.7134 36.7536 22.7968 36.8094 22.9068 36.812H41.0938C41.2034 36.8094 41.2858 36.727 41.2858 36.6258L41.2872 35.797C41.2872 35.6828 41.2248 35.6134 41.0798 35.6128H22.9212H22.9208Z" fill="black"/>
<path d="M42.5796 35.0799L42.581 34.2519C42.581 34.1371 42.5186 34.0677 42.3734 34.0669H21.629C21.4838 34.0675 21.4216 34.1369 21.4216 34.2519L21.4232 35.0799C21.4218 35.2083 21.5052 35.2635 21.6148 35.2661H42.3876C42.4978 35.2635 42.5808 35.2083 42.5796 35.0799Z" fill="black"/>
<path d="M34.4951 46.6515C35.1287 45.4297 35.0871 44.6925 34.5197 43.8695L36.1287 43.8721C36.2389 43.8687 36.3205 43.7865 36.3205 43.6855L36.3151 42.4335C36.3151 42.3187 36.2523 42.2499 36.1069 42.2485C35.3231 42.2459 35.6155 41.2311 34.9701 41.1531C35.0455 41.0363 35.2287 40.8417 35.1511 40.6863C34.8537 40.5223 34.6421 40.2577 34.2107 39.9963C33.8909 39.8127 33.6509 40.0319 33.3747 40.0793C33.2379 40.1187 33.1407 40.0629 33.2183 39.9827C33.6267 39.6533 34.2661 39.1457 33.8047 38.5769C34.1693 38.7081 34.3223 38.8123 34.8799 38.8053C35.4623 38.8123 35.7747 38.6731 35.9753 38.6095C36.3449 38.5199 35.9487 38.9585 35.8059 39.0465C35.6637 39.1663 35.6289 39.2015 35.4135 39.3715C36.5463 39.4033 36.9703 38.5481 37.5541 38.5783C37.7141 38.5965 37.4847 38.9233 37.3519 39.0417C37.2273 39.1453 37.1165 39.2635 36.9803 39.3711C37.6171 39.4029 38.1179 39.1039 38.5043 38.7409C38.6179 38.6103 38.6247 38.6241 38.6683 38.5743C38.7045 38.5307 38.7799 38.4959 38.8409 38.4959C38.9019 38.4959 38.9565 38.5237 38.9919 38.5673C39.2605 38.9713 39.6079 39.1265 40.1295 39.1265C40.7269 39.1265 41.3533 38.7769 41.5937 38.2711L42.3875 38.2731C42.4971 38.2705 42.5787 38.1875 42.5787 38.0865V37.3641C42.5787 37.2629 42.4887 37.1779 42.3781 37.1755L21.6149 37.1721C21.5051 37.1747 21.4211 37.2571 21.4211 37.3583V38.0809C21.4211 38.1821 21.5031 38.2651 21.5917 38.2675L22.4105 38.2721C22.6511 38.7777 23.2777 39.1275 23.8751 39.1275C24.3961 39.1275 24.7441 38.9725 25.0123 38.5683C25.0497 38.5233 25.1053 38.4973 25.1637 38.4975C25.2245 38.4975 25.2999 38.5321 25.3361 38.5751C25.3799 38.6249 25.3865 38.6113 25.5007 38.7425C25.8873 39.1051 26.3875 39.4039 27.0243 39.3721C26.8881 39.2651 26.7769 39.1463 26.6525 39.0427C26.5201 38.9243 26.2903 38.5971 26.4503 38.5795C27.0343 38.5483 27.4583 39.4035 28.5911 39.3721C28.3759 39.2021 28.3411 39.1673 28.1983 39.0471C28.0559 38.9587 27.6597 38.5211 28.0293 38.6101C28.2295 38.6735 28.5423 38.8129 29.1247 38.8059C29.6821 38.8129 29.8353 38.7087 30.1995 38.5775C29.7379 39.1463 30.3775 39.6539 30.7861 39.9833C30.8641 40.0637 30.7669 40.1195 30.6297 40.0807C30.3531 40.0325 30.1131 39.8135 29.7933 39.9971C29.3623 40.2585 29.1507 40.5231 28.8533 40.6871C28.7757 40.8429 28.9589 41.0375 29.0339 41.1539C28.3887 41.2315 28.6809 42.2465 27.8967 42.2493C27.7515 42.2507 27.6823 42.3201 27.6823 42.4343L27.6839 43.6863C27.6839 43.7875 27.7659 43.8705 27.8759 43.8729L29.4849 43.8703C28.9179 44.6933 28.8759 45.4305 29.5099 46.6523L15.1075 46.6563C18.1469 52.7633 23.4293 57.2187 27.1743 59.3829C29.2421 60.5783 30.6825 61.0497 32.0019 61.0497C33.3213 61.0497 34.7583 60.5783 36.8265 59.3829C40.5707 57.2187 45.8547 52.7581 48.8943 46.6503L34.4947 46.6517L34.4951 46.6515ZM23.3911 52.9931H23.0117V50.4655C23.0117 50.3403 23.0197 49.7981 23.0197 49.3987H23.0117L22.0225 52.0881H22.0175L20.9935 49.4047H20.9855C20.9855 49.7985 20.9935 50.3403 20.9935 50.4655V52.9931H20.6139V48.7129H21.1747L22.0025 50.8711H22.0105L22.8339 48.7129H23.3911V52.9931ZM26.4219 52.9931L26.2465 52.1969H24.8613L24.6697 52.9931H24.2659L25.3559 48.7129H25.7999L26.8497 52.9931H26.4217H26.4219ZM32.9037 41.7411C33.0983 41.9131 33.2305 41.9689 33.4485 42.0499C33.9827 42.1827 34.4609 41.9411 34.7365 41.6537L34.7415 42.2297L32.5099 42.2331V41.8649C32.5073 41.8371 32.4587 41.2941 32.9037 41.7411ZM31.9577 43.9759H32.0457V43.8853H32.0467V43.9767H31.9577V43.9761V43.9759ZM29.2621 42.2301L29.2677 41.6541C29.5429 41.9419 30.0211 42.1837 30.5549 42.0503C30.7731 41.9693 30.9053 41.9141 31.0997 41.7415C31.5447 41.2947 31.4961 41.8375 31.4931 41.8653V42.2335L29.2619 42.2301H29.2621ZM28.9413 53.0111C28.3669 53.0121 28.2025 52.9267 27.7523 52.7697L27.7859 52.4337C28.2301 52.5841 28.6001 52.6717 28.9251 52.6821C29.2847 52.6937 29.8495 52.4617 29.8515 51.9569C29.8535 51.4957 29.4837 51.3383 29.1641 51.1819L28.5317 50.8865C28.1761 50.7355 27.5463 50.3885 27.5467 49.6931C27.5471 49.0713 28.0083 48.7067 28.8987 48.7079C29.3811 48.7085 29.5867 48.7903 29.9641 48.9147L29.9445 49.2707C29.5179 49.1053 29.2645 49.0509 28.9215 49.0503C28.4737 49.0499 27.9509 49.1609 27.9609 49.6937C27.9703 50.1807 28.3879 50.3929 28.6483 50.5167L29.2811 50.8119C29.7231 51.0095 30.2483 51.2561 30.2455 51.9571C30.2431 52.5435 29.7505 53.0089 28.9413 53.0109V53.0111ZM30.9543 43.9365H30.5229V43.8881H30.9543V43.9365ZM32.9023 52.9937H31.0961V48.7133H32.8737V49.1141H31.4875V50.7205H32.8515V51.1205H31.4875V52.5931H32.9023V52.9939V52.9937ZM33.4735 43.9357H33.0431V43.8873H33.4735V43.9357ZM35.9501 52.5079L36.0155 52.9957L35.5693 52.9937C35.5559 52.6949 35.5321 52.4535 35.3783 52.2859C35.2325 52.1595 35.0587 52.0831 34.6993 52.0757H34.5429V52.9941H34.1305V48.7133H34.6921C35.6699 48.7113 36.3569 49.4753 36.3543 50.3817C36.3517 51.3181 35.9761 51.7281 35.4079 51.8977C35.7671 52.0059 35.8715 52.1589 35.9501 52.5079ZM39.1407 52.9925L38.9657 52.1957H37.5805L37.3885 52.9925H36.9851L38.0751 48.7117H38.5193L39.5685 52.9925H39.1405H39.1407ZM41.6609 49.0569H40.7491V52.9927H40.3573V49.0569H39.4455V48.7125H41.6607V49.0569H41.6609ZM42.8571 52.9931H42.4653V48.7133H42.8571V52.9931Z" fill="black"/>
<path d="M35.3784 52.2859C35.3806 52.2883 35.3824 52.2903 35.3844 52.2925C35.3808 52.2885 35.3784 52.2859 35.3784 52.2859Z" fill="black"/>
<path d="M34.7206 49.0828H34.543V51.6716H34.7144C35.6846 51.6722 35.9622 51.0886 35.9576 50.3784C35.953 49.719 35.5242 49.0796 34.7208 49.0828H34.7206Z" fill="black"/>
<path d="M35.423 52.3347C35.4174 52.3287 35.4106 52.3213 35.4026 52.3125C35.4092 52.3197 35.4164 52.3275 35.423 52.3347Z" fill="black"/>
<path d="M35.4418 52.355C35.4486 52.3624 35.4474 52.3612 35.4418 52.355V52.355Z" fill="black"/>
<path d="M25.5584 49.3506L24.9828 51.796H26.1058L25.5666 49.3506H25.5584Z" fill="black"/>
<path d="M38.2771 49.3501L37.7021 51.7955H38.8243L38.2849 49.3501H38.2771Z" fill="black"/>
<path d="M22.4546 30.6823C22.435 30.8463 22.3656 30.9157 22.1444 30.9157L21.6274 30.9147C21.4822 30.9157 21.42 30.9851 21.42 31.0993L21.4216 31.9277C21.42 32.0555 21.5036 32.1109 21.6132 32.1143H42.3868C42.497 32.1113 42.58 32.0559 42.5788 31.9277L42.5802 31.0993C42.5802 30.9851 42.518 30.9157 42.3728 30.9147L41.8564 30.9157C41.6352 30.9157 41.5652 30.8463 41.5456 30.6823C41.368 24.9887 43.5248 18.3777 46.221 13.7359C44.5244 14.4569 42.274 16.3747 40.9146 18.8493L40.923 18.8479C41.5236 18.5143 42.0798 18.2081 42.6526 17.8691C42.9192 17.8247 43.1028 17.8691 43.0586 18.1805C40.8344 22.0513 39.2158 26.2721 38.8252 30.9127L36.591 30.9153L32.9012 24.9397L32.9052 16.6649L32.9046 16.6629C32.904 16.4565 32.994 16.3313 33.2042 16.4119L35.8514 17.4907C33.7606 15.0885 32.3144 12.2637 32.0032 9.10474H31.9976C31.6862 12.2633 30.2402 15.0885 28.1494 17.4907L30.7966 16.4119C31.0064 16.3313 31.097 16.4563 31.0964 16.6629L31.0958 16.6649L31.1002 24.9397L27.4104 30.9151L25.1762 30.9125C24.7858 26.2719 23.1674 22.0507 20.9428 18.1803C20.8984 17.8689 21.082 17.8243 21.3488 17.8689C21.9212 18.2083 22.4774 18.5141 23.078 18.8477L23.0864 18.8491C21.7274 16.3745 19.477 14.4569 17.7798 13.7357C20.4762 18.3777 22.6328 24.9885 22.455 30.6821L22.4546 30.6823ZM32.9038 28.4967L34.4048 30.9155H32.9038V28.4967ZM35.5284 17.1201C35.5038 17.0919 35.48 17.0647 35.4572 17.0383C35.4812 17.0659 35.505 17.0933 35.5284 17.1201ZM35.1254 16.6571C35.107 16.6359 35.09 16.6163 35.0742 16.5983C35.0904 16.6169 35.1074 16.6365 35.1254 16.6571ZM35.0058 16.5197C34.9966 16.5091 34.9882 16.4993 34.9804 16.4907C34.9882 16.4997 34.9966 16.5093 35.0058 16.5197ZM31.0966 28.4967V30.9155H29.5948L31.0966 28.4967Z" fill="black"/>
</svg>
