<svg width="64" height="64" viewBox="0 0 64 64" fill="none" xmlns="http://www.w3.org/2000/svg">
<path d="M30.4772 46.1005C27.9292 44.5167 26.0522 39.0511 26.0522 32.5571C26.0522 32.3189 26.0542 32.0841 26.0592 31.8493L26.0622 31.8527C18.9754 30.7475 13.855 27.7195 13.7238 24.1387L13.703 24.1799C11.969 26.3185 10.9794 28.7909 10.9794 31.4255C10.9794 39.1779 19.5548 45.5301 30.4314 46.0919L30.4774 46.1003L30.4772 46.1005ZM7.703 31.9913C7.703 23.3167 18.5806 16.2839 32 16.2839C45.419 16.2839 56.2972 23.3171 56.2972 31.9913C56.2972 40.6655 45.4188 47.6991 32 47.6991C18.5806 47.6991 7.703 40.6657 7.703 31.9913ZM32 18.5507C34.5904 18.5507 36.794 22.4503 37.6102 27.8915L37.6134 27.8833C42.6532 27.1047 46.1818 25.3089 46.1818 23.2191C46.1818 20.4143 39.8316 18.1431 32 18.1431C24.1678 18.1431 17.8184 20.4145 17.8184 23.2191C17.8184 25.3089 21.3464 27.1047 26.3868 27.8833L26.3898 27.8915C27.206 22.4505 29.4102 18.5507 32 18.5507ZM33.5682 46.0921C44.4448 45.5301 53.0214 39.1779 53.0214 31.4255C53.0214 28.7911 52.0306 26.3185 50.2966 24.1799L50.2754 24.1387C50.1442 27.7193 45.0252 30.7473 37.9378 31.8527L37.9408 31.8493C37.9456 32.0841 37.948 32.3189 37.948 32.5571C37.948 39.0509 36.0696 44.5165 33.5232 46.1005L33.5682 46.0921ZM32 28.2957C33.1606 28.2957 34.2888 28.2467 35.3684 28.1521L35.3664 28.1537C34.8292 24.6657 33.5244 22.2041 31.9996 22.2041C30.475 22.2041 29.1704 24.6657 28.6324 28.1537L28.6304 28.1521C29.71 28.2465 30.8386 28.2957 31.9992 28.2957H32ZM32 41.2125C33.9504 41.2125 35.5414 37.1849 35.6262 32.1331L35.6366 32.1367C34.4612 32.2447 33.245 32.3011 32.0002 32.3011C30.7544 32.3011 29.5396 32.2447 28.364 32.1367L28.375 32.1331C28.4584 37.1845 30.049 41.2125 32 41.2125Z" fill="black"/>
</svg>
