<svg width="57" height="20" viewBox="0 0 57 20" fill="none" xmlns="http://www.w3.org/2000/svg">
<path fill-rule="evenodd" clip-rule="evenodd" d="M21.7684 2.36443C21.1845 2.39798 20.94 2.91793 20.7671 3.46533L20.3965 4.64094C19.8515 6.35938 23.0717 6.3792 22.9845 4.91541L22.8926 3.34487C22.8584 2.77308 22.3523 2.33241 21.7684 2.36443Z" fill="#6D6D6D"/>
<path d="M6.97777 17.3363C4.02852 17.3363 0.932902 15.383 0.800544 15.2992L0.5 15.1071V10.7157L0.594994 10.5601C0.747595 10.3146 1.14001 9.53853 1.14001 8.92252L1.31284 4.78423L9.47546 4.37712C13.0009 4.21549 15.2401 4.56314 17.6116 4.93061C18.9508 5.13951 20.3382 5.3545 22.0308 5.48716L35.2728 5.48411C36.0436 5.48411 36.8129 5.38195 37.6288 5.27369C38.451 5.16543 39.3028 5.05108 40.1623 5.05108C40.2869 5.06175 45.5719 5.6366 49.8182 6.69785C54.376 7.83839 55.9223 9.62696 56.1029 10.4138L56.5 16.8057L55.9456 16.9307C54.8696 17.1747 53.9899 17.3348 51.6417 17.3348H49.1736V16.0372H51.6417C53.4418 16.0372 54.2919 15.9442 55.0923 15.7856L55.0658 15.4349L54.7965 10.5906C54.7093 10.3985 53.4386 8.94234 49.4912 7.95427C45.3352 6.91589 40.1421 6.35019 40.0907 6.34562C39.3915 6.34867 38.6223 6.45083 37.8063 6.55909C36.9842 6.66735 36.1324 6.78171 35.2728 6.78171H21.9763C20.1809 6.64143 18.7686 6.42339 17.4045 6.21144C15.1015 5.85464 12.9277 5.51461 9.54084 5.67166L2.58972 6.01778L2.46514 8.94691C2.46514 9.81299 2.02914 10.7004 1.82359 11.0679V14.3904C2.64888 14.8616 5.02042 16.0738 7.13504 16.0372H9.14067V17.3348H7.15374C7.09613 17.3363 7.03694 17.3363 6.97777 17.3363ZM42.2287 17.3348H16.0871V16.0372H42.2287V17.3348Z" fill="#6D6D6D"/>
<path fill-rule="evenodd" clip-rule="evenodd" d="M1.87409 8.30499C1.84917 8.94083 1.82736 9.61631 1.82581 10.0173H2.66045C3.73647 10.0173 5.16286 9.21834 5.20801 8.30499V7.46484H1.84448V8.30499H1.87409Z" fill="#6D6D6D"/>
<path fill-rule="evenodd" clip-rule="evenodd" d="M51.0669 9.854L52.3298 12.0741C52.7455 11.8423 53.3559 11.6929 53.8262 11.6929H53.8573C54.516 11.7005 55.1716 11.6929 55.8303 11.6929L55.8054 11.5877C55.7524 11.3727 55.1233 10.3206 54.4755 9.854H51.0669Z" fill="#6D6D6D"/>
<path fill-rule="evenodd" clip-rule="evenodd" d="M16.9375 17.3423C16.7008 17.8226 16.3847 18.2587 16.0047 18.6323H16.0016C15.1389 19.477 13.9462 20 12.6304 20C11.313 20 10.1202 19.477 9.25756 18.6323C8.87606 18.2587 8.55996 17.8226 8.32483 17.3423H6.99658V15.046C6.99658 13.5288 7.63034 12.1489 8.65027 11.1486C9.67021 10.1499 11.081 9.5293 12.6304 9.5293C14.1782 9.5293 15.5858 10.1499 16.6073 11.1486L16.6104 11.1517C17.6304 12.1519 18.2641 13.5319 18.2641 15.046V17.3423H16.9375ZM45.7183 12.0635C43.8762 12.0635 42.3829 13.5258 42.3829 15.3296C42.3829 17.1334 43.8762 18.5957 45.7183 18.5957C47.5604 18.5957 49.0537 17.1334 49.0537 15.3296C49.0537 13.5258 47.5604 12.0635 45.7183 12.0635ZM12.6304 12.0635C10.7882 12.0635 9.29494 13.5258 9.29494 15.3296C9.29494 17.1334 10.7882 18.5957 12.6304 18.5957C14.4725 18.5957 15.9658 17.1334 15.9658 15.3296C15.9658 13.5258 14.4725 12.0635 12.6304 12.0635ZM45.7183 9.5293C47.2646 9.5293 48.6738 10.1499 49.6953 11.1486L49.6984 11.1517C50.7183 12.1519 51.3521 13.5319 51.3521 15.046V17.3423H50.0238C49.7887 17.8226 49.4726 18.2587 49.0911 18.6323C48.2284 19.477 47.0357 20 45.7183 20C44.4025 20 43.2097 19.477 42.3471 18.6323H42.3439C41.964 18.2587 41.6463 17.8226 41.4112 17.3423H40.083V15.046C40.083 13.5303 40.7183 12.1519 41.7382 11.1517L41.7413 11.1486C42.7628 10.1499 44.1705 9.5293 45.7183 9.5293Z" fill="#6D6D6D"/>
<path fill-rule="evenodd" clip-rule="evenodd" d="M45.6992 14.1382C45.0312 14.1382 44.4908 14.6673 44.4908 15.3214C44.4908 15.9756 45.0312 16.5047 45.6992 16.5047C46.3657 16.5047 46.9076 15.9756 46.9076 15.3214C46.9076 14.6673 46.3657 14.1382 45.6992 14.1382Z" fill="#6D6D6D"/>
<path d="M24.1851 8.04932H21.1299V8.91388H24.1851V8.04932Z" fill="#6D6D6D"/>
<path fill-rule="evenodd" clip-rule="evenodd" d="M12.6331 14.1382C11.9667 14.1382 11.4248 14.6688 11.4248 15.3214C11.4248 15.9756 11.9667 16.5047 12.6331 16.5047C13.3012 16.5047 13.8415 15.9756 13.8415 15.3214C13.8415 14.6688 13.3012 14.1382 12.6331 14.1382Z" fill="#6D6D6D"/>
<path fill-rule="evenodd" clip-rule="evenodd" d="M20.0957 13.437V14.544H38.6446L20.0957 13.437Z" fill="#6D6D6D"/>
<path d="M55.8203 13.9043H54.3285V14.7704H55.8203V13.9043Z" fill="#6D6D6D"/>
<path fill-rule="evenodd" clip-rule="evenodd" d="M54.1035 13.6187H53.4479C53.1879 13.6187 52.9761 13.8245 52.9761 14.0791V14.5808C52.9761 14.8354 53.1879 15.0428 53.4479 15.0428H54.1035C54.3635 15.0428 54.5753 14.8354 54.5753 14.5808V14.0791C54.5753 13.8245 54.3635 13.6187 54.1035 13.6187Z" fill="#6D6D6D"/>
<path fill-rule="evenodd" clip-rule="evenodd" d="M1.53418 14.9819V16.8071H6.39094V16.6653C4.36664 16.4808 2.34701 15.4439 1.53418 14.9819Z" fill="#6D6D6D"/>
<path fill-rule="evenodd" clip-rule="evenodd" d="M13.0414 2.05306C12.4575 2.08509 12.213 2.60504 12.0401 3.15244L11.668 4.32805C11.6368 4.42716 11.6181 4.52018 11.6104 4.60862C12.5166 4.65284 13.3902 4.72602 14.2451 4.81446C14.2575 4.74737 14.2622 4.67723 14.2575 4.60251L14.1641 3.03198C14.1298 2.46018 13.6253 2.01952 13.0414 2.05306Z" fill="#6D6D6D"/>
<path fill-rule="evenodd" clip-rule="evenodd" d="M40.5159 5.15377C40.4972 5.1431 34.0458 1.28692 31.3457 0.47268C31.0187 0.373569 30.6917 0.28666 30.3725 0.211945V0.214993C30.0268 0.134179 29.6749 0.0625163 29.3167 0L29.0847 1.27167C32.4451 2.11183 33.7718 4.16724 36.6977 5.89025C37.1617 6.16319 39.3885 6.00309 39.8432 6.26383L40.5159 5.15377Z" fill="#6D6D6D"/>
<path fill-rule="evenodd" clip-rule="evenodd" d="M34.1614 5.42809L34.1504 5.43877C33.7814 5.791 33.5852 6.22098 33.5665 6.71959C33.5602 6.89799 33.621 7.05352 33.7471 7.1816C33.8732 7.30968 34.0305 7.37525 34.2127 7.37525H35.6765C35.9163 7.37525 36.1219 7.25784 36.2387 7.052C36.357 6.84767 36.3523 6.61286 36.2278 6.41311C35.9599 5.98312 35.5239 5.5211 34.8263 5.28171C34.588 5.2009 34.342 5.25579 34.1614 5.42809Z" fill="#6D6D6D"/>
<path d="M35.3581 8.02615C35.221 8.02615 35.0887 7.96516 35.0015 7.84775L34.1809 6.7499C34.0376 6.55625 34.0812 6.28636 34.2774 6.14608C34.4751 6.0058 34.7508 6.04698 34.894 6.24062L35.7147 7.33847C35.8579 7.53212 35.8143 7.802 35.6181 7.94228C35.5403 7.9987 35.4484 8.02615 35.3581 8.02615Z" fill="#6D6D6D"/>
</svg>
