<svg width="64" height="64" viewBox="0 0 64 64" fill="none" xmlns="http://www.w3.org/2000/svg">
<path d="M46.1276 11.6023C43.8712 11.3791 37.9148 11.0461 32.2964 11.0461C26.678 11.0461 20.7216 11.3791 18.466 11.6023C15.891 11.8649 14.6938 13.1727 14.6938 15.7225C14.6938 20.5623 14.8718 28.1037 15.2024 32.5339C15.4976 36.4825 15.7284 39.6011 20.645 42.5879C24.1624 44.7265 27.6608 46.5585 32.216 48.9087L32.2948 48.9527L32.3748 48.9087C36.9402 46.5505 40.4452 44.7181 43.948 42.5879C48.8678 39.5981 49.0998 36.4831 49.3906 32.5339C49.7236 28.0835 49.904 20.5495 49.904 15.7225C49.9036 13.1729 48.7024 11.8649 46.1276 11.6023ZM47.8654 32.4259C47.5848 36.2051 47.3988 38.7037 43.1566 41.2807C39.8268 43.3045 36.8894 44.8467 32.4496 47.1525L32.2972 47.2257L32.146 47.1525C27.8464 44.9237 24.7788 43.3095 21.4394 41.2807C17.1944 38.7043 17.006 36.2025 16.7274 32.4221C16.3986 28.0153 16.221 20.5297 16.221 15.7225C16.221 13.9617 16.8254 13.3083 18.6184 13.1247C20.8488 12.9045 26.742 12.5743 32.2964 12.5743C37.8528 12.5743 43.7422 12.9049 45.9752 13.1247C47.7687 13.3085 48.3718 13.9619 48.3718 15.7225C48.3718 20.5271 48.195 28.0103 47.8654 32.4261V32.4259Z" fill="black"/>
<path d="M32.0614 22.3672L31.5312 24.1464C29.6126 20.2252 27.323 18.1674 24.5502 18.1674C21.5546 18.1674 20.0882 20.1732 19.6542 20.807C20.4244 18.8744 22.4562 17.1748 25.1616 17.1748C28.87 17.1748 30.9652 20.103 32.0614 22.3672Z" fill="black"/>
<path d="M18.1668 26.386C18.1902 32.9176 20.0906 36.0596 22.9278 36.0596C24.2422 36.0596 25.1842 35.232 25.1842 33.8866C25.1842 32.7382 24.6858 31.8276 24.483 31.462C24.56 31.8382 24.6304 32.265 24.6304 32.7462C24.6304 33.872 23.8702 34.2356 23.2482 34.2356C21.3608 34.2356 19.4744 30.5656 18.9404 26.3868C18.7024 26.386 18.1602 26.386 18.1668 26.386Z" fill="black"/>
<path d="M39.4347 17.1748C42.1409 17.1748 44.1689 18.8744 44.9431 20.807C44.5091 20.1732 43.0429 18.1674 40.0437 18.1674C37.2763 18.1674 34.9857 20.2252 33.0665 24.1464L32.5367 22.3672C33.6299 20.103 35.7291 17.1748 39.4347 17.1748Z" fill="black"/>
<path d="M45.6583 26.386C45.1267 30.5652 43.2379 34.2356 41.3475 34.2356C40.7279 34.2356 39.9703 33.872 39.9703 32.7462C39.9703 32.265 40.0377 31.8382 40.1135 31.462C39.9133 31.8276 39.4141 32.7382 39.4141 33.8866C39.4141 35.2324 40.3549 36.0596 41.6705 36.0596C44.5053 36.0596 46.4093 32.9178 46.4299 26.3864C46.4379 26.386 45.8975 26.386 45.6583 26.386Z" fill="black"/>
<path d="M41.8044 20.7681C39.381 20.7681 37.0124 22.7007 35.5954 27.1605L36.5114 27.7993L36.0732 29.9927L34.3596 30.7021L34.0488 32.8571L34.884 31.8331L35.78 31.4621L35.501 32.8543L33.9566 33.4955L33.4154 37.2219L33.7928 38.4119L32.3 39.0045L30.8064 38.4119L31.1846 37.2219L30.6418 33.4955L29.0958 32.8543L28.8202 31.4621L29.714 31.8331L30.5518 32.8571L30.2368 30.7021L28.5258 29.9927L28.0844 27.7993L29.0016 27.1605C27.5858 22.7009 25.2186 20.7681 22.7926 20.7681C19.7954 20.7681 18.5542 23.6129 18.7156 25.9567H19.438C20.0382 29.2711 21.7232 32.0795 22.991 32.0795C23.3788 32.0795 23.5816 31.7841 23.5816 31.2989C23.5816 30.1303 22.784 28.9069 22.784 26.6719C22.784 25.6425 23.1196 24.9973 23.8928 24.9973C24.4194 24.9973 24.8502 25.5515 25.107 26.1563C24.6388 27.8259 24.7082 29.2239 26.0418 29.8191C26.6998 30.1115 27.494 30.4611 27.494 30.4611C27.494 30.4611 28.3396 34.0451 28.4012 34.3011C28.4566 34.5353 28.6022 34.8557 28.7094 35.0533C28.864 35.3231 29.974 37.2245 29.974 37.2245C29.974 37.2245 30.3514 39.1211 30.4322 39.5247C30.6496 40.6095 31.4244 40.6121 32.2998 40.6095C33.173 40.6125 33.948 40.6095 34.1666 39.5247C34.2462 39.1213 34.6252 37.2245 34.6252 37.2245C34.6252 37.2245 35.7334 35.3233 35.8918 35.0533C35.997 34.8557 36.1418 34.5357 36.195 34.3011C36.2558 34.0451 37.1034 30.4611 37.1034 30.4611C37.1034 30.4611 37.898 30.1121 38.5584 29.8191C39.8898 29.2239 39.9616 27.8263 39.4916 26.1563C39.7484 25.5515 40.181 24.9973 40.7072 24.9973C41.4804 24.9973 41.815 25.6427 41.815 26.6719C41.815 28.9065 41.0176 30.1299 41.0176 31.2989C41.0176 31.7839 41.2204 32.0795 41.6082 32.0795C42.8728 32.0795 44.5616 29.2711 45.1638 25.9567H45.8834C46.0442 23.6129 44.8036 20.7681 41.805 20.7681H41.8044ZM26.562 29.1741C25.6188 28.7729 25.522 27.6561 25.837 26.1701L26.8698 27.7943L27.2542 29.4693C27.255 29.4693 26.8822 29.3089 26.5622 29.1741H26.562ZM38.0352 29.1741C37.7144 29.3089 37.34 29.4693 37.34 29.4693L37.7228 27.7943L38.757 26.1701C39.0728 27.6561 38.9774 28.7729 38.035 29.1741H38.0352Z" fill="black"/>
<path d="M30.2574 53.8356V55.6286C30.2574 55.6286 32.0886 55.6286 32.7 55.6286C34.0524 55.6286 34.5638 55.088 34.5638 54.3406C34.5638 53.8494 34.32 53.0576 32.7218 53.0576C32.1606 53.0576 28.5958 53.0576 28.5958 53.0576V52.0486C28.5958 52.0486 31.3908 52.0486 32.8994 52.0486C35.6378 52.0486 36.2766 53.2072 36.2766 54.3406C36.2766 55.7006 35.3576 56.6418 32.8928 56.6418C31.3778 56.6418 28.595 56.6418 28.595 56.6418V53.836H30.2574V53.8356Z" fill="black"/>
<path d="M12.0126 53.8356V55.6286C12.0126 55.6286 13.8462 55.6286 14.4566 55.6286C15.8086 55.6286 16.3188 55.088 16.3188 54.3406C16.3188 53.8494 16.0768 53.0576 14.4762 53.0576C13.915 53.0576 10.3534 53.0576 10.3534 53.0576V52.0486C10.3534 52.0486 13.1488 52.0486 14.6562 52.0486C17.3966 52.0486 18.036 53.2072 18.036 54.3406C18.036 55.7006 17.1132 56.6418 14.6512 56.6418C13.1354 56.6418 10.3534 56.6418 10.3534 56.6418V53.836H12.0128L12.0126 53.8356Z" fill="black"/>
<path d="M41.1888 53.8307V54.8469H43.6244V55.6293C43.6244 55.6293 41.8166 55.6293 41.2022 55.6293C39.8266 55.6293 39.317 55.0885 39.317 54.3409C39.317 53.5075 40.0086 53.0605 41.1072 53.0605C41.668 53.0605 45.2826 53.0605 45.2826 53.0605V52.0491C45.2826 52.0491 42.5512 52.0491 41.043 52.0491C38.8658 52.0491 37.603 52.7373 37.603 54.3411C37.603 55.9117 38.8228 56.6419 40.979 56.6419C42.496 56.6419 45.2826 56.6419 45.2826 56.6419V53.8307L41.1888 53.8303V53.8307Z" fill="black"/>
<path d="M48.9743 53.0516H54.2045V52.0488H47.2039V56.6418H54.2603V55.6294H48.9741V54.845H53.9241V53.834H48.9737L48.9741 53.0516H48.9743Z" fill="black"/>
<path d="M23.2576 56.7144C20.4242 56.7144 19.343 55.7854 19.343 54.3404C19.343 52.9072 20.4596 51.9714 23.2576 51.9714C26.055 51.9714 27.1708 52.9072 27.1708 54.3404C27.1708 55.7854 26.055 56.7144 23.2576 56.7144ZM25.456 54.3408C25.456 53.5558 24.6942 52.9808 23.2578 52.9808C21.8094 52.9808 21.0588 53.5558 21.0588 54.3408C21.0588 55.0904 21.734 55.7032 23.2578 55.7032C24.803 55.7028 25.456 55.0904 25.456 54.3408Z" fill="black"/>
</svg>
