<svg width="44" height="22" viewBox="0 0 44 22" fill="none" xmlns="http://www.w3.org/2000/svg">
<path fill-rule="evenodd" clip-rule="evenodd" d="M7.9519 7.17305L8.77311 1.97168H15.2939V7.17305H7.9519ZM17.2677 1.97168H24.4883L26.0964 4.78132C25.7254 4.68815 25.3385 4.79332 25.0507 5.07149L25.0481 5.07413C24.6348 5.47608 24.4355 6.52221 24.3906 7.17305H17.2677V1.97168Z" fill="#6D6D6D"/>
<path d="M6.20261 16.536L2.55603 15.6881L3.09471 8.59139C3.09339 6.44187 4.21561 0.700104 4.26314 0.455205L4.35292 0H24.7128C25.3228 0 25.868 0.318102 26.1717 0.849159C26.7156 1.79814 27.2583 2.8416 27.8022 3.88641C28.2894 4.81942 28.7739 5.75246 29.2598 6.61626L39.9856 7.10071C40.8451 7.13931 41.5185 7.88068 41.5185 8.79107V9.84116C41.9661 10.3083 42.1931 11.0058 42.1931 11.9162L42.2671 16.4867L41.1435 16.5053L41.0709 11.9255C41.0709 11.4503 40.9917 10.8314 40.6154 10.5426L40.3949 10.3722V8.79107C40.3949 8.49293 40.1903 8.24269 39.9368 8.23204L28.5931 7.7183L28.4399 7.45075C27.896 6.50044 27.3533 5.45698 26.8081 4.41217C26.272 3.38066 25.7347 2.35048 25.1986 1.4148C25.093 1.22847 24.9254 1.13133 24.7128 1.13133H5.27711C5.0091 2.55014 4.21561 6.89576 4.21561 8.63534L3.74823 14.8044L6.45479 15.4339L6.20261 16.536Z" fill="#6D6D6D"/>
<path d="M33.1086 15.7295H14.3595V17.9841H33.1086V15.7295Z" fill="#6D6D6D"/>
<path d="M43.6001 14.2109H40.5067V17.3294H43.6001V14.2109Z" fill="#6D6D6D"/>
<path fill-rule="evenodd" clip-rule="evenodd" d="M3.65256 13.8369H1.40942V16.9567H6.95851V16.0756L3.65256 15.1825V13.8369Z" fill="#6D6D6D"/>
<path fill-rule="evenodd" clip-rule="evenodd" d="M2.83794 5.34912H1.72233C1.10445 5.34912 0.600098 5.85756 0.600098 6.48045V13.1206C0.600098 13.7435 1.10445 14.2533 1.72233 14.2533H2.83794C3.45582 14.2533 3.96017 13.7449 3.96017 13.1206V6.48045C3.96017 5.85756 3.45582 5.34912 2.83794 5.34912Z" fill="#6D6D6D"/>
<path fill-rule="evenodd" clip-rule="evenodd" d="M25.4534 5.47311L25.4442 5.48241C25.13 5.78721 24.9636 6.92122 24.9491 7.35512C24.9438 7.51085 24.9953 7.64791 25.1023 7.75838C25.2092 7.87151 25.3425 7.92744 25.497 7.92744H26.7381C28.0649 7.92744 26.5123 5.51969 26.0172 5.34666C25.8165 5.27612 25.6066 5.32537 25.4534 5.47311Z" fill="#6D6D6D"/>
<path d="M20.2141 8.18213H18.5862V8.93546H20.2141V8.18213Z" fill="#6D6D6D"/>
<path fill-rule="evenodd" clip-rule="evenodd" d="M41.3002 11.8132C41.9035 11.6042 42.3366 11.0266 42.3366 10.3478C42.3366 9.65832 41.889 9.07402 41.2711 8.87305C41.2896 8.94226 41.3002 9.01546 41.3002 9.09133V11.8132Z" fill="#6D6D6D"/>
<path d="M28.1018 13.8706H18.9009V14.6253H28.1018V13.8706Z" fill="#6D6D6D"/>
<path d="M17.8452 16.6656L15.0475 11.1235C14.7452 10.5219 14.1181 10.1479 13.4104 10.1479H6.50274C5.80696 10.1479 5.19303 10.5165 4.86032 11.1328L3.51629 15.3599L2.80334 15.1297L4.17511 10.836C4.67021 9.90963 5.5297 9.39453 6.50274 9.39453H13.4104C14.4019 9.39453 15.2838 9.92558 15.7156 10.7814L18.5106 16.3222L17.8452 16.6656ZM29.3117 16.6257L28.6106 16.3621L30.6597 10.82C31.1469 9.9096 32.0077 9.39453 32.9807 9.39453H39.5147C40.8852 9.39453 41.639 10.289 41.639 11.9141V16.0028H40.8918V11.9141C40.8918 10.3315 40.1049 10.1479 39.5147 10.1479H32.9807C32.2849 10.1479 31.671 10.5165 31.3383 11.1328L29.3117 16.6257Z" fill="#6D6D6D"/>
<path fill-rule="evenodd" clip-rule="evenodd" d="M14.8109 16.442C14.8505 16.6948 14.8729 16.953 14.8729 17.2166C14.8729 18.5382 14.3408 19.7334 13.4827 20.5985C12.6245 21.4637 11.4376 22 10.1279 22C8.81685 22 7.62993 21.4637 6.77176 20.5985C5.91358 19.7334 5.38283 18.5382 5.38283 17.2166C5.38283 16.953 5.40395 16.6948 5.44488 16.442H4.15234L6.25024 11.8767C6.42584 11.4934 6.81268 11.2871 7.23517 11.2871H12.6456C13.0681 11.2871 13.4299 11.504 13.6319 11.8767L16.1034 16.442H14.8109ZM36.792 14.4854C35.2961 14.4854 34.0828 15.7086 34.0828 17.2166C34.0828 18.7259 35.2961 19.949 36.792 19.949C38.2892 19.949 39.5025 18.7259 39.5025 17.2166C39.5025 15.7086 38.2892 14.4854 36.792 14.4854ZM10.1279 14.4854C8.63069 14.4854 7.41736 15.7086 7.41736 17.2166C7.41736 18.7259 8.63069 19.949 10.1279 19.949C11.6237 19.949 12.8371 18.7259 12.8371 17.2166C12.8371 15.7086 11.6237 14.4854 10.1279 14.4854ZM32.7269 11.8767C32.8774 11.4814 33.2906 11.2871 33.7131 11.2871H39.1236C39.5461 11.2871 39.9065 11.504 40.1085 11.8767L42.5814 16.442H41.475C41.5159 16.6948 41.537 16.953 41.537 17.2166C41.537 18.5382 41.0063 19.7334 40.1481 20.5985C39.2899 21.4637 38.1017 22 36.792 22C35.4823 22 34.2954 21.4637 33.4372 20.5985C32.579 19.7334 32.047 18.5382 32.047 17.2166C32.047 16.953 32.0681 16.6948 32.109 16.442H31.0039L32.7269 11.8767Z" fill="#6D6D6D"/>
<path fill-rule="evenodd" clip-rule="evenodd" d="M36.8135 15.9673C36.1349 15.9673 35.583 16.5236 35.583 17.2078C35.583 17.8932 36.1349 18.4495 36.8135 18.4495C37.4935 18.4495 38.044 17.8932 38.044 17.2078C38.044 16.5236 37.4935 15.9673 36.8135 15.9673Z" fill="#6D6D6D"/>
<path fill-rule="evenodd" clip-rule="evenodd" d="M10.1492 15.9673C9.46926 15.9673 8.9187 16.5236 8.9187 17.2078C8.9187 17.8932 9.46926 18.4495 10.1492 18.4495C10.8292 18.4495 11.3797 17.8932 11.3797 17.2078C11.3797 16.5236 10.8292 15.9673 10.1492 15.9673Z" fill="#6D6D6D"/>
</svg>
