<svg width="64" height="64" viewBox="0 0 64 64" fill="none" xmlns="http://www.w3.org/2000/svg">
<g clip-path="url(#clip0_284_13716)">
<path d="M12.6187 28.478C13.0112 28.478 13.3428 28.937 13.3428 29.48C13.3428 29.998 13.7622 30.4175 14.2803 30.4175C14.7979 30.4175 15.2178 29.998 15.2178 29.48C15.2178 27.8936 14.0518 26.603 12.6187 26.603C11.186 26.603 10.02 27.8936 10.02 29.48C10.02 31.438 11.1265 32.2168 12.1636 32.793C13.0483 33.2852 13.3428 33.5962 13.3428 34.4673C13.3428 35.0107 13.0112 35.4697 12.6191 35.4697C12.2266 35.4697 11.895 35.0107 11.895 34.4673C11.895 33.9497 11.4756 33.5298 10.9575 33.5298C10.4399 33.5298 10.02 33.9497 10.02 34.4673C10.02 36.0537 11.186 37.3447 12.6191 37.3447C14.0518 37.3447 15.2178 36.0537 15.2178 34.4673C15.2178 32.5098 14.1113 31.731 13.0747 31.1543C12.1895 30.6626 11.895 30.3516 11.895 29.48C11.895 28.937 12.2266 28.478 12.6187 28.478Z" fill="black"/>
<path d="M17.6025 26.6099C17.085 26.6099 16.665 27.0293 16.665 27.5474V34.7461C16.665 36.1787 17.8311 37.3447 19.2637 37.3447C20.6968 37.3447 21.8628 36.1787 21.8628 34.7461V27.5474C21.8628 27.0293 21.4429 26.6099 20.9253 26.6099C20.4072 26.6099 19.9878 27.0293 19.9878 27.5474V34.7461C19.9878 35.145 19.6631 35.4697 19.2637 35.4697C18.8647 35.4697 18.54 35.145 18.54 34.7461V27.5474C18.54 27.0293 18.1206 26.6099 17.6025 26.6099Z" fill="black"/>
<path d="M25.9087 28.4849C26.3081 28.4849 26.6328 28.8096 26.6328 29.2085C26.6328 29.7261 27.0522 30.146 27.5703 30.146C28.0879 30.146 28.5078 29.7261 28.5078 29.2085C28.5078 27.7754 27.3418 26.6099 25.9087 26.6099C24.4761 26.6099 23.3101 27.7754 23.3101 29.2085V34.7461C23.3101 36.1787 24.4761 37.3447 25.9087 37.3447C27.3418 37.3447 28.5078 36.1787 28.5078 34.7461C28.5078 34.228 28.0879 33.8086 27.5703 33.8086C27.0522 33.8086 26.6328 34.228 26.6328 34.7461C26.6328 35.145 26.3081 35.4697 25.9087 35.4697C25.5098 35.4697 25.1851 35.145 25.1851 34.7461V29.2085C25.1851 28.8091 25.5098 28.4849 25.9087 28.4849Z" fill="black"/>
<path d="M32.3867 28.4849C32.7856 28.4849 33.1104 28.8096 33.1104 29.2085C33.1104 29.7261 33.5303 30.146 34.0479 30.146C34.5659 30.146 34.9854 29.7261 34.9854 29.2085C34.9854 27.7754 33.8198 26.6099 32.3867 26.6099C30.9541 26.6099 29.7881 27.7754 29.7881 29.2085V34.7461C29.7881 36.1787 30.9536 37.3447 32.3867 37.3447C33.8198 37.3447 34.9854 36.1787 34.9854 34.7461C34.9854 34.228 34.5659 33.8086 34.0479 33.8086C33.5303 33.8086 33.1104 34.228 33.1104 34.7461C33.1104 35.145 32.7856 35.4697 32.3867 35.4697C31.9878 35.4697 31.6631 35.145 31.6631 34.7461V29.2085C31.6631 28.8091 31.9878 28.4849 32.3867 28.4849Z" fill="black"/>
<path d="M41.4043 36.4072C41.4043 35.8892 40.9844 35.4697 40.4668 35.4697H38.0815V32.9146H39.3589C39.877 32.9146 40.2964 32.4951 40.2964 31.9771C40.2964 31.4595 39.877 31.0396 39.3589 31.0396H38.0815V28.4849H40.4668C40.9844 28.4849 41.4043 28.0649 41.4043 27.5474C41.4043 27.0293 40.9844 26.6099 40.4668 26.6099H37.144C36.6265 26.6099 36.2065 27.0293 36.2065 27.5474V36.4072C36.2065 36.9248 36.6265 37.3447 37.144 37.3447H40.4668C40.9844 37.3447 41.4043 36.9248 41.4043 36.4072Z" fill="black"/>
<path d="M45.0283 28.478C45.4209 28.478 45.752 28.937 45.752 29.48C45.752 29.998 46.1719 30.4175 46.6895 30.4175C47.2075 30.4175 47.627 29.998 47.627 29.48C47.627 27.8936 46.4614 26.603 45.0283 26.603C43.5957 26.603 42.4297 27.8936 42.4297 29.48C42.4297 31.438 43.5356 32.2168 44.5728 32.793C45.4575 33.2852 45.752 33.5962 45.752 34.4673C45.752 35.0107 45.4209 35.4697 45.0283 35.4697C44.6362 35.4697 44.3047 35.0107 44.3047 34.4673C44.3047 33.9497 43.8848 33.5298 43.3672 33.5298C42.8496 33.5298 42.4297 33.9497 42.4297 34.4673C42.4297 36.0537 43.5952 37.3447 45.0283 37.3447C46.4614 37.3447 47.627 36.0537 47.627 34.4673C47.627 32.5098 46.521 31.731 45.4839 31.1543C44.5991 30.6626 44.3047 30.3516 44.3047 29.48C44.3047 28.937 44.6362 28.478 45.0283 28.478Z" fill="black"/>
<path d="M51.3813 28.478C51.7734 28.478 52.105 28.937 52.105 29.48C52.105 29.998 52.5244 30.4175 53.0425 30.4175C53.5601 30.4175 53.98 29.998 53.98 29.48C53.98 27.8936 52.814 26.603 51.3813 26.603C49.9482 26.603 48.7822 27.8936 48.7822 29.48C48.7822 31.438 49.8887 32.2168 50.9258 32.793C51.8105 33.2852 52.105 33.5962 52.105 34.4673C52.105 35.0107 51.7734 35.4697 51.3813 35.4697C50.9888 35.4697 50.6577 35.0107 50.6577 34.4673C50.6577 33.9497 50.2378 33.5298 49.7202 33.5298C49.2021 33.5298 48.7827 33.9497 48.7827 34.4673C48.7827 36.0537 49.9482 37.3447 51.3813 37.3447C52.8145 37.3447 53.98 36.0537 53.98 34.4673C53.98 32.5098 52.8735 31.731 51.8369 31.1543C50.9517 30.6626 50.6577 30.3516 50.6577 29.48C50.6572 28.937 50.9888 28.478 51.3813 28.478Z" fill="black"/>
<path d="M6.88525 31.9712C6.88525 31.4531 6.46533 31.0337 5.94775 31.0337H0.9375C0.419922 31.0337 0 31.4531 0 31.9712C0 32.4888 0.419922 32.9087 0.9375 32.9087H5.94775C6.46533 32.9087 6.88525 32.4888 6.88525 31.9712Z" fill="black"/>
<path d="M7.24614 27.0737L4.24028 26.0712C3.74907 25.9076 3.21782 26.1733 3.05425 26.6645C2.89018 27.1557 3.15581 27.6865 3.64702 27.8505L6.65337 28.8525C6.75151 28.8852 6.85161 28.9008 6.94975 28.9008C7.34233 28.9008 7.70805 28.6523 7.83891 28.2592C8.00249 27.768 7.73735 27.2372 7.24614 27.0737Z" fill="black"/>
<path d="M6.6533 35.09L3.64695 36.092C3.15574 36.2555 2.89061 36.7863 3.05418 37.2775C3.18504 37.6706 3.55076 37.9191 3.94334 37.9191C4.04148 37.9191 4.14158 37.9035 4.24021 37.8708L7.24607 36.8683C7.73729 36.7048 8.00242 36.174 7.83885 35.6828C7.67527 35.1916 7.14402 34.9259 6.6533 35.09Z" fill="black"/>
<path d="M63.0625 31.0337H58.0522C57.5347 31.0337 57.1147 31.4531 57.1147 31.9712C57.1147 32.4888 57.5347 32.9087 58.0522 32.9087H63.0625C63.5801 32.9087 64 32.4888 64 31.9712C64 31.4531 63.5801 31.0337 63.0625 31.0337Z" fill="black"/>
<path d="M57.0503 28.9003C57.1484 28.9003 57.2485 28.8847 57.3467 28.852L60.353 27.85C60.8442 27.6865 61.1094 27.1557 60.9458 26.6645C60.7822 26.1733 60.251 25.9076 59.7597 26.0712L56.7539 27.0732C56.2627 27.2372 55.9975 27.768 56.1611 28.2592C56.292 28.6523 56.6577 28.9003 57.0503 28.9003Z" fill="black"/>
<path d="M60.3531 36.092L57.3467 35.09C56.856 34.9259 56.3248 35.1916 56.1612 35.6828C55.9971 36.174 56.2627 36.7048 56.754 36.8688L59.7598 37.8708C59.8584 37.9035 59.9581 37.9191 60.0567 37.9191C60.4493 37.9191 60.815 37.6706 60.9458 37.278C61.1094 36.7863 60.8443 36.2555 60.3531 36.092Z" fill="black"/>
<path d="M12.7998 14.0964L22.3188 23.6155C22.502 23.7986 22.7417 23.8899 22.9819 23.8899C23.2217 23.8899 23.4614 23.7986 23.6445 23.6155C24.0107 23.2493 24.0107 22.6555 23.6445 22.2898L14.1255 12.7708C13.7593 12.4045 13.1655 12.4045 12.7998 12.7708C12.4336 13.1365 12.4336 13.7302 12.7998 14.0964Z" fill="black"/>
<path d="M12.4312 10.5088C12.5166 10.3613 12.5566 10.2002 12.5566 10.041C12.5566 9.7168 12.3887 9.40186 12.0879 9.22803L9.82666 7.92285L12.0879 6.61719C12.3887 6.44336 12.5571 6.12793 12.5566 5.8042C12.5566 5.64502 12.5161 5.48389 12.4312 5.33643C12.1724 4.8877 11.5986 4.73438 11.1504 4.99316L8.88916 6.29883V3.6875C8.88916 3.16992 8.46924 2.75 7.95166 2.75C7.43408 2.75 7.01416 3.16992 7.01416 3.6875V6.29883L4.75293 4.99316C4.3042 4.73389 3.73096 4.8877 3.47217 5.33643C3.38672 5.48389 3.34619 5.64502 3.34619 5.80371C3.34619 6.12793 3.51465 6.44336 3.81543 6.6167L6.07666 7.92236L3.81543 9.22803C3.51416 9.40186 3.34619 9.7168 3.34619 10.041C3.34619 10.2002 3.38721 10.3613 3.47217 10.5088C3.73096 10.957 4.3042 11.1108 4.75293 10.8521L7.01416 9.54639V12.1577C7.01416 12.6753 7.43408 13.0952 7.95166 13.0952C8.46924 13.0952 8.88916 12.6753 8.88916 12.1577V9.54639L11.1504 10.8521C11.5986 11.1108 12.1724 10.957 12.4312 10.5088Z" fill="black"/>
<path d="M51.2002 49.8455L41.6812 40.3264C41.3149 39.9602 40.7212 39.9602 40.3555 40.3264C39.9893 40.6926 39.9893 41.2864 40.3555 41.6521L49.8745 51.1711C50.0576 51.3542 50.2974 51.446 50.5376 51.446C50.7773 51.446 51.0171 51.3547 51.2002 51.1711C51.5664 50.8054 51.5664 50.2117 51.2002 49.8455Z" fill="black"/>
<path d="M60.6538 53.9009C60.6538 53.7417 60.6128 53.5806 60.5278 53.4331C60.269 52.9849 59.6958 52.8311 59.2471 53.0898L56.9858 54.3955V51.7842C56.9858 51.2666 56.5659 50.8467 56.0483 50.8467C55.5308 50.8467 55.1108 51.2666 55.1108 51.7842V54.3955L52.8496 53.0898C52.4014 52.8311 51.8276 52.9849 51.5688 53.4331C51.4834 53.5806 51.4434 53.7417 51.4434 53.9009C51.4434 54.2251 51.6113 54.54 51.9121 54.7139L54.1733 56.0195L51.9121 57.3252C51.6113 57.4985 51.4429 57.814 51.4434 58.1382C51.4434 58.2969 51.4839 58.458 51.5688 58.6055C51.8276 59.0542 52.4014 59.2075 52.8496 58.9487L55.1108 57.6431V60.2544C55.1108 60.7725 55.5308 61.1919 56.0483 61.1919C56.5659 61.1919 56.9858 60.7725 56.9858 60.2544V57.6431L59.2471 58.9487C59.6953 59.2075 60.269 59.0537 60.5278 58.6055C60.6133 58.458 60.6538 58.2969 60.6538 58.1382C60.6538 57.814 60.4854 57.4985 60.1846 57.3252L57.9233 56.0195L60.1846 54.7139C60.4858 54.54 60.6538 54.2251 60.6538 53.9009Z" fill="black"/>
<path d="M22.3188 40.3264L17.3091 45.3367C16.9429 45.7029 16.9429 46.2961 17.3091 46.6624C17.4917 46.8455 17.7319 46.9368 17.9717 46.9368C18.2114 46.9368 18.4517 46.8455 18.6348 46.6624L23.6445 41.6521C24.0107 41.2859 24.0107 40.6926 23.6445 40.3264C23.2788 39.9602 22.6851 39.9602 22.3188 40.3264Z" fill="black"/>
<path d="M16.9697 49.0698H14.9014V47.001C14.9014 46.4834 14.4814 46.0635 13.9639 46.0635C13.4458 46.0635 13.0264 46.4834 13.0264 47.001V49.0698H10.9575C10.4399 49.0698 10.02 49.4893 10.02 50.0073C10.02 50.5249 10.4399 50.9448 10.9575 50.9448H13.0264V53.0132C13.0264 53.5308 13.4458 53.9507 13.9639 53.9507C14.4814 53.9507 14.9014 53.5308 14.9014 53.0132V50.9448H16.9697C17.4873 50.9448 17.9072 50.5249 17.9072 50.0073C17.9072 49.4893 17.4873 49.0698 16.9697 49.0698Z" fill="black"/>
<path d="M41.0181 23.8899C41.2578 23.8899 41.498 23.7986 41.6812 23.6155L46.6909 18.6052C47.0571 18.239 47.0571 17.6458 46.6909 17.2795C46.3252 16.9133 45.7314 16.9133 45.3652 17.2795L40.3555 22.2898C39.9893 22.656 39.9893 23.2493 40.3555 23.6155C40.5381 23.7986 40.7783 23.8899 41.0181 23.8899Z" fill="black"/>
<path d="M47.0303 14.8721H49.0986V16.9409C49.0986 17.4585 49.5186 17.8784 50.0361 17.8784C50.5542 17.8784 50.9736 17.4585 50.9736 16.9409V14.8721H53.0425C53.5601 14.8721 53.98 14.4521 53.98 13.9346C53.98 13.417 53.5601 12.9971 53.0425 12.9971H50.9736V10.9287C50.9736 10.4106 50.5542 9.99121 50.0361 9.99121C49.5186 9.99121 49.0986 10.4106 49.0986 10.9287V12.9971H47.0303C46.5127 12.9971 46.0928 13.417 46.0928 13.9346C46.0928 14.4521 46.5127 14.8721 47.0303 14.8721Z" fill="black"/>
<path d="M31.0625 14.9365V21.9507C31.0625 22.4683 31.4824 22.8882 32 22.8882C32.5176 22.8882 32.9375 22.4683 32.9375 21.9507V14.9365C32.9375 14.4189 32.5176 13.999 32 13.999C31.4824 13.999 31.0625 14.4189 31.0625 14.9365Z" fill="black"/>
<path d="M32 11.8662C33.6221 11.8662 34.9414 10.5464 34.9414 8.9248C34.9414 7.30273 33.6221 5.98291 32 5.98291C30.3779 5.98291 29.0586 7.30273 29.0586 8.92432C29.0586 10.5464 30.3779 11.8662 32 11.8662ZM32 7.85791C32.5879 7.85791 33.0664 8.33643 33.0664 8.92432C33.0664 9.5127 32.5879 9.99121 32 9.99121C31.4121 9.99121 30.9336 9.5127 30.9336 8.92432C30.9336 8.33643 31.4121 7.85791 32 7.85791Z" fill="black"/>
<path d="M32.9375 49.0054V41.9912C32.9375 41.4731 32.5176 41.0537 32 41.0537C31.4824 41.0537 31.0625 41.4731 31.0625 41.9912V49.0054C31.0625 49.5229 31.4824 49.9429 32 49.9429C32.5176 49.9429 32.9375 49.5229 32.9375 49.0054Z" fill="black"/>
<path d="M32 52.0757C30.3779 52.0757 29.0586 53.3955 29.0586 55.0176C29.0586 56.6392 30.3779 57.959 32 57.959C33.6221 57.959 34.9414 56.6392 34.9414 55.0176C34.9414 53.3955 33.6221 52.0757 32 52.0757ZM32 56.084C31.4121 56.084 30.9336 55.6055 30.9336 55.0176C30.9336 54.4292 31.4121 53.9507 32 53.9507C32.5879 53.9507 33.0664 54.4292 33.0664 55.0176C33.0664 55.6055 32.5879 56.084 32 56.084Z" fill="black"/>
</g>
<defs>
<clipPath id="clip0_284_13716">
<rect width="64" height="64" fill="white"/>
</clipPath>
</defs>
</svg>
