<svg width="50" height="53" viewBox="0 0 50 53" fill="none" xmlns="http://www.w3.org/2000/svg">
<path d="M23.6207 0C22.6727 0 21.7247 0.243556 20.879 0.730733L2.74169 11.204C1.05028 12.1826 0 14.0005 0 15.9534V36.8959C0 38.8488 1.05028 40.6666 2.74169 41.6452L15.6444 49.0942C15.8427 49.2081 16.062 49.2631 16.2771 49.2631C16.7158 49.2631 17.1375 49.0354 17.3737 48.6304C17.7238 48.023 17.5172 47.2505 16.9098 46.9004L4.00709 39.4563C3.096 38.9291 2.53079 37.9503 2.53079 36.9V15.9534C2.53079 15.8775 2.53883 15.8018 2.54727 15.7301L17.6019 24.4231C17.8001 24.537 18.0194 24.592 18.2346 24.592C18.6732 24.592 19.0949 24.3642 19.3311 23.9593C19.6812 23.3519 19.4746 22.5802 18.8673 22.2301L3.80443 13.5322C3.87191 13.4858 3.93538 13.435 4.00709 13.3971L22.1444 2.92376C23.0555 2.39651 24.1859 2.39651 25.097 2.92376L43.2344 13.3971C43.3061 13.4392 43.3695 13.4858 43.437 13.5322L39.0329 16.0761C38.4297 16.4262 38.219 17.198 38.569 17.8053C38.8053 18.2103 39.2269 18.438 39.6656 18.438C39.8807 18.438 40.0958 18.383 40.2983 18.2692L44.6942 15.7301C44.6984 15.8061 44.7107 15.8775 44.7107 15.9534V20.323C44.7107 21.0231 45.2759 21.5884 45.9761 21.5884C46.6762 21.5884 47.2415 21.0231 47.2415 20.323V15.9534C47.2415 14.0005 46.1912 12.1826 44.4998 11.204L26.3624 0.730733C25.5167 0.243556 24.5687 0 23.6207 0ZM33.7439 20.9433C24.9072 20.9433 17.7155 28.135 17.7155 36.9716C17.7155 45.8083 24.9072 53 33.7439 53C42.5806 53 49.7723 45.8083 49.7723 36.9716C49.7723 28.135 42.5806 20.9433 33.7439 20.9433ZM33.7439 23.4741C41.1844 23.4741 47.2415 29.5269 47.2415 36.9716C47.2415 44.4164 41.1844 50.4692 33.7439 50.4692C26.3034 50.4692 20.2463 44.4164 20.2463 36.9716C20.2463 29.5269 26.3034 23.4741 33.7439 23.4741ZM41.8042 31.9092C41.481 31.8976 41.1532 32.0095 40.898 32.2478L32.6812 39.874L29.1338 36.4782C28.6276 35.9973 27.8303 36.0141 27.3452 36.5161C26.8602 37.0222 26.8812 37.8237 27.3831 38.3046L31.7906 42.5226C32.0353 42.7546 32.3517 42.8727 32.6639 42.8727C32.9718 42.8727 33.2801 42.7585 33.5248 42.5349L42.614 34.099C43.1244 33.6223 43.1582 32.8208 42.6816 32.3104C42.4454 32.0553 42.1274 31.9208 41.8042 31.9092Z" fill="white"/>
<path d="M33.7439 20.9431C24.9072 20.9431 17.7156 28.1348 17.7156 36.9715C17.7156 45.8082 24.9072 52.9998 33.7439 52.9998C42.5806 52.9998 49.7723 45.8082 49.7723 36.9715C49.7723 28.1348 42.5806 20.9431 33.7439 20.9431ZM33.7439 23.4739C41.1845 23.4739 47.2415 29.5267 47.2415 36.9715C47.2415 44.4162 41.1845 50.469 33.7439 50.469C26.3034 50.469 20.2464 44.4162 20.2464 36.9715C20.2464 29.5267 26.3034 23.4739 33.7439 23.4739ZM41.8042 31.9091C41.481 31.8975 41.1532 32.0093 40.898 32.2477L32.6812 39.8738L29.1338 36.478C28.6276 35.9971 27.8303 36.0139 27.3453 36.5159C26.8602 37.022 26.8812 37.8236 27.3832 38.3044L31.7906 42.5224C32.0353 42.7544 32.3518 42.8725 32.6639 42.8725C32.9718 42.8725 33.2801 42.7583 33.5248 42.5348L42.6141 34.0988C43.1244 33.6222 43.1582 32.8206 42.6816 32.3103C42.4454 32.0551 42.1274 31.9207 41.8042 31.9091Z" fill="url(#paint0_radial_209_416)"/>
<defs>
<radialGradient id="paint0_radial_209_416" cx="0" cy="0" r="1" gradientUnits="userSpaceOnUse" gradientTransform="translate(26.3668 24.1488) rotate(75.4955) scale(67.3278 40.5751)">
<stop stop-color="#F5621C"/>
<stop offset="1" stop-color="#D432D6"/>
</radialGradient>
</defs>
</svg>
