<svg viewBox="0 0 304 264" fill="none" xmlns="http://www.w3.org/2000/svg">
<path d="M24.9795 117.683C25.7047 112.833 26.7261 108.284 28.0436 104.035C29.5279 99.8113 31.9756 95.9881 35.3867 92.5654C38.8228 88.9755 43.7812 86.0407 50.2619 83.761C52.247 83.0319 55.0327 82.0805 58.6192 80.9069C62.3725 79.7583 66.1758 78.2751 70.0292 76.4575C73.8825 74.6398 77.1895 72.484 79.9501 69.99C82.9025 67.3537 84.6413 64.2794 85.1665 60.7672C85.5416 58.2585 85.116 55.972 83.8897 53.9078C82.8552 51.7013 81.2453 49.9217 79.0599 48.569C77.0412 47.2412 74.6974 46.3778 72.0282 45.9787C68.0246 45.3801 64.5381 45.8847 61.5689 47.4926C58.7915 48.9581 56.3811 50.8205 54.3378 53.0798C52.4863 55.1968 50.7683 56.9917 49.1836 58.4647L22.1317 32.3624C25.993 25.9293 30.8594 20.7579 36.7311 16.8482C42.6277 12.7713 49.1834 9.98984 56.3982 8.50382C63.8048 6.87549 71.5117 6.65997 79.5191 7.85727C85.8583 8.80513 92.0599 10.6729 98.124 13.4604C104.355 16.273 109.839 20.0853 114.577 24.8975C119.316 29.7096 122.782 35.614 124.976 42.6106C127.337 49.6321 127.817 57.8258 126.417 67.1917C125.817 71.2056 124.908 75.0024 123.691 78.5821C122.473 82.1618 120.78 85.4994 118.612 88.5949C116.635 91.5481 114.087 94.3304 110.968 96.9417C108.041 99.4108 104.554 101.625 100.509 103.585C95.1713 106.207 89.7416 108.302 84.2201 109.87C78.8653 111.463 74.2488 113.252 70.3705 115.237C66.5171 117.055 64.3154 119.803 63.7652 123.483L24.9795 117.683ZM16.0147 182.771L22.1666 141.628L60.9523 147.428L54.8005 188.571L16.0147 182.771Z" fill="white"/>
<path d="M181.065 172.746C183.329 169.133 185.724 165.864 188.25 162.937C190.901 160.087 194.18 157.892 198.088 156.351C202.073 154.685 207.044 154.07 213 154.506C214.835 154.615 217.385 154.825 220.651 155.137C224.04 155.526 227.586 155.667 231.288 155.558C234.99 155.449 238.374 154.881 241.441 153.853C244.709 152.779 247.163 150.934 248.803 148.318C249.973 146.45 250.429 144.48 250.17 142.409C250.112 140.291 249.448 138.314 248.177 136.476C247.03 134.717 245.463 133.214 243.475 131.969C240.493 130.1 237.54 129.29 234.615 129.539C231.893 129.741 229.325 130.388 226.912 131.477C224.701 132.521 222.708 133.354 220.933 133.976L208.453 103.776C213.765 99.9928 219.44 97.564 225.477 96.4898C231.593 95.2911 237.783 95.3537 244.047 96.6775C250.515 97.9545 256.73 100.462 262.694 104.199C267.415 107.158 271.707 110.801 275.57 115.13C279.557 119.537 282.601 124.481 284.704 129.962C286.806 135.443 287.516 141.352 286.832 147.689C286.273 154.104 283.807 160.799 279.436 167.775C277.563 170.765 275.519 173.474 273.305 175.903C271.09 178.332 268.581 180.402 265.778 182.115C263.176 183.781 260.179 185.112 256.786 186.109C253.596 187.058 250.048 187.611 246.144 187.766C240.98 188 235.925 187.782 230.981 187.112C226.161 186.52 221.861 186.341 218.081 186.574C214.379 186.683 211.669 188.108 209.952 190.848L181.065 172.746ZM151.298 221.489L170.501 190.846L199.388 208.949L180.185 239.591L151.298 221.489Z" stroke="white" stroke-opacity="0.7" stroke-width="2.5"/>
<path d="M118.632 132.305L158.432 52L195.305 70.2744L155.506 150.58L118.632 132.305ZM89.9999 190.079L107.561 154.644L144.435 172.919L126.873 208.353L89.9999 190.079Z" stroke="white" stroke-opacity="0.7" stroke-width="2.5"/>
</svg>
