{
	"compilerOptions": {
		"baseUrl": ".",
		"paths": {
			"models": [ "server/sequelize/models" ],
			"db/*": [ "server/sequelize/*" ],
			"bot/*": [ "bot/*" ],
			"server/*": [ "server/*" ]
		}
	}
}