\relax 
\newlabel{tocindent-1}{0pt}
\newlabel{tocindent0}{0pt}
\newlabel{tocindent1}{20.88867pt}
\newlabel{tocindent2}{34.5pt}
\newlabel{tocindent3}{0pt}
\@writefile{toc}{\contentsline {section}{\tocsection {}{1}{Introduction to Surfaces}}{1}}
\@writefile{toc}{\contentsline {subsection}{\tocsubsection {}{1.1}{What is a surface?}}{1}}
\@writefile{toc}{\contentsline {subsection}{\tocsubsection {}{1.2}{Finding surfaces from polygons}}{1}}
\@writefile{toc}{\contentsline {section}{\tocsection {}{2}{The Euler Characteristic}}{1}}
\@writefile{toc}{\contentsline {section}{\tocsection {}{3}{Non-orientable Surfaces}}{1}}
