\relax 
\@writefile{toc}{\contentsline {section}{\tocsection {}{1}{Normalized Mobius Transformations}}{1}}
\@writefile{toc}{\contentsline {section}{\tocsection {}{2}{The Cross Ratio}}{1}}
\@writefile{toc}{\contentsline {section}{\tocsection {}{3}{Constructing Hyperbolic Lines}}{2}}
\@writefile{toc}{\contentsline {section}{\tocsection {}{4}{Isometries of the Upper Half Plane}}{3}}
\@writefile{toc}{\contentsline {section}{\tocsection {}{5}{Measuring Distance in ${\mathbb  H}$}}{4}}
\@writefile{toc}{\contentsline {section}{\tocsection {}{6}{Measuring Area in ${\mathbb  H}$}}{5}}
\@writefile{toc}{\contentsline {section}{\tocsection {}{7}{Introduction to the Poincar\'e Disk}}{6}}
\@writefile{toc}{\contentsline {section}{\tocsection {}{8}{Measuring in the Poincar\'e Disk}}{6}}
\@writefile{toc}{\contentsline {section}{\tocsection {}{9}{Isometries of ${\mathbb  D}$}}{7}}
\newlabel{tocindent-1}{0pt}
\newlabel{tocindent0}{0pt}
\newlabel{tocindent1}{20.88867pt}
\newlabel{tocindent2}{0pt}
\newlabel{tocindent3}{0pt}
