14486475
113281719
31179259
18332701
1079488517296680960
840290766899494912
21918895
2686577107
18151161
25553092
61328496
307110754
28827974
1894696536
110077891
41939206
176591791
10803212
1261176810
566639880
136516871
2592418218
39547783
3293959465
3385974314
42685489
191508694
863200570009468928
226489745
963257679450865664
808940400
1211837761444954120
940141651
278857748
482303768
4165176434
825465942633181185
21676969
174945274
1048937646
19675805
25593151
1497343992
3185650226
459891184
707750310
41256719
257215644
742881387439480833
15434589
243718451
16281175
268570417
34417793
36246574
2836122961
916881841298194433
39575900
618651067
1126627383685959680
1460665236
1088531130079309824
51187221
31460315
733150114630369282
1264832888
191091544
124218845
17205623
3267527156
33157371
467034363
70744212
974290974
878134656893202433
1088106598071918592
2748369072
24179991
86645908
15914039
25459347
805121971927150592
58094352
253566707
1938642649
21677556
17068636
6086642
808366537
840776519135903744
828320209593184256
55305443
707970103
25577860
262238197
184143708
67958500
755870951145824256
932552982
348088164
1060569443380604928
19090238
1611844753
102154462
1218257775563657216
16908965
55019353
3215266905
1963699668
2780639729
22739194
6072622
49370920
31659333
390278440
119399469
563303549
561334028
3016934456
2577604686
1046151790796795904
168579422
977595251232718853
282163142
380362376
253813977
1090503301081092096
3166431056
1165032365501992961
60784487
847956504493907968
1220897281517477889
20697194
23630541
12211422
256891008
20793194
875870027416616961
948224772315459584
68624076
3931240040
816279298449383424
1108382604
16406882
707250006
574777171
16430629
1182858960589582338
16862337
1202329827996557319
217797702
812055913733373952
343830265
13130832
2369254968
122478843
1434938882
52945980
926941724814884864
718949709423845376
402296766
192281782
490481750
43710069
27285121
756357127246086144
2277320160
280278860
18922453
2920946286
1572081600
1222888898
705956740668362752
2958809414
39573154
359394494
4726160594
503629925
986384617379901440
634355996
47467511
829641908
1679568380
31626058
58569413
1009491446
188917178
1132716379394568192
25011698
1092413508392673285
256738835
33242880
22066464
5870242
55598605
76272296
1877899512
14074673
23493697
831352928724148224
24198121
1280615718
2806749695
419874030
52879293
238142166
814256
2885082169
282391825
120345886
42995044
8124952
917431644574777344
18460846
301154829
1678493736
840033158556925952
4775213994
173166384
1126902252763959296
32919037
3281865464
71940079
4777054578
397494228
3171415542
479648825
754304486
768268894096101376
1011941
165190649
1395466700
1011819318
201939627
156510989
588636935
2256068370
200583544
2332642788
28160142
15870403
887009758841982976
136173938
156297464
297234534
125670991
787741
34823266
183486414
2431106934
996171238396579841
132580234
16409970
27051983
45949163
40083126
48409936
117323667
1966060218
799109145135718400
2462773675
218492375
4043272520
795720670948704257
183119223
25479825
2457755340
337162490
31146711
470874666
1241061
54473555
133119156
1242330184172179457
1225053640471113728
15694196
22981658
2226003276
91762778
104650749
165939924
2493377233
755299369
842245697491496960
1105293121
783414040726867968
300507338
162617050
746407044308041728
1861407132
427996787
16636488
6701212
1166313624
1243972825544708096
774694926135222272
179036189
2862097778
268896056
15583095
244230639
168957047
201992341
2278113440
14252406
123100567
451236001
1884921456
907665784289116160
1078379040682127360
106839664
42968623
163712593
1014284426
1065883424
21678230
971140608239677440
739486325267562498
3130699827
670283
278174201
279360708
82978313
878126539900018688
72638046
66021981
43656928
21878577
24031776
44100549
2860753248
1002277005923049472
102159382
235256246
61651535
246124314
939542288
315987111
355016712
621629849
161295171
54729761
17524894
476376748
16169686
273728521
17009937
48221385
14200935
346178217
415169027
2500744478
4132781
17869695
24313541
1029032510196342785
18414209
19740601
383560270
608431440
1317795355
237558789
28515519
51918315
1447256300
859635552823508992
136773183
548745842
189775236
1067254987
208892195
14976199
780558707285372928
99033899
21677778
1059004558762897408
309277121
244359625
298235167
234256750
441111997
139223954
547661012
848697742536749056
67417898
1010715098640310272
29115723
1035335328230342657
80228911
9866582
17958063
2978577399
17862167
1211435436784046080
188185604
9832392
7802332
55670439
221222372
29784882
112064061
820211
484966631
768231463
2722784207
345270269
2288570768
1064636165716828160
1227707380659437568
548012815
24915007
389840958
415132609
878908151126347776
24792799
19687100
73052759
74067662
25252261
3408515621
4776908468
1124139399929679872
385214729
246545786
125242665
1365548586
743421390632587264
4684974932
24031191
1223322488266018816
161304886
28897250
425618204
311569092
331810470
63820326
1212213902089437184
711787947226324993
90468793
3225735223
15120379
2582482212
14066988
828774937640841216
151569542
127137318
909482856
36575013
3000416193
1112410934100688896
40893639
2638846006
41272483
251285354
347605517
4436271613
15338525
24847102
197592922
46402897
48015036
133389654
1410564194
796467886004977664
38249988
1243583136014843904
14458130
931999091856351232
591945577
784126904622252033
704131078794006528
5435752
3281836020
105080019
27857455
1955164374
2307952147
14049120
1024453698460831744
4755647138
95076291
20945637
19738093
102892579
4579610352
1123467705280094214
74652129
1227433595649658880
356626419
2187604723
151960055
4090121713
37814372
112506642
3069125996
21982219
261784185
205467950
43596785
48903219
224089045
43066993
2153688540
4319895761
759133579901231105
914982235
14871593
43817934
985990007449051136
14689808
794757409055064064
1358411360
20205033
907797712577339392
672453
2878998373
38022214
2352080748
285995155
391664487
1224409077813370880
7054452
15242006
540789120
873221011390439424
357199011
619620603
24810379
48105879
2969600214
502281793
55330379
348783422
473534351
874150523196264448
942090604334399488
75908357
14997696
1194796432441528320
716444474746937346
1009822942769963008
386758844
48620592
319935930
23328016
2935501164
1238258177109417985
1938051464
15567438
392560293
35468643
575507092
451919406
47729279
42048168
182091200
223596351
437224769
261072166
24972810
58568552
2798121
2200533084
225253142
29472631
809334
20459890
41165591
1285093454
34730608
21250667
40401353
308016107
396699770
144882638
37825128
88073679
14901382
891749858721136640
394829664
32677236
35921352
4852057880
16940577
574028972
757849410625601536
454586852
20422772
2297118853
36734669
1717239194
1562104213
251660478
92142601
2385468954
262900623
13077282
1689267644
14345985
19407682
23519114
46754296
26323778
3021688267
29327559
23110271
1119178157553094657
44256414
23033882
1104976700
752210585832394752
613990806
574102508
3107681
325354251
820834657
995081757304090628
29819963
53531699
1052274315691929601
97830944
3119371532
620269470
18985012
3730447096
192812670
958954924280233985
21106227
2849283373
26819734
814964269502566400
2937372685
262289214
876033798
21677374
296624581
419817522
235306013
195173160
33359627
536751146
261871505
46223987
15217444
312906679
1073857356511961089
399144740
154417403
181320811
4157759232
809169966268170240
308770103
174054951
5901882
1363407650
2361749558
19434340
145823817
52332878
56432409
1072787540
954476010082316288
27829803
34285278
3114863533
356930534
79383395
28627016
1894603867
2656999848
73187189
134009885
16023551
401995370
49833362
2400205177
1255657104
2651804868
3036830234
33702656
15591691
381128281
37074771
999005831499726849
15920224
568425674
426464786
2548481887
3314666034
2335654825
157148702
47455481
1100505035920699392
36744198
915992269
1182690130152189952
2719885009
1655625060
405370997
726095807783395328
1159446284
1072128754716004353
2246528070
14778983
2680621724
811677653824483328
373390373
953205052146987008
989205512
778365587214913537
59920681
257129000
37318372
19387701
16431051
38285212
70513710
20859835
1155766531
20417273
1007719123940327424
836771571578523648
2444863818
978785763344072705
2922095048
43221517
272760374
20405932
1058612846861344768
44456513
633299825
876510791121473536
491606263
871899643050840066
41605424
14237427
297760065
23989688
81913948
18281639
179165194
14873762
1078649546090078208
741921157
709307965
16820073
19217514
301779649
74135652
348585713
27178280
8700052
397762145
23496049
438135592
3145462317
30239216
822658154
360199581
37669317
1320628884
2838662370
257786680
225298030
2414949434
1082770901039378433
1611242672
636524188
3268382246
14367039
543959014
2939994601
18571972
60799480
1131011879197859840
3595013953
24474870
13836112
559020932
44225619
961759332
602054156
35996786
3037305211
159316065
314359171
88560082
28435611
345049077
284171427
17631851
2671924165
29232306
46404527
44485369
341114799
317357561
430292192
78364777
15662348
4894657202
584534918
930011209
1397778692
2191735970
88438155
785212344280371200
359469773
804783
14949092
2259839558
835909392759468032
3258362570
29804741
129604654
31253361
1373455266
3372345653
89669403
380930182
335760943
25759654
44036458
3006205325
139856392
160100486
321200470
14759210
18360685
17531532
875097145577099265
343833831
21887115
306050989
62970411
764941525142818817
25408265
181075395
67069157
75324165
1431708882
456405060
996316110
152796170
16971361
14138004
825597805754322944
1115769377062670336
1265183029
66782883
16896459
15499416
250425011
96886316
10376902
2960020896
1219872478576594950
735327351266004993
2263138842
4416954257
14453338
132338197
16080769
47538678
6479502
819572
14739872
16064299
431833585
162168686
946303264319946752
1161354795585814529
24320014
82784702
1072125081390850048
975775062405005317
292035654
854435329515806720
93072528
1018130715563573250
3379037548
733562123343650816
2383339537
531883652
15464222
138195380
509113202
14572270
2472107832
4706206032
16905634
276309936
2822447833
316926964
293637481
59171814
792824653
86976298
25219975
214308128
1119213160060325890
3310710631
297513894
103672408
103716805
71025071
38570299
70234523
60405853
129939630
257183999
267619079
18921383
153462280
3995415685
16851471
915739759
87232485
282796006
23501594
222356933
892441
85386596
723191113
476338341
41977606
2321017560
45516796
801249609817333760
3767245333
1686390032
215005398
936180233606111232
2929003448
836874133
14801494
130998566
1226113477850193922
23798064
722875947020496896
834999492504137732
338709511
14464231
506095282
23380704
91261468
800444118056828928
2958556567
271718389
19553905
22373570
44401678
3096885534
1051165158158921728
243816968
35260072
1132761151782080513
18567710
902376787350454272
3238232202
1246691125647142914
36957121
2317506393
1658205492
14361425
4786671314
177213969
619585640
20657526
302504188
60920735
90558247
55733752
1636128680
868478848496680964
189425431
47130042
69074285
44867825
2431090308
54447215
2897817762
260986509
479136683
3265218919
883045786598035456
461819702
15966807
41819553
2225820025
1736007510
363413546
2849287937
22712560
702146683
575836183
16336820
861446288
887144389
148890748
223978260
723543476
940361702645706752
743133861396127744
2454266940
1873080289
40054657
16211335
16032276
24462442
10543742
984564167217565696
278899384
952260907391954944
14686829
48443
57564238
2763742186
25958025
4731244033
15111497
292107236
2269332553
14256647
444100616
1011373709330808832
1798056836
825384387508211712
19518312
619703312
28362892
36979591
806863640
24723402
2436538807
1385386220
172122369
8627002
80681337
16855053
307085593
36830827
630790777
58541953
12034052
16211416
23255685
980957976201580546
4212625263
825391629158670338
622663
19393571
438557041
766313115919220736
935904220795961344
15161313
28682006
245011518
2514364009
20296172
30906832
234481739
89277846
20815946
485678340
1084946563896496129
15241037
233228126
429626138
24139578
41320322
23238613
590543101
907330270621188096
274524683
12711452
5705612
1394948678
210628712
16880081
188819754
19272456
1132804697876643842
2885556724
23280932
14620891
31198756
26546519
1188937927838982144
18008231
859089324
30386538
15908105
15010785
28765538
1141166190
79072266
493577740
77883678
14922622
20064323
818032049009197056
104283645
245970374
715195495749001216
3368155624
23374755
22212186
880819122925326336
2334203670
25340809
30338261
96483185
1115487949
2329311103
1143947142655905792
43370818
1078104224951545859
21231879
124352791
23039017
237405718
19619929
366751684
625827914
390821801
40994984
2450370409
36544046
84729970
3225566360
4875901518
1099023707081629697
2838752721
51752487
3923714249
16671196
15212936
758230218863546368
357665776
754789898780020736
21735916
1559315328
4860443294
356497801
1944793170
30107921
18538878
3241647217
2737367525
2249515813
273248631
193575228
47945590
16220033
907072490
897750870569254912
2513386116
75381740
21909206
174308054
11616342
1214425836180258819
56209297
959354642177048576
809560093272354817
73205230
26825928
57625285
49671045
1470293042
41527198
325834334
117951190
175184699
26662362
3179529367
23014940
336701474
602299791
1085995043763015680
21772420
2411528876
260882190
1852860234
14561508
2278090848
1562317668
132391384
30156748
23006156
25217981
17193556
3324526273
561580657
329091899
180550481
131326039
161342062
858364545915527168
14416035
319901933
349816283
4855956676
1094303108
526594929
2256056618
19927980
192134856
20212416
1476251244
299338176
16152690
34088729
2703201
35748781
20339205
30544478
19174949
634170943
131087290
776596967073853440
808793136650747905
1641751748
4325211140
314212121
4217562141
924750320353230848
1943084185
18966291
20575136
1191614993004990467
4230222555
29204225
1522654760
107103426
23222077
824177202375917568
773026209584205824
109655627
22590521
895356276
16673990
2467114141
331092512
16754212
195327771
52873382
5048501
1156072484845711360
259460460
733873606183133184
17140862
110266201
37544478
266068196
306463330
572936932
1093913252
794698267888152577
1035255994664636417
1233222637603573760
980559075795615744
4735666364
948732980591120384
239211388
2984836088
851518229637771264
61920250
1182059749015085056
101422747
1003715456484630528
776944944334245888
497349066
1217899589933531136
73448580
2294664422
12370832
1042535073382203392
1431234685
32992963
16387224
729342240011640832
827322789036056576
3004247345
444175983
90123764
264439294
19384564
25067967
776964891357749248
19879658
312087343
783142675478351872
1684257990
147275174
1034474302643433472
17491992
524930452
16945762
17411275
415059662
16237454
97233662
17141177
13488282
903060110
962062289649115137
282697203
2891989321
2193394922
28567212
247070445
155265502
131174386
1652821
25382647
2232383077
2371221583
1214321444223672322
42944071
24705007
372369336
18081592
4842841664
14101093
14050879
3242318352
45632103
24025916
8650012
1164532818
37362694
39550686
12581782
4466075238
787533
18297407
19304996
14053086
897655534232289282
17331051
42815955
259987482
479671116
1125129444119572480
796135041180921856
29935285
17910091
14376921
15402538
1222608686050209792
2310803053
112094342
89318473
940373230207905792
739722004316577793
427731286
277814149
840800872841924608
2871963541
1108873985855381504
104023458
1026962324119150592
29238696
2649886530
52253024
2721442241
865307294719819776
359595706
4722147913
4916681190
373506182
637452801
1705494205
3303724202
960923246341234688
30185829
503846483
2176525310
2244175498
779842838594883584
145006611
755982859098132480
1653899066
1869835596
102814221
16364913
31062573
31553533
2152762868
125433303
291924552
18148299
274164936
2434905853
406706503
33650211
17227205
2295070069
234084938
392235487
27325588
508174181
166746503
33803862
2324455916
22790755
128771453
187716688
845041529534251008
218755929
22813251
88819410
4834551
469405735
42256572
182195977
1213366589946359808
168937107
1390960392
353918621
306004325
876498054227959808
75175434
992146299934789632
452728880
497296988
2393009370
1289626088
1712051
1158987710570254336
50484773
818820962
30900466
48771392
21653643
64658860
1235287711344287744
706000960338808832
17504707
21492562
800568991
48640145
18412927
22928119
83752002
3223743871
809442370987048961
64502593
2968060707
4730195934
91243723
9790942
717915790989615105
16454713
16507700
3031592224
76592378
1193364785049427969
1408731096
22529891
1320954858
1225223786
11918832
1212200517469761536
20570396
1058382904370257920
3267394015
14220283
1643715373
813851879486541824
23684428
2339838175
1067948028416294912
192261025
447813931
1037833822417633280
18178603
1964791
8248752
28058517
164137911
1489077540
95541172
292719867
633044327
551606289
345805766
1249821662
44466045
357915696
606559441
41305608
69696928
441592357
2816806055
270657895
872617719107014657
1157154595711250432
847923787
3307140511
243438815
7362292
776910020067733505
34743564
2990501192
41776062
2269549556
1730167526
1856265590
49443839
11275422
15921597
1158435004688392192
98424823
14858262
153170981
356411857
21708922
382695072
431177226
170389766
61226044
2959131944
3974809518
162957220
1907009850
16180905
46457075
22868145
121951435
29558030
2570132760
45907028
1032059735548157952
950306284036747265
23013051
701323467
199074155
36772968
321612832
105946678
634067921
838491840126971904
16935297
10021212
102920659
16249636
1027681907092254722
173640957
50903100
19751223
1011308417812582400
154522005
1436561070
190510352
442867083
103102517
448174554
2202066812
371979226
2994125767
271265482
1155483182
251782737
37115239
779173809551134720
73455213
975465620
177812990
9556072
31000457
50521842
1582302686
15717363
4759781688
55142789
774129164
119696258
6562292
8543262
18618275
2855147528
39461439
2806056666
413584813
1059013469213577216
16423423
79578507
1167985279
757440302181257216
22416031
130590426
101449578
49410204
1086722985224859649
751142885555367936
43713188
1644481266
2834546730
37804799
274774669
16446196
715689761520750592
359792950
1185605089907503104
231316288
2362231152
1071311009317449728
1072409014498025472
8171882
217891176
21246860
223337216
1207330293268406273
16152895
34977985
2588390400
195934431
145809444
801341077961773056
257009917
554007074
260597671
19259235
20446718
27145240
1201296966279254016
14054674
22292430
735894979243974656
3195616740
330876678
16470623
330121721
1206954716
263451949
1125222291627843584
782355438557802496
2312938957
59315587
3408990753
23994049
131922167
317340522
24595113
317415836
12743612
1097209283618398210
1108246195
840163803811594241
767523158136123392
583495381
26827153
22114934
46503714
2839555038
2477689538
527727710
8135682
72710464
2406635598
917605651102146560
144360747
35380114
20731262
487878764
842221339
764907332195143680
1289592086
14159285
15745855
791343797380579328
372910226
18563498
1010630140437512192
244256561
152735729
3164520132
18642786
24165112
185722784
540916751
526915887
124954284
180941026
1419845912
363807127
2169568225
16595837
15226286
17491207
2856156751
30628216
24062093
11326422
14288934
4704801806
280314073
139269735
17181889
8667392
15499345
160399136
53320448
349967181
1721640968
534929566
793557462
358610868
24137812
324756284
294297318
1162091936397664256
254162335
6240342
3973937112
54658106
117332996
776621741170917376
2328295165
14985654
23707043
1054686447154868224
2536392097
25422124
718207903
34410828
1931479308
834490302572400641
151507282
17333650
1542566923
491498511
21339701
41694302
3606051617
458957282
19280653
154757564
138936040
17110718
75849081
19685518
19546907
838841790773940228
2307176204
18957343
95295536
822446718897811456
84998545
105821346
3254845206
2561594780
841058902628220928
23862512
15182652
299928369
39364787
754533
69618874
1185768745165193216
1416419070
484229559
3010458290
3283156574
55196469
564919100
113102542
2424857018
9213042
509640772
24795283
20870919
365313112
4283996293
16353059
21839697
2550925232
831736848452091909
19136564
18948615
1068688580
1881583068
46108384
1287497760
22207938
124181508
125691129
14857950
14446481
421564472
1182064566806577152
878980541676171265
964325258
890681
12764572
90988497
3015573747
8111352
27376256
42142075
16493367
11356312
24586494
22494499
898612383169388544
73998671
28520452
224516802
43709923
14135009
63009001
248693707
401112297
2884038263
1325793967
20266767
256755958
1174921323069329408
464842784
16388369
916386489923141632
621759091
996229215929356289
25754863
14254344
3420584352
7062302
113402418
883524502453354498
141136290
1182915223478386690
46111819
233857829
15142209
488132175
260984849
536600339
232599240
81013661
16392447
760483552815448066
1179426535100616705
758078398950367232
110277586
19478463
1135878061
165614174
17655771
218670058
109610344
1191413367400873984
229494997
21326684
1395579870
37214090
27576622
22797633
89006266
20576183
49461367
16998925
850809928977481728
581206652
21932721
41539945
13258472
636574018
21020425
897943891831209984
635063498
47552835
173695127
468883442
27898953
492723203
14115073
49065227
268157763
318617403
49785781
22447184
67702639
19392431
1551966481
2325702300
2897256318
1088283280573517824
10100322
35620186
44174767
1499636593
123330000
22428489
2211645378
866485205212823553
89372253
348308412
1170385797700149248
2650124961
775015920028770304
17188524
62576457
6265022
40655642
1708921837
784076979800772608
708132755423551488
960313742813622272
321200796
223187275
1236374673958391808
63658314
1179450059521478657
40811110
23179623
7921752
126553708
30317657
711953
461880287
49093
27176569
952589665
1027793150
1019277050
2281446812
811283336328978432
1206942061
363314177
1194893102
707350496793591808
202505198
26870452
773599908699963393
400911239
2337795474
14219416
112019267
718722090
24084550
23718831
1136048742585556993
947772745458339840
348278208
741147255810445314
381275767
2428658474
2200914638
206148801
317993873
149292728
356620946
106303320
15790545
4777288226
41500166
45648804
11926632
1532530117
4818496612
46474432
46754894
17047982
141602730
972952152
110555078
15965271
2865377671
1184282932053078016
61824513
1083122830970114048
27188836
18964949
21996327
2121691
236355184
68196786
823621436002734081
22026385
255542587
16194427
2211273342
27345252
23731934
1122900903629950979
1689464822
28674183
65411847
1409425651
224777282
38814604
51838401
14308607
11632672
714114918086262784
1023332110239555584
289141749
329981029
1080706950172631040
3223841797
1410693758
2212231
25553428
2363352006
925536827204702208
26708514
777555686
25347859
4323262702
3300778986
28120233
