{"code":200, "result":true, "message":"処理が正常に終了しました。", "totalHits":223,"totalPage":2,"currentPage":1,"count":111,"record":[{"packageId":"i.BlossomsAnimationForHT", "appName":"Blossoms Animation", "developerName":"Animations for HeadTracking", "developerId":2184, "category":"Entertainment", "price":"JPY 100", "targetDevice":"1"}
,{"packageId":"i.FlowersAnimationForHT", "appName":"Flowers Animation", "developerName":"Animations for HeadTracking", "developerId":2184, "category":"Entertainment", "price":"USD 1.00", "targetDevice":"1"}
,{"packageId":"i.CreaturesAnimationForHT", "appName":"Creatures Animation", "developerName":"Animations for HeadTracking", "developerId":2184, "category":"Entertainment", "price":"USD 1.00", "targetDevice":"1"}
,{"packageId":"i.VinesAnimationForHT", "appName":"Vines Animation", "developerName":"Animations for HeadTracking", "developerId":2184, "category":"Entertainment", "price":"USD 1.00", "targetDevice":"1"}
,{"packageId":"i.TipisAnimationForHT", "appName":"Tipis Animation", "developerName":"Animations for HeadTracking", "developerId":2184, "category":"Entertainment", "price":"USD 1.00", "targetDevice":"1"}
,{"packageId":"i.BasketsAnimationForHT", "appName":"Baskets Animation", "developerName":"Animations for HeadTracking", "developerId":2184, "category":"Entertainment", "price":"USD 1.00", "targetDevice":"1"}
,{"packageId":"i.BeadsAnimationForHT", "appName":"Beads Animation", "developerName":"Animations for HeadTracking", "developerId":2184, "category":"Entertainment", "price":"USD 1.00", "targetDevice":"1"}
,{"packageId":"a.TourismMachine", "appName":"Tourism Machine", "developerName":"JMOTIL", "developerId":2155, "category":"Business", "price":"0.00", "targetDevice":"1"}
,{"packageId":"jp.co.s_science.ngt.android.movexplorer", "appName":"MovExplorer", "developerName":"System Science Co.,Ltd.", "developerId":51, "category":"Business", "price":"0.00", "targetDevice":"1"}
,{"packageId":"com.vrvu.superpowers", "appName":"VRVU Brand Recognition ", "developerName":"VRVU", "developerId":3072, "category":"Business", "price":"0.00", "targetDevice":"3"}
,{"packageId":"com.speaktoit.assistant", "appName":"Assistant", "developerName":"Speaktoit, INC", "developerId":3106, "category":"Life Style", "price":"0.00", "targetDevice":"3"}
,{"packageId":"at.itsdone.carrera", "appName":"CARRERA 4.0", "developerName":"ITSDONE GmbH", "developerId":3114, "category":"Entertainment", "price":"0.00", "targetDevice":"1"}
,{"packageId":"com.pekopoko365.tinvr", "appName":"TinVR", "developerName":"PekoPoko365", "developerId":743, "category":"Entertainment", "price":"0.00", "targetDevice":"1"}
,{"packageId":"jp.co.dnp.cio.panoar", "appName":"360°見渡せる画像ビューア", "developerName":"大日本印刷株式会社", "developerId":366, "category":"Entertainment", "price":"0.00", "targetDevice":"1"}
,{"packageId":"com.ama.eye_sports.epson", "appName":"Eye Sports", "developerName":"Advanced Mobile Applications Ltd.", "developerId":1254, "category":"Games", "price":"USD 3.99", "targetDevice":"1"}
,{"packageId":"br.com.marketingaumentado.montar", "appName":"montAR", "developerName":"Marketing Aumentado", "developerId":2521, "category":"Business", "price":"0.00", "targetDevice":"1"}
,{"packageId":"com.vrvu.room", "appName":"VR Architecture Walkthrough", "developerName":"VRVU", "developerId":3072, "category":"Business", "price":"0.00", "targetDevice":"3"}
,{"packageId":"br.com.eruga.goldenmystery", "appName":"Golden Mystery", "developerName":"Eruga", "developerId":3056, "category":"Games", "price":"0.00", "targetDevice":"3"}
,{"packageId":"com.vrvu.demo", "appName":"Bread VR", "developerName":"VRVU", "developerId":3072, "category":"Games", "price":"0.00", "targetDevice":"1"}
,{"packageId":"com.augumenta.demo.scot", "appName":"Augumenta Virtual Surface Demo", "developerName":"Augumenta", "developerId":1834, "category":"Libraries & Demo", "price":"0.00", "targetDevice":"3"}
,{"packageId":"sg.t05.covis", "appName":"CoVis", "developerName":"T05 Technologies Pte. Ltd.", "developerId":3032, "category":"Games", "price":"0.00", "targetDevice":"3"}
,{"packageId":"com.spinar.whackamonster", "appName":"Whack A Monster", "developerName":"Spin Realidad Aumentada", "developerId":2412, "category":"Games", "price":"0.00", "targetDevice":"1"}
,{"packageId":"com.playerliz", "appName":"Player Liz", "developerName":"segongmobile", "developerId":2970, "category":"Media & Video", "price":"0.00", "targetDevice":"3"}
,{"packageId":"a.RingsAnimationForHT", "appName":"Rings Animation", "developerName":"Animations for HeadTracking", "developerId":2184, "category":"Entertainment", "price":"0.00", "targetDevice":"1"}
,{"packageId":"a.SetupAnimationForHT", "appName":"SetupAnimationFor HeadTracking", "developerName":"Animations for HeadTracking", "developerId":2184, "category":"Entertainment", "price":"0.00", "targetDevice":"1"}
,{"packageId":"com.spinar.asteroidfighter", "appName":"Asteroid Fighter", "developerName":"Spin Realidad Aumentada", "developerId":2412, "category":"Games", "price":"0.00", "targetDevice":"3"}
,{"packageId":"com.wear_mobile.marko", "appName":"Marko: Next Generation Manual", "developerName":"weAR", "developerId":572, "category":"Business", "price":"0.00", "targetDevice":"1"}
,{"packageId":"by.ai91.lyfoes", "appName":"Lyfoes", "developerName":"Anar Ibragimoff", "developerId":1741, "category":"Games", "price":"0.00", "targetDevice":"3"}
,{"packageId":"com.cerevrovi.CookieDefenseARLite", "appName":"Cookie Defense AR Lite", "developerName":"CEREVROVI", "developerId":1090, "category":"Games", "price":"0.00", "targetDevice":"1"}
,{"packageId":"com.cerevrovi.dragonForcesARLITE", "appName":"Dragon Forces AR Lite", "developerName":"CEREVROVI", "developerId":1090, "category":"Games", "price":"0.00", "targetDevice":"1"}
,{"packageId":"com.cerevrovi.dragonForcesAR", "appName":"Dragon Forces AR", "developerName":"CEREVROVI", "developerId":1090, "category":"Games", "price":"USD 2.00", "targetDevice":"1"}
,{"packageId":"com.sharedsight.screenshare", "appName":"ScreenShare", "developerName":"Sojournify, LLC \/ Patrick Seeling", "developerId":1977, "category":"Business", "price":"0.00", "targetDevice":"1"}
,{"packageId":"com.lomchevak.youtube3d", "appName":"YouTube 3D Video Player", "developerName":"Rejen BV", "developerId":2596, "category":"Media & Video", "price":"0.00", "targetDevice":"1"}
,{"packageId":"com.augumenta.demo.truckster", "appName":"Augumenta Gesture Demo", "developerName":"Augumenta", "developerId":1834, "category":"Libraries & Demo", "price":"0.00", "targetDevice":"3"}
,{"packageId":"com.zgames.deadlandz", "appName":"Deadlandz", "developerName":"zGames", "developerId":2698, "category":"Games", "price":"0.00", "targetDevice":"1"}
,{"packageId":"com.prefrontalcortex.experimental.daskalos", "appName":"Dáskalos", "developerName":"prefrontal cortex", "developerId":2296, "category":"Entertainment", "price":"0.00", "targetDevice":"1"}
,{"packageId":"com.modelcraft.demo", "appName":"Modelcraft Demo App", "developerName":"Modelcraft", "developerId":2635, "category":"Libraries & Demo", "price":"0.00", "targetDevice":"3"}
,{"packageId":"pekopoko365.egasane", "appName":"EGASANE 2", "developerName":"PekoPoko365", "developerId":743, "category":"Life Style", "price":"0.00", "targetDevice":"1"}
,{"packageId":"com.funkywhalegames.beeinvasion", "appName":"Bee Invasion 3D", "developerName":"Funky Whale Games", "developerId":1446, "category":"Games", "price":"USD 2.99", "targetDevice":"3"}
,{"packageId":"com.mdtv.moveriotablet", "appName":"Wi.TV for Moverio", "developerName":"TELE System Digital srl", "developerId":2421, "category":"Media & Video", "price":"0.00", "targetDevice":"3"}
,{"packageId":"spinarplus.uisample", "appName":"Sphero Controller", "developerName":"Spin Realidad Aumentada", "developerId":2412, "category":"Entertainment", "price":"0.00", "targetDevice":"3"}
,{"packageId":"com.spinarplus.shooter", "appName":"GhostHunterAR", "developerName":"Spin Realidad Aumentada", "developerId":2412, "category":"Games", "price":"0.00", "targetDevice":"3"}
,{"packageId":"br.com.marketingaumentado.equipAR1", "appName":"equipAR", "developerName":"Marketing Aumentado", "developerId":2521, "category":"Entertainment", "price":"0.00", "targetDevice":"3"}
,{"packageId":"com.illusions.ElementRush", "appName":"Element Rush", "developerName":"ETC-Illusions", "developerId":2494, "category":"Games", "price":"0.00", "targetDevice":"1"}
,{"packageId":"com.PekoPoko365.st_rangefinder", "appName":"Mokusoku", "developerName":"PekoPoko365", "developerId":743, "category":"Entertainment", "price":"0.00", "targetDevice":"1"}
,{"packageId":"jp.co.yahoo.android.ybrowser", "appName":"Yahoo!ブラウザー", "developerName":"Yahoo Japan Corp.", "developerId":101, "category":"Life Style", "price":"0.00", "targetDevice":"1"}
,{"packageId":"com.kenargo.djiultimateflight2", "appName":"DJI Ultimate Flight", "developerName":"Kenneth A. Argo", "developerId":2235, "category":"Drone", "price":"0.00", "targetDevice":"1"}
,{"packageId":"com.MerlinMobility.VisualizingTheFuture", "appName":"Visualizing the Future", "developerName":"CN2 Technology", "developerId":2331, "category":"Business", "price":"0.00", "targetDevice":"1"}
,{"packageId":"com.arcortex.eveappmonovuforia", "appName":"EVEREST", "developerName":"EVE", "developerId":2338, "category":"Games", "price":"0.00", "targetDevice":"1"}
,{"packageId":"jp.co.hoseisd.smdlab.tekkyuar", "appName":"TekkyuAR", "developerName":"SMDLab", "developerId":771, "category":"Games", "price":"0.00", "targetDevice":"3"}
,{"packageId":"com.terzalo.kozzmozz", "appName":"KoZZmoZZ", "developerName":"XLazz", "developerId":400, "category":"Games", "price":"0.00", "targetDevice":"3"}
,{"packageId":"com.cerevrovi.CookieDefenseARM", "appName":"Cookie Defense AR", "developerName":"CEREVROVI", "developerId":1090, "category":"Games", "price":"USD 1.00", "targetDevice":"1"}
,{"packageId":"com.cerevrovi.CookieDefense", "appName":"Cookie Defense", "developerName":"CEREVROVI", "developerId":1090, "category":"Games", "price":"0.00", "targetDevice":"1"}
,{"packageId":"com.cerevrovi.AR3DBCards", "appName":"AR 3D Business Cards", "developerName":"CEREVROVI", "developerId":1090, "category":"Business", "price":"0.00", "targetDevice":"1"}
,{"packageId":"com.awindinc.receiver", "appName":"MirrorOp Receiver", "developerName":"MirrorOp", "developerId":2279, "category":"Business", "price":"0.00", "targetDevice":"3"}
,{"packageId":"com.kiodev.movienight", "appName":"Movie Night", "developerName":"Kelly Shuster", "developerId":2201, "category":"Entertainment", "price":"0.00", "targetDevice":"1"}
,{"packageId":"com.inSight.Telepresence", "appName":"Telepresence", "developerName":"inSight AugMedicine", "developerId":1140, "category":"Business", "price":"0.00", "targetDevice":"1"}
,{"packageId":"com.arcana.augmentedrealitycalculator", "appName":"Augmented Reality Calculator", "developerName":"Arcana Studio Inc.", "developerId":2251, "category":"Life Style", "price":"0.00", "targetDevice":"1"}
,{"packageId":"com.asukalab.eyetrace", "appName":"Eyetrace", "developerName":"AsukaLab", "developerId":368, "category":"Life Style", "price":"0.00", "targetDevice":"1"}
,{"packageId":"com.imaginarycomputer.TERMINUS", "appName":"TERMINUS", "developerName":"Imaginary Computer", "developerId":361, "category":"Games", "price":"0.00", "targetDevice":"3"}
,{"packageId":"net.dixq.talkshiyo", "appName":"トークしよ！[話題提供アプリ]verミク", "developerName":"重光真", "developerId":1127, "category":"Entertainment", "price":"0.00", "targetDevice":"3"}
,{"packageId":"com.KSFLLC.AgriAR", "appName":"Agri-AR", "developerName":"合同会社ＫＳＦ", "developerId":2003, "category":"Business", "price":"0.00", "targetDevice":"1"}
,{"packageId":"com.pekopoko365.interval_st_camera", "appName":"TOUSHA", "developerName":"PekoPoko365", "developerId":743, "category":"Life Style", "price":"0.00", "targetDevice":"1"}
,{"packageId":"com.KSFLLC.SmartGrid", "appName":"SmartGrid", "developerName":"合同会社ＫＳＦ", "developerId":2003, "category":"Games", "price":"0.00", "targetDevice":"1"}
,{"packageId":"com.thingstone.seer", "appName":"Seer", "developerName":"ThingStone", "developerId":298, "category":"Entertainment", "price":"0.00", "targetDevice":"3"}
,{"packageId":"jp.co.crestec.timebatterywidget", "appName":"TimeBatteryWidget", "developerName":"株式会社クレステック", "developerId":228, "category":"Life Style", "price":"0.00", "targetDevice":"3"}
,{"packageId":"fi.advice.epson", "appName":"Advice3D for smart glasses", "developerName":"Advice Ky", "developerId":1711, "category":"Business", "price":"0.00", "targetDevice":"3"}
,{"packageId":"com.wotakuro.defShooting", "appName":"Magical Defender", "developerName":"Yusuke Kurokawa", "developerId":469, "category":"Games", "price":"0.00", "targetDevice":"3"}
,{"packageId":"com.Macron.Gcopter_bt200", "appName":"G-Copter Gesture", "developerName":"Macron", "developerId":799, "category":"Games", "price":"0.00", "targetDevice":"1"}
,{"packageId":"com.augumenta.roshamboreloaded", "appName":"Roshambo Reloaded", "developerName":"Augumenta", "developerId":1834, "category":"Games", "price":"0.00", "targetDevice":"1"}
,{"packageId":"com.Company.Space", "appName":"Space Shooter", "developerName":"Droiders.", "developerId":1667, "category":"Games", "price":"0.00", "targetDevice":"1"}
,{"packageId":"com.xlazz.stereoalbum", "appName":"3D-Photos:Russo-Japan War 1904", "developerName":"XLazz", "developerId":400, "category":"Entertainment", "price":"0.00", "targetDevice":"1"}
,{"packageId":"com.anmipo.android.coloramplifier", "appName":"Colorizer", "developerName":"Andrei Popleteev", "developerId":1396, "category":"Life Style", "price":"0.00", "targetDevice":"1"}
,{"packageId":"com.webfarmer.scouter05", "appName":"Power Scouter", "developerName":"株式会社ウェブファーマー", "developerId":1452, "category":"Entertainment", "price":"0.00", "targetDevice":"1"}
,{"packageId":"jp.co.hoseisd.smdlab.artetrican", "appName":"ARTetriCAN", "developerName":"SMDLab", "developerId":771, "category":"Games", "price":"0.00", "targetDevice":"3"}
,{"packageId":"com.dji.vision", "appName":"DJI VISION", "developerName":"DJI TECHNOLOGY CO., LTD", "developerId":765, "category":"Drone", "price":"0.00", "targetDevice":"3"}
,{"packageId":"com.shadurin.arpiano", "appName":"ARPiano", "developerName":"Ihar Shaduryn", "developerId":1466, "category":"Entertainment", "price":"0.00", "targetDevice":"1"}
,{"packageId":"com.google.android.stardroid", "appName":"Sky Map", "developerName":"Fissure Creations", "developerId":289, "category":"Entertainment", "price":"0.00", "targetDevice":"3"}
,{"packageId":"com.bruhanov.NoSafePlace", "appName":"No Safe Place", "developerName":"Roman Bruhanov", "developerId":1465, "category":"Games", "price":"0.00", "targetDevice":"1"}
,{"packageId":"com.bruhanov.GyroCar", "appName":"GyroCar", "developerName":"Roman Bruhanov", "developerId":1465, "category":"Games", "price":"0.00", "targetDevice":"1"}
,{"packageId":"com.imaginarycomputer.BreakBreak", "appName":"BreakBreak", "developerName":"Imaginary Computer", "developerId":361, "category":"Games", "price":"0.00", "targetDevice":"3"}
,{"packageId":"com.ScopeAR.ScopeARassist", "appName":"Scope AR Demo", "developerName":"ScopeAR", "developerId":362, "category":"Libraries & Demo", "price":"0.00", "targetDevice":"1"}
,{"packageId":"com.qualcomm.QCARUnityPlayer", "appName":"Augmedicine Demo", "developerName":"inSight Augmented Medicine", "developerId":1282, "category":"Libraries & Demo", "price":"0.00", "targetDevice":"3"}
,{"packageId":"com.nuance.nmdp", "appName":"SpeechTrans Ultimate Assistant", "developerName":"Yan Auerbach", "developerId":1098, "category":"Business", "price":"0.00", "targetDevice":"3"}
,{"packageId":"com.hiro014.jp.StereoscopicViewer", "appName":"Stereoscopic Viewer", "developerName":"milmakeg", "developerId":766, "category":"Entertainment", "price":"0.00", "targetDevice":"1"}
,{"packageId":"com.example.slideshowdemo", "appName":"Fieldbit SlideShow", "developerName":"Fieldbit Ltd.", "developerId":1250, "category":"Business", "price":"0.00", "targetDevice":"1"}
,{"packageId":"peacemaker.bebacklight", "appName":"BeBack Light", "developerName":"Peacemaker", "developerId":1187, "category":"Entertainment", "price":"0.00", "targetDevice":"1"}
,{"packageId":"by.rndmobile.activity", "appName":"RealTrails", "developerName":"RNDMobile", "developerId":1023, "category":"Entertainment", "price":"0.00", "targetDevice":"1"}
,{"packageId":"com.seantron.Cloudypus", "appName":"Cloudypus", "developerName":"Imaginary Computer", "developerId":361, "category":"Games", "price":"0.00", "targetDevice":"1"}
,{"packageId":"com.wotakuro.arsnow", "appName":"AR SNOW", "developerName":"Yusuke Kurokawa", "developerId":469, "category":"Entertainment", "price":"0.00", "targetDevice":"3"}
,{"packageId":"beefmaster.tweetviewer", "appName":"みゅるみゅーる", "developerName":"beef.master", "developerId":369, "category":"Entertainment", "price":"0.00", "targetDevice":"3"}
,{"packageId":"com.splashtop.remote.pcp.v2", "appName":"Splashtop Personal - Remote PC", "developerName":"Splashtop Inc.", "developerId":1028, "category":"Business", "price":"0.00", "targetDevice":"3"}
,{"packageId":"com.splashtop.remote.business", "appName":"Splashtop Business-Remote PC", "developerName":"Splashtop Inc.", "developerId":1028, "category":"Business", "price":"0.00", "targetDevice":"3"}
,{"packageId":"com.splashtop.remote.pad.business", "appName":"Splashtop Enterprise-RemoteApp", "developerName":"Splashtop Inc.", "developerId":1028, "category":"Business", "price":"0.00", "targetDevice":"3"}
,{"packageId":"de.lineas.lis.Flappy3D", "appName":"Flappy 3D", "developerName":"LINEAS Software GmbH", "developerId":351, "category":"Games", "price":"0.00", "targetDevice":"3"}
,{"packageId":"jp.epson.bt2.helpapp", "appName":"BT-200 Help", "developerName":"MOVERIO Support Group", "developerId":4, "category":"Tools", "price":"0.00", "targetDevice":"1"}
,{"packageId":"com.imaginarycomputer.SkyTemple", "appName":"Sky Temple", "developerName":"Imaginary Computer", "developerId":361, "category":"Games", "price":"0.00", "targetDevice":"3"}
,{"packageId":"com.devasque.rotationlocker", "appName":"Rotation Locker", "developerName":"madmack", "developerId":943, "category":"Life Style", "price":"0.00", "targetDevice":"3"}
,{"packageId":"com.hamamatsu.android.dogeza", "appName":"土下座道", "developerName":"日本Androidの会 浜松支部", "developerId":254, "category":"Games", "price":"0.00", "targetDevice":"3"}
,{"packageId":"de.lineas.headsubdisplay", "appName":"HeadSubDisplay", "developerName":"LINEAS Software GmbH", "developerId":351, "category":"Entertainment", "price":"0.00", "targetDevice":"1"}
,{"packageId":"jp.ac.uec.is.comp.iwasaki", "appName":"Dharma", "developerName":"UEC Irie Lab.", "developerId":82, "category":"Games", "price":"0.00", "targetDevice":"3"}
,{"packageId":"jp.ndc.mojirendo", "appName":"MOJIREN", "developerName":"株式会社日本ビジネスデータープロセシングセンター", "developerId":189, "category":"Entertainment", "price":"0.00", "targetDevice":"3"}
,{"packageId":"com.AsuksLab.Ishibutai_EHMD_Pub", "appName":"Virtual Ishibutai Tumulus", "developerName":"AsukaLab", "developerId":368, "category":"Entertainment", "price":"0.00", "targetDevice":"1"}
,{"packageId":"jp.mizmon21.android.fruitspetitputtilitem", "appName":"Fruits Petit Putti Lite M", "developerName":"mizmon21", "developerId":431, "category":"Games", "price":"0.00", "targetDevice":"3"}
,{"packageId":"jp.mizmon21.android.pipcameramoverio", "appName":"PiP Camera for Moverio", "developerName":"mizmon21", "developerId":431, "category":"Entertainment", "price":"0.00", "targetDevice":"3"}
,{"packageId":"jp.co.yahoo.android.vassist", "appName":"Yahoo!音声アシスト：会話や検索。Siriのようなアプリ", "developerName":"Yahoo Japan Corp.", "developerId":101, "category":"Life Style", "price":"0.00", "targetDevice":"1"}
,{"packageId":"com.seantron.PSYCLOPsDEMO", "appName":"PSYCLOPs", "developerName":"Imaginary Computer", "developerId":361, "category":"Games", "price":"0.00", "targetDevice":"3"}
,{"packageId":"com.jvckenwood.everiosync4moverio", "appName":"Everio sync. for MOVERIO", "developerName":"株式会社ＪＶＣケンウッド", "developerId":261, "category":"Entertainment", "price":"0.00", "targetDevice":"3"}
,{"packageId":"com.kobobooks.android", "appName":"楽天Kobo：電子書籍\/小説・漫画・無料本が読める！", "developerName":"Rakuten, Inc.", "developerId":266, "category":"Entertainment", "price":"0.00", "targetDevice":"1"}
,{"packageId":"jp.co.rakuten.gateway3", "appName":"Rakuten Gateway", "developerName":"Rakuten, Inc.", "developerId":266, "category":"Life Style", "price":"0.00", "targetDevice":"1"}
,{"packageId":"jp.co.questcom.droidshooting", "appName":"MicroRobotShooting", "developerName":"Quest-Com", "developerId":45, "category":"Games", "price":"0.00", "targetDevice":"3"}
]}
