{
  "id": "",
  "name": "",
  "font_family": "iconfont",
  "css_prefix_text": "icon-",
  "description": "",
  "glyphs": [
    {
      "icon_id": "35314452",
      "name": "笔记",
      "font_class": "biji",
      "unicode": "e607",
      "unicode_decimal": 58887
    },
    {
      "icon_id": "35314456",
      "name": "天气",
      "font_class": "tianqi",
      "unicode": "e608",
      "unicode_decimal": 58888
    },
    {
      "icon_id": "35314464",
      "name": "讨论",
      "font_class": "taolun",
      "unicode": "e609",
      "unicode_decimal": 58889
    },
    {
      "icon_id": "35314466",
      "name": "文档",
      "font_class": "wendang",
      "unicode": "e60a",
      "unicode_decimal": 58890
    },
    {
      "icon_id": "35314469",
      "name": "相册",
      "font_class": "xiangce",
      "unicode": "e60b",
      "unicode_decimal": 58891
    },
    {
      "icon_id": "35314480",
      "name": "网页",
      "font_class": "a-tubiaoji1_huaban1fuben19",
      "unicode": "e60c",
      "unicode_decimal": 58892
    }
  ]
}
