<svg xmlns="http://www.w3.org/2000/svg" version="1.1" width="46"
     height="48" viewBox="0 0 46 48">
    <g>
        <g>
            <path d="M12.5 16.5C12.5 10.424867751861274 17.424867751861274 5.5 23.5 5.5L23.5 5.5C29.575132248138726 5.5 34.5 10.424867751861274 34.5 16.5L34.5 34.5C34.5 38.918277998646346 30.918277998646346 42.5 26.5 42.5L20.5 42.5C16.081722001353654 42.5 12.5 38.918277998646346 12.5 34.5Z"
                  fill-opacity="0" stroke-opacity="1" stroke="currentColor" stroke-width="3"/>
        </g>
        <g>
            <rect x="8" y="19" width="32" height="3" rx="0" fill-opacity="1"/>
        </g>
        <g>
            <rect x="13" y="32" width="21" height="3" rx="0" fill-opacity="1"/>
        </g>
        <g>
            <path d="M12,0L3,0Q2.85262,0,2.70595,0.0144458Q2.55928,0.0288916,2.41473,0.0576442Q2.27018,0.0863967,2.12915,0.129179Q1.98811,0.171961,1.85195,0.228361Q1.71579,0.284761,1.58581,0.354236Q1.45583,0.423711,1.33329,0.505591Q1.21075,0.587471,1.09682,0.680969Q0.982893,0.774466,0.87868,0.87868Q0.774466,0.982893,0.680969,1.09682Q0.587471,1.21075,0.505591,1.33329Q0.423711,1.45583,0.354236,1.58581Q0.284761,1.71579,0.228361,1.85195Q0.171961,1.98811,0.129179,2.12915Q0.0863967,2.27018,0.0576442,2.41473Q0.0288916,2.55928,0.0144458,2.70595Q0,2.85262,0,3L0,13L3,13L3,3L12,3L12,0ZM12,45L3,45L3,36L0,36L0,45Q0,45.1474,0.0144458,45.2941Q0.0288916,45.4407,0.0576442,45.5853Q0.0863967,45.7298,0.129179,45.8709Q0.171961,46.0119,0.228361,46.148Q0.284761,46.2842,0.354236,46.4142Q0.423711,46.5442,0.505591,46.6667Q0.587471,46.7893,0.680969,46.9032Q0.774466,47.0171,0.87868,47.1213Q0.982893,47.2255,1.09682,47.319Q1.21075,47.4125,1.33329,47.4944Q1.45583,47.5763,1.58581,47.6458Q1.71579,47.7152,1.85195,47.7716Q1.98811,47.828,2.12915,47.8708Q2.27018,47.9136,2.41473,47.9423Q2.55928,47.9711,2.70595,47.9856Q2.85262,48,3,48L12,48L12,45ZM37,48L37,45L43,45L43,36L46,36L46,45Q46,45.1474,45.9855,45.2941Q45.9711,45.4407,45.9424,45.5853Q45.9136,45.7298,45.8708,45.8709Q45.828,46.0119,45.7716,46.148Q45.7152,46.2842,45.6458,46.4142Q45.5763,46.5442,45.4944,46.6667Q45.4125,46.7893,45.319,46.9032Q45.2255,47.0171,45.1213,47.1213Q45.0171,47.2255,44.9032,47.319Q44.7892,47.4125,44.6667,47.4944Q44.5442,47.5763,44.4142,47.6458Q44.2842,47.7152,44.148,47.7716Q44.0119,47.828,43.8709,47.8708Q43.7298,47.9136,43.5853,47.9423Q43.4407,47.9711,43.2941,47.9856Q43.1474,48,43,48L37,48ZM37,3L37,0L43,0Q43.1474,0,43.2941,0.0144458Q43.4407,0.0288916,43.5853,0.0576442Q43.7298,0.0863967,43.8709,0.129179Q44.0119,0.171961,44.148,0.228361Q44.2842,0.284761,44.4142,0.354236Q44.5442,0.423711,44.6667,0.505591Q44.7892,0.587471,44.9032,0.680969Q45.0171,0.774466,45.1213,0.87868Q45.2255,0.982893,45.319,1.09682Q45.4125,1.21075,45.4944,1.33329Q45.5763,1.45583,45.6458,1.58581Q45.7152,1.71579,45.7716,1.85195Q45.828,1.98811,45.8708,2.12915Q45.9136,2.27018,45.9424,2.41473Q45.9711,2.55928,45.9855,2.70595Q46,2.85262,46,3L46,13L43,13L43,3L37,3Z"
                  fill-rule="evenodd" fill-opacity="1"/>
        </g>
    </g>
</svg>
