<svg width="32" height="32" viewBox="0 0 32 32" fill="none" xmlns="http://www.w3.org/2000/svg">
<path fill-rule="evenodd" clip-rule="evenodd" d="M10.6375 10.15V8.9644C10.6375 8.00598 11.4185 7.225 12.3769 7.225H19.6231C20.5815 7.225 21.3625 8.00598 21.3625 8.9644V10.15H10.6375ZM22.8582 10.15H22.3375V8.9644C22.3375 7.46777 21.1197 6.25 19.6231 6.25H12.3769C10.8803 6.25 9.6625 7.46777 9.6625 8.9644V10.15H9.14185C7.54675 10.15 6.25 11.4468 6.25 13.0419V17.9832C6.25 19.5783 7.54675 20.875 9.14185 20.875C9.41095 20.875 9.62935 20.6566 9.62935 20.3875C9.62935 20.1184 9.41095 19.9 9.14185 19.9C8.08495 19.9 7.225 19.0401 7.225 17.9832V13.0419C7.225 11.985 8.08495 11.125 9.14185 11.125H9.6625H22.3375H22.8582C23.9151 11.125 24.775 11.985 24.775 13.0419V17.9832C24.775 19.0401 23.9151 19.9 22.8582 19.9C22.5891 19.9 22.3707 20.1184 22.3707 20.3875C22.3707 20.6566 22.5891 20.875 22.8582 20.875C24.4533 20.875 25.75 19.5783 25.75 17.9832V13.0419C25.75 11.4468 24.4533 10.15 22.8582 10.15Z" fill="#231F20"/>
<path fill-rule="evenodd" clip-rule="evenodd" d="M20.8758 23.6754C20.8758 24.2809 20.3824 24.7742 19.777 24.7742H12.2246C11.6191 24.7742 11.1258 24.2809 11.1258 23.6754V18.9242H20.8758V23.6754ZM22.8258 18.4367C22.8258 18.1676 22.6074 17.9492 22.3383 17.9492H21.8508H10.1508H9.66328C9.39418 17.9492 9.17578 18.1676 9.17578 18.4367C9.17578 18.7058 9.39418 18.9242 9.66328 18.9242H10.1508V23.6754C10.1508 24.8191 11.0809 25.7492 12.2246 25.7492H19.777C20.9206 25.7492 21.8508 24.8191 21.8508 23.6754V18.9242H22.3383C22.6074 18.9242 22.8258 18.7058 22.8258 18.4367Z" fill="#231F20"/>
<path fill-rule="evenodd" clip-rule="evenodd" d="M13.0754 23.4691H18.9254C19.1945 23.4691 19.4129 23.2507 19.4129 22.9816C19.4129 22.7125 19.1945 22.4941 18.9254 22.4941H13.0754C12.8063 22.4941 12.5879 22.7125 12.5879 22.9816C12.5879 23.2507 12.8063 23.4691 13.0754 23.4691Z" fill="#231F20"/>
<path fill-rule="evenodd" clip-rule="evenodd" d="M13.0754 21.518H18.9254C19.1945 21.518 19.4129 21.2996 19.4129 21.0305C19.4129 20.7614 19.1945 20.543 18.9254 20.543H13.0754C12.8063 20.543 12.5879 20.7614 12.5879 21.0305C12.5879 21.2996 12.8063 21.518 13.0754 21.518Z" fill="#231F20"/>
<path fill-rule="evenodd" clip-rule="evenodd" d="M22.5348 14.0492C22.8039 14.0492 23.0223 13.8308 23.0223 13.5617C23.0223 13.2926 22.8039 13.0742 22.5348 13.0742H21.5598C21.2907 13.0742 21.0723 13.2926 21.0723 13.5617C21.0723 13.8308 21.2907 14.0492 21.5598 14.0492H22.5348Z" fill="#231F20"/>
</svg>
