<svg xmlns="http://www.w3.org/2000/svg" width="50" height="50" viewBox="0 0 50 50">
    <path fill="#323C47" fill-rule="evenodd" d="M17 7h16a3 3 0 0 1 3 3v30a3 3 0 0 1-3 3H17a3 3 0 0 1-3-3V10a3 3 0 0 1 3-3zm0 3a1 1 0 0 0-1 1v26a1 1 0 0 0 1 1h16a1 1 0 0 0 1-1V11a1 1 0 0 0-1-1H17zm2 9h12a1 1 0 0 1 1 1v8a1 1 0 0 1-1 1H19a1 1 0 0 1-1-1v-8a1 1 0 0 1 1-1zm2 3a1 1 0 0 0 0 2h1a1 1 0 0 0 0-2h-1zm0 3a1 1 0 0 0 0 2h6a1 1 0 0 0 0-2h-6zm2.5 15a.5.5 0 0 0-.5.5v1a.5.5 0 0 0 .5.5h3a.5.5 0 0 0 .5-.5v-1a.5.5 0 0 0-.5-.5h-3zM11 21a1 1 0 0 1 1 1v6a1 1 0 0 1-2 0v-6a1 1 0 0 1 1-1zm28 0a1 1 0 0 1 1 1v6a1 1 0 0 1-2 0v-6a1 1 0 0 1 1-1zM7 18a1 1 0 0 1 1 1v12a1 1 0 0 1-2 0V19a1 1 0 0 1 1-1zm36 0a1 1 0 0 1 1 1v12a1 1 0 0 1-2 0V19a1 1 0 0 1 1-1z"/>
</svg>
