<svg xmlns="http://www.w3.org/2000/svg" width="50" height="50" viewBox="0 0 50 50">
    <path fill="#323C47" fill-rule="nonzero" d="M37.561 21.403c.293 1.11.44 2.257.439 3.411C38 32.086 32.169 38 25 38c-7.167 0-13-5.914-13-13.186 0-5.98 3.977-11.223 9.672-12.75a1.892 1.892 0 0 1 2.317 1.368c.268 1.027-.336 2.08-1.348 2.35-4.034 1.08-6.85 4.794-6.85 9.032 0 2.272.804 4.357 2.137 5.977a4.93 4.93 0 0 1-.234-1.502c0-2.699 2.157-4.885 4.816-4.885 2.66 0 4.816 2.188 4.816 4.885 0 2.321-1.599 4.26-3.74 4.757.462.073.935.111 1.415.111 5.08 0 9.21-4.19 9.21-9.341a9.47 9.47 0 0 0-.312-2.421c-.27-1.025.331-2.08 1.342-2.353a1.893 1.893 0 0 1 2.32 1.36zm-4.44-4.926c-.17 1.75-1.708 3.027-3.433 2.854-1.725-.174-2.985-1.732-2.814-3.481.171-1.75 1.708-3.027 3.433-2.854 1.725.174 2.985 1.732 2.814 3.481z"/>
</svg>
