<svg xmlns="http://www.w3.org/2000/svg" width="50" height="50" viewBox="0 0 50 50">
    <path fill="#323C47" fill-rule="nonzero" d="M11 43a3 3 0 0 1-3-3V11a3 3 0 0 1 3-3h29a3 3 0 0 1 3 3v29a3 3 0 0 1-3 3H11zm.201-15.843v7.288h1.202V32.33c.235.204.493.327.77.327.398 0 .724-.21.98-.627.288-.465.431-1.152.431-2.05 0-.628-.115-1.192-.34-1.673l-.039-.078-.039-.065-.026-.066-.04-.052-.039-.065-.052-.065-.079-.105-.052-.052-.04-.052-.051-.052-.053-.04-.052-.052-.157-.118-.065-.026-.052-.039-.052-.026-.066-.026-.13-.053-.065-.025-.196-.04-.078-.025h-.065l-.078-.013h-.065l-.079-.013h-1.333v-.001zm1.137 1.032h.117c.303 0 .538.175.705.51.167.334.248.85.248 1.567 0 .386-.047.692-.156.9-.105.21-.24.314-.392.314-.146 0-.267-.099-.366-.287-.099-.183-.156-.447-.156-.797V28.19zm27.134-1.386l-.099.099s-2.513 2.622-2.7 2.82v-2.57h-1.176v7.304h1.175v-2.999c.032-.036 1.541-1.635 1.714-1.818l.172 4.817h1.202l-.288-7.653zm-5.731.1l-.006.01-.01.005-.01.015-.017.016-.068.068-.026.026-.03.032-.032.036-.037.037-.036.036-.037.042-.089.089-.094.1-.099.104-.104.11-.11.114-.115.12-.12.12-.12.126-.12.13-.246.256-.12.126-.12.12-.115.12-.11.12-.109.11-.1.105-.093.099-.047.047-.042.047-.042.042-.036.042-.037.036-.031.037-.063.063-.026.026-.042.042-.015.02-.016.011-.01.016v-2.57h-1.182v7.303h1.18V31.46c.032-.037 1.542-1.636 1.714-1.818l.173 4.816h1.196l-.287-7.654-.094.1zm-6.834 5.74l-.073-.088-.063-.089-.062-.1-.053-.098-.052-.105-.047-.104-.047-.11-.037-.11-.031-.12-.031-.114-.027-.126-.02-.125-.017-.131-.01-.13-.01-.273c0-.767.187-1.379.553-1.828.402-.491.988-.737 1.75-.737h.058v-1.274h-.058c-1.19 0-2.105.365-2.727 1.102-.564.664-.851 1.588-.851 2.748 0 1.118.313 2.042.924 2.737.648.732 1.542 1.108 2.67 1.108h.057v-1.28h-.057c-.74 0-1.326-.25-1.739-.752zm-9.45-5.669c-.631 0-1.136.358-1.502 1.058-.355.69-.535 1.607-.535 2.73 0 1.16.17 2.098.51 2.782.344.7.859 1.058 1.528 1.058.684 0 1.225-.379 1.606-1.11.355-.685.536-1.61.536-2.743 0-1.118-.184-2.033-.55-2.717l-.078-.13-.026-.066-.052-.052-.027-.052-.052-.053-.118-.156-.091-.092-.053-.04-.039-.038-.052-.04-.04-.039-.052-.04-.052-.026-.157-.077-.104-.053-.052-.013-.066-.026-.052-.013-.065-.013L17.77 27h-.053l-.13-.026h-.13zm0 1.176c.335 0 .58.237.732.718.146.434.209 1.066.209 1.881 0 .789-.073 1.444-.235 1.946l-.026.052-.052.157-.026.04-.013.039-.026.026-.013.04-.027.026-.013.04-.013.026-.025.025-.027.026-.013.026-.026.013-.013.026-.026.026-.026.013-.026.026-.053.026-.013.013-.026.013h-.026l-.027.013-.026.013h-.026l-.026.013h-.092c-.287 0-.504-.246-.667-.732-.167-.507-.248-1.157-.248-1.92 0-.778.081-1.421.248-1.907.153-.464.375-.704.668-.704zm4.92 4.494l-.03-.042-.037-.047-.069-.089-.057-.1-.057-.098-.053-.105-.047-.104-.041-.11-.042-.11-.031-.12-.032-.114-.042-.251-.015-.131-.01-.13-.011-.137v-.136c0-.767.183-1.379.554-1.828.397-.491.982-.737 1.745-.737h.062v-1.274h-.062c-1.186 0-2.106.365-2.722 1.102-.57.664-.851 1.588-.851 2.748 0 1.118.308 2.042.924 2.737.643.732 1.541 1.108 2.67 1.108h.057v-1.28h-.057c-.748 0-1.333-.25-1.745-.752zM11.214 16.443v7.34h1.353V17.66h1.672v6.123h1.348v-7.34h-4.373zm8.517-.192c-.716 0-1.29.36-1.698 1.071-.402.695-.6 1.615-.6 2.743 0 1.165.187 2.118.574 2.808.392.705.972 1.058 1.724 1.058.768 0 1.374-.368 1.802-1.11.403-.69.614-1.622.614-2.756 0-1.129-.22-2.054-.627-2.743l-.118-.196-.052-.052-.04-.065-.051-.052-.04-.052-.196-.196-.156-.118-.066-.04-.052-.026-.052-.04-.052-.026-.066-.026-.052-.026-.13-.052-.052-.013-.066-.027-.26-.052h-.144l-.065-.013h-.08zm.013 1.24c.366 0 .625.236.797.706.157.429.235 1.053.235 1.868 0 .778-.092 1.43-.274 1.92-.178.48-.423.705-.758.705h-.118l-.052-.026h-.027l-.026-.013-.026-.012-.079-.04-.026-.026-.026-.013-.026-.026-.027-.013-.013-.026-.026-.026-.026-.026-.013-.026-.027-.027-.026-.039-.013-.026-.026-.027-.013-.039-.026-.04-.013-.026-.013-.052-.026-.04-.026-.078-.027-.039c-.182-.507-.274-1.15-.274-1.907 0-.778.092-1.413.274-1.894.175-.464.418-.691.747-.691zm9.76-1.048v1.217h1.124v6.123h1.353V17.66h1.14v-1.217h-3.616zm-2.962 2.554h-.736c-.303 0-.533-.067-.674-.203-.105-.094-.152-.225-.152-.392v-1.96h-1.353v2.096c0 .48.193.893.57 1.217.37.319.83.48 1.358.48h.987v3.547h1.353v-7.34h-1.353v2.555zm8.34-2.55l-.248 7.34h1.345l.13-3.591h1.685l.392 3.591h1.358l-.627-5.368v-.195l-.013-.066v-.065l-.013-.052v-.065l-.013-.052-.013-.066-.051-.209-.027-.052-.026-.104-.026-.053-.026-.039-.027-.052-.013-.04-.026-.052-.026-.039-.04-.04-.026-.052-.026-.026-.04-.052-.104-.105-.04-.026-.026-.04-.052-.039c-.34-.267-.8-.392-1.385-.392h-1.996zm1.293 1.214h.483c.35 0 .585.113.732.327.12.178.2.517.248.993h-1.502v-.209l.013-.04v-.522l.013-.052v-.38l.013-.025v-.092z"/>
</svg>
