<?xml version="1.0" encoding="UTF-8"?>
<svg width="185px" height="185px" viewBox="0 0 185 185" version="1.1" xmlns="http://www.w3.org/2000/svg" xmlns:xlink="http://www.w3.org/1999/xlink">
    <!-- Generator: sketchtool 52.5 (67469) - http://www.bohemiancoding.com/sketch -->
    <title>0E0FDC3D-DAFD-4727-B238-6F667C255546</title>
    <desc>Created with sketchtool.</desc>
    <g id="[WB-5012]-Credit-Rating" stroke="none" stroke-width="1" fill="none" fill-rule="evenodd">
        <g id="[wb-5012]-assets" transform="translate(-80.000000, -210.000000)" fill="#FFDF42" fill-rule="nonzero">
            <g id="processing" transform="translate(80.000000, 210.000000)">
                <path d="M92.5,0 C93.8807119,0 95,1.11928813 95,2.5 C95,3.88071187 93.8807119,5 92.5,5 C44.1750844,5 5,44.1750844 5,92.5 C5,140.824916 44.1750844,180 92.5,180 C140.824916,180 180,140.824916 180,92.5 C180,91.1192881 181.119288,90 182.5,90 C183.880712,90 185,91.1192881 185,92.5 C185,143.586339 143.586339,185 92.5,185 C41.4136606,185 0,143.586339 0,92.5 C0,41.4136606 41.4136606,0 92.5,0 Z"></path>
            </g>
        </g>
    </g>
</svg>