<?xml version="1.0" encoding="utf-8"?>
<!-- Generator: Adobe Illustrator 22.1.0, SVG Export Plug-In . SVG Version: 6.00 Build 0)  -->
<svg version="1.1" id="Слой_1" xmlns="http://www.w3.org/2000/svg" xmlns:xlink="http://www.w3.org/1999/xlink" x="0px" y="0px"
	 viewBox="0 0 101 30" style="enable-background:new 0 0 101 30;" xml:space="preserve">
<path style="fill:#EF3124;" d="M9.7,0.1c2,0,2.7,1.5,3.2,2.9c0.2,0.6,5.5,15,5.6,15.4c0,0.1,0,0.3-0.2,0.4c-0.2,0.1-2.9,1.1-3.1,1.2
	c-0.2,0-0.3,0-0.4-0.2c-0.1-0.2-1.2-3.3-1.3-3.6c-0.4,0-7.4,0-7.8,0c-0.1,0.4-1.3,3.5-1.3,3.6c0,0.1-0.2,0.2-0.4,0.2
	C3.9,20,1.2,18.9,1,18.9c-0.2-0.1-0.2-0.2-0.2-0.4C1,18,6.2,3.8,6.5,3C7,1.6,7.7,0.1,9.7,0.1z M0.4,25.9c-0.2,0-0.3,0.1-0.3,0.3v3.4
	c0,0.2,0.1,0.3,0.3,0.3h18.5c0.2,0,0.3-0.1,0.3-0.3v-3.4c0-0.2-0.1-0.3-0.3-0.3H0.4z M9.7,4.8L7,12.7h5.3L9.7,4.8L9.7,4.8z
	 M78.5,16.4c0,0.9-0.5,1.5-1.4,1.5c-0.4,0-0.6,0-1.1-0.1v-2.7c0.2,0,0.6-0.1,1.1-0.1C78,15,78.5,15.5,78.5,16.4z M80.4,16.3
	c0-1.7-1-2.8-3-2.8c-0.5,0-0.9,0-1.4,0.2v-2.4c0.3,0,0.9-0.1,1.5-0.1c0.6,0,1.4,0,2,0.1l0-1.4c-0.8-0.2-1.9-0.3-2.7-0.3
	s-2.1,0.2-2.8,0.4v8.8c1,0.4,1.9,0.5,2.9,0.5C79.2,19.4,80.4,18.2,80.4,16.3z M59.1,15.8c0,1.2-0.5,2-1.3,2c-0.3,0-0.5,0-0.9-0.1V14
	c0.4-0.2,0.6-0.2,1-0.2C58.7,13.8,59.1,14.5,59.1,15.8z M52.9,15.9c0-1.3,0.4-2.1,1.2-2.1c0.3,0,0.6,0,1,0.2v3.7
	c-0.4,0.1-0.6,0.1-0.9,0.1C53.3,17.9,52.9,17.1,52.9,15.9z M56.9,21.4V19c0.2,0.1,0.7,0.3,1.4,0.3c1.5,0,2.6-1.2,2.6-3.5
	c0-2.4-1.1-3.5-2.9-3.5c-0.4,0-0.8,0-1.1,0.2V9.7h-1.7v2.9c-0.4-0.2-0.7-0.2-1.1-0.2c-1.8,0-2.9,1.1-2.9,3.5c0,2.3,1,3.5,2.6,3.5
	c0.8,0,1.2-0.2,1.4-0.3v2.4H56.9z M43.6,19.2v-6.4c-1-0.3-1.7-0.4-2.7-0.4c-1,0-1.7,0.1-2.7,0.4v3.3c0,0.9,0,1.2-0.1,1.5
	c-0.1,0.2-0.2,0.6-0.6,0.8l0.5,1c1.4-0.4,1.9-1,1.9-3v-2.4c0.5-0.1,0.6-0.1,0.9-0.1s0.4,0,0.9,0.1v5.3H43.6z M65.3,17.8
	c-0.4,0.1-0.6,0.2-0.9,0.2c-0.6,0-1-0.2-1-0.9c0-0.7,0.4-0.9,1.3-0.9c0.2,0,0.4,0,0.5,0.1v0.5C65.2,17.2,65.2,17.6,65.3,17.8z
	 M67.5,18.6c-0.5-0.7-0.6-1.1-0.6-2v-1.8c0-1-0.1-1.3-0.4-1.7c-0.4-0.5-0.9-0.7-2.1-0.7c-0.8,0-1.5,0.1-2.3,0.3l0.3,1.3
	c0.5-0.1,1-0.1,1.4-0.1c1.2,0,1.3,0.2,1.3,1.1v0.3c-0.3-0.1-0.6-0.1-0.9-0.1c-1.8,0-2.7,0.9-2.7,2.3c0,1.3,1,2.1,2.2,2.1
	c0.4,0,0.9-0.1,1.3-0.2c0.2-0.1,0.3-0.2,0.6-0.4c0.2,0.3,0.5,0.5,0.7,0.6L67.5,18.6z M84.7,17.8C84.3,17.9,84,18,83.7,18
	c-0.6,0-1-0.2-1-0.9c0-0.7,0.4-0.9,1.3-0.9c0.2,0,0.4,0,0.5,0.1v0.5C84.6,17.2,84.6,17.6,84.7,17.8z M86.9,18.6
	c-0.5-0.7-0.6-1.1-0.6-2v-1.8c0-1-0.1-1.3-0.4-1.7c-0.4-0.5-1-0.7-2.1-0.7c-0.8,0-1.5,0.1-2.3,0.3l0.3,1.3c0.5-0.1,1-0.1,1.4-0.1
	c1.2,0,1.3,0.2,1.3,1.1v0.3C84.4,15.1,84,15,83.7,15c-1.8,0-2.7,0.9-2.7,2.3c0,1.3,1,2.1,2.2,2.1c0.4,0,0.9-0.1,1.3-0.2
	c0.2-0.1,0.3-0.2,0.6-0.4c0.2,0.3,0.5,0.5,0.7,0.6L86.9,18.6z M48.6,16.9c0,0.6-0.2,1.1-1.1,1.1c-0.3,0-0.4,0-0.8-0.1V16
	c0.5-0.1,0.5-0.1,0.8-0.1C48.3,15.9,48.6,16.3,48.6,16.9z M45,12.4v6.4c0.8,0.4,1.7,0.5,2.6,0.5c1.9,0,2.9-1,2.9-2.6
	c0-1.4-0.9-2.3-2.6-2.3c-0.4,0-0.7,0-1.1,0.2v-2.2H45z M93.4,19.2v-6.7h-1.8V15h-2v-2.5h-1.8v6.7h1.8v-2.7h2v2.7H93.4z M100.6,19.2
	c0,0-1-2.1-1.2-2.5c-0.3-0.5-0.5-0.9-1.1-1v0c0.4-0.1,0.6-0.3,1-1c0.3-0.6,0.4-0.8,0.6-0.9c0.2-0.2,0.4-0.1,0.4-0.1l0.1-1.2
	c-0.2,0-0.5,0-0.8,0c-0.5,0-0.7,0.2-1,0.4c-0.2,0.2-0.3,0.4-0.5,0.8c-0.2,0.3-0.3,0.6-0.5,1c-0.2,0.4-0.2,0.5-0.7,0.5h-0.3v-2.6
	h-1.8v6.7h1.8v-2.7h0.2c0.5,0,0.6,0.1,0.9,0.6c0.3,0.6,0.9,2.1,0.9,2.1H100.6z M35,19.2h2l-3.1-9.4c-0.3-0.1-0.7-0.2-1.1-0.2
	c-0.5,0-0.6,0.1-1,0.2l-3.2,9.4h1.9c0,0,0.3-0.8,0.6-1.8h3.4C34.7,18.4,35,19.2,35,19.2z M31.5,15.8c0,0,0.6-1.9,0.6-2.2
	c0.2-0.8,0.6-2,0.6-2h0c0,0,0.3,1.3,0.5,1.9c0.1,0.3,0.6,2.2,0.6,2.2L31.5,15.8L31.5,15.8z M70.5,14.7c-0.6,0-1.1,0.5-1.1,1.1
	c0,0.6,0.5,1.1,1.1,1.1s1.1-0.5,1.1-1.1C71.6,15.2,71.1,14.7,70.5,14.7z"/>
</svg>
