<?xml version="1.0" encoding="utf-8"?>
<!-- Generator: Adobe Illustrator 23.0.1, SVG Export Plug-In . SVG Version: 6.00 Build 0)  -->
<svg version="1.1" id="error-20" xmlns="http://www.w3.org/2000/svg" xmlns:xlink="http://www.w3.org/1999/xlink" x="0px" y="0px"
	 viewBox="0 0 20 20" style="enable-background:new 0 0 20 20;" xml:space="preserve">
<g id="error-20">
    <circle style="fill:#F74455;" cx="10" cy="10" r="8"/>
    <path style="fill:#FFFFFF;" d="M8.6,10L6.8,8.2l1.4-1.4L10,8.6l1.8-1.8l1.4,1.4L11.4,10l1.8,1.8l-1.4,1.4L10,11.4l-1.8,1.8l-1.4-1.4L8.6,10z"/>
</g>

</svg>
