<?xml version="1.0" encoding="utf-8"?>
<!-- Generator: Adobe Illustrator 22.1.0, SVG Export Plug-In . SVG Version: 6.00 Build 0)  -->
<svg version="1.1" id="Слой_1" xmlns="http://www.w3.org/2000/svg" xmlns:xlink="http://www.w3.org/1999/xlink" x="0px" y="0px"
	 viewBox="0 0 22 22" style="enable-background:new 0 0 22 22;" xml:space="preserve">
<style type="text/css">
	.st0{fill:none;}
</style>
<g id="refresh">
	<path class="st0" d="M2.6,12c0-0.4-0.1-0.7-0.1-1c0-4.6,3.8-8.4,8.4-8.4c2.2,0,4.2,0.9,5.7,2.2l-0.7,0.8c-0.2,0.2-0.2,0.4-0.2,0.6
		c0.1,0.2,0.3,0.4,0.5,0.4c0.1,0,4.4,1.4,4.1,1.3c0.3,0.1,0.9-0.3,0.8-0.8c0-0.1-1-4.9-0.9-4.6c-0.1-0.2-0.2-0.4-0.5-0.5
		c-0.2-0.1-0.5,0-0.6,0.2l-0.6,0.6C16.5,1.1,13.9,0,11,0C5,0,0,5,0,11v0c0,0.4,0,0.6,0,0.9c0,0.3,0.2,0.5,0.5,0.6l1.3,0.3
		C2.3,12.8,2.7,12.4,2.6,12z"/>
	<path class="st0" d="M21.5,9.5l-1.3-0.3c-0.4-0.1-0.8,0.3-0.8,0.7c0,0.4,0.1,0.7,0.1,1c0,4.6-3.8,8.4-8.4,8.4
		c-2.2,0-4.2-0.9-5.7-2.2l0.7-0.7c0.2-0.2,0.2-0.4,0.2-0.6c-0.1-0.2-0.3-0.4-0.5-0.4c-0.1,0-4.4-1.4-4.1-1.3c-0.2,0-0.4,0-0.6,0.2
		c-0.2,0.1-0.2,0.4-0.2,0.6c0,0.1,1,4.8,0.9,4.6c0.1,0.2,0.2,0.4,0.5,0.5c0.3,0.1,0.5,0,0.6-0.2L3.5,19c1.9,1.8,4.6,3,7.5,3
		c6,0,11-5,11-11v0c0-0.3,0-0.6,0-0.8C21.9,9.8,21.7,9.6,21.5,9.5z"/>
</g>
</svg>
