<?xml version="1.0" encoding="utf-8"?>
<!-- Generator: Adobe Illustrator 22.1.0, SVG Export Plug-In . SVG Version: 6.00 Build 0)  -->
<svg version="1.1" id="mir-accept_1_" xmlns="http://www.w3.org/2000/svg" xmlns:xlink="http://www.w3.org/1999/xlink" x="0px"
	 y="0px" viewBox="0 0 75 40" style="enable-background:new 0 0 75 40;" xml:space="preserve">
<style type="text/css">
	.st0{fill:#C5C4C4;}
</style>
<path id="mir-accept" class="st0" d="M6,19.6v-5.1h1.8c1,0,1.9,0,2.1,0.1c0.2,0.1,0.5,0.2,0.7,0.4c0.4,0.4,0.4,0.3,1.3,3.6
	c0.3,1,0.6,1.9,0.6,1.9c0.1,0,0.4-1.1,0.8-2.4c0.4-1.3,0.7-2.5,0.8-2.6c0.2-0.3,0.7-0.8,1.1-0.9c0.2-0.1,1.1-0.1,2.1-0.1H19v5.1v5.1
	h-1.7h-1.7v-3c0-1.7,0-3-0.1-3c0,0-0.5,1.4-1,3l-0.9,3h-1.2h-1.2l-0.9-3c-0.5-1.7-1-3-1-3c0,0-0.1,1.4-0.1,3v3H7.6H6V19.6z
	 M20.3,19.6v-5.1h1.7h1.7v5.1v5.1h-1.7h-1.7V19.6z M25,21.9V19h5h5.2c-0.3,0.6-0.5,1.1-0.8,1.3c-0.4,0.4-0.8,0.6-1,0.7L33,21.2
	l0.2,0.4c0.1,0.2,0.6,0.9,1.1,1.7c0.3,0.5,0.6,1,0.9,1.5c-0.5,0-1.1,0-1.9,0h-1.9l-0.8-1.6l-0.8-1.6H29h-0.7v1.6v1.6h-1.7H25V21.9z
	 M61.9,20.6c-1-0.2-1.9-0.5-2.4-1.5c-0.1-0.3-0.2-0.6-0.3-0.9c0.4,0,1.1,0,2,0c3,0,3.2,0,3.7,0.2c0.8,0.4,1.4,1.1,1.3,2.1l0,0.2
	l-2,0C63.2,20.6,62.1,20.6,61.9,20.6z M68.8,22.3v-2.7h-1.1h-1.1v-0.8v-0.8h3h3v0.8v0.8h-1h-1v2.7V25h-0.9h-0.9V22.3z M50.3,24.4
	c-1.1-0.3-1.8-1.2-2-2.4c-0.3-1.5,0.4-3,1.7-3.6c0.4-0.2,0.8-0.3,1.5-0.3s1.1,0.1,1.4,0.2c0.4,0.2,1,0.6,1,0.7c0,0.1-0.5,1-0.7,1.2
	c0,0-0.3-0.1-0.5-0.2c-0.9-0.5-1.7-0.4-2.3,0.1c-0.5,0.5-0.6,1.1-0.4,1.8c0.2,0.7,0.8,1.2,1.6,1.2c0.5,0,1.2-0.3,1.4-0.6
	c0.1-0.1,0.2-0.1,0.2-0.1c0.1,0,0.8,1,0.8,1.2s-0.5,0.5-1.1,0.8C52.2,24.6,51,24.6,50.3,24.4z M44.2,24.4c-1.1-0.3-1.8-1.2-2-2.4
	c-0.3-1.5,0.4-3,1.7-3.6c0.4-0.2,0.8-0.3,1.5-0.3s1.1,0.1,1.4,0.2c0.4,0.2,1,0.6,1,0.7c0,0.1-0.5,1-0.7,1.2c0,0-0.3-0.1-0.5-0.2
	c-0.9-0.5-1.7-0.4-2.3,0.1c-0.5,0.5-0.6,1.1-0.4,1.8c0.2,0.7,0.8,1.2,1.6,1.2c0.5,0,1.2-0.3,1.4-0.6c0.1-0.1,0.2-0.1,0.2-0.1
	c0.1,0,0.8,1,0.8,1.2s-0.5,0.5-1.1,0.8C46.2,24.6,45,24.6,44.2,24.4z M36.1,24.5c0.9-2.7,1.5-4.6,1.9-5.7l0.2-0.6h0.9h0.9
	c0.3,1,0.7,2,1.1,3.1l1.1,3.1h-0.8h-0.8l-0.2-0.6L40,23.2h-0.9h-0.9l-0.2,0.7l-0.2,0.6h-0.8H36.1z M39.6,21.8
	c-0.2-0.7-0.3-1.2-0.4-1.5l-0.1-0.4l-0.2,0.9c-0.1,0.3-0.2,0.7-0.2,1.1h0.5H39.6z M54.7,21.3v-3.1h2h2v0.7v0.7h-1.2h-1.2v0.5v0.6h1
	h1v0.7V22h-1h-1v0.5v0.6h1.3h1.3v0.7v0.7h-2.1h-2.1V21.3z M59.8,22.8v-1.7H63c1.5,0,2.5,0,3.2,0c0,0.2-0.1,0.4-0.2,0.6
	c-0.5,0.8-1,0.9-3,0.9h-1.6v0.9v0.9h-0.8h-0.8V22.8z M28.2,18.3c-1.9-0.5-3.4-1.8-3.8-3.6l-0.1-0.3h3.8c3.2,0,3.9,0,4.3,0.1
	c1,0.3,1.8,0.9,2.3,1.9c0.2,0.5,0.3,0.7,0.3,1.4v0.6h-3.2C29.4,18.4,28.6,18.4,28.2,18.3z M28.6,26.1h40.2c1.5,0,2.7,1.2,2.7,2.7
	v0.9H26.4C23.6,32.9,19.5,35,15,35C6.7,35,0,28.3,0,20S6.7,5,15,5c5.8,0,10.9,3.3,13.4,8.2h-4c-2.1-2.9-5.5-4.8-9.4-4.8
	C8.6,8.4,3.4,13.6,3.4,20S8.6,31.6,15,31.6c4.1,0,7.8-2.2,9.8-5.5H28.6z"/>
</svg>
