<?xml version="1.0" encoding="utf-8"?>
<!-- Generator: Adobe Illustrator 23.0.1, SVG Export Plug-In . SVG Version: 6.00 Build 0)  -->
<svg version="1.1" id="Слой_1" xmlns="http://www.w3.org/2000/svg" xmlns:xlink="http://www.w3.org/1999/xlink" x="0px" y="0px"
	 viewBox="0 0 70 45" style="enable-background:new 0 0 70 45;" xml:space="preserve">
<g id="mkb-mini">
	<path style="fill:#BB0032;"
          d="M5,0h60c2.8,0,5,2.2,5,5v35c0,2.8-2.2,5-5,5H5c-2.8,0-5-2.2-5-5V5C0,2.2,2.2,0,5,0z"/>
	<path style="fill-rule:evenodd;clip-rule:evenodd;fill:#FFFFFF;"
          d="M36.7,17h10.4l-4.2,4.2h-4.5L30.8,29L22,20l2.9-3H25h5.8l-3,3l3,3L36.7,17z M32.1,28.9l0.8-0.9l5.8-5.9h8.4
		l-4.2,4.2h-2.5L38,28.9H32.1z"/>
</g>
</svg>
