<svg width="16" height="16" viewBox="0 0 16 16" fill="none" xmlns="http://www.w3.org/2000/svg">
<path fill-rule="evenodd" clip-rule="evenodd" d="M10.9502 3.18984C11.3611 3.49516 11.4349 4.06063 11.115 4.45286L5.24375 11.6528C5.07472 11.8601 4.81926 11.9866 4.54439 11.999C4.26953 12.0114 4.00269 11.9086 3.81388 11.7175L0.256942 8.11753C-0.10033 7.75594 -0.0828772 7.18634 0.295925 6.84529C0.674726 6.50425 1.27143 6.52091 1.6287 6.8825L4.43119 9.71891L9.62704 3.34721C9.94689 2.95498 10.5393 2.88453 10.9502 3.18984ZM15.6363 3.18984C16.0472 3.49516 16.121 4.06063 15.8011 4.45286L9.92986 11.6528C9.76083 11.8601 9.50537 11.9866 9.2305 11.999C8.95564 12.0114 8.6888 11.9086 8.49999 11.7175L7.61076 10.8175C7.25348 10.4559 7.27094 9.88633 7.64974 9.54528C8.02854 9.20424 8.62525 9.2209 8.98252 9.58249L9.1173 9.71891L14.3132 3.34721C14.633 2.95498 15.2254 2.88453 15.6363 3.18984Z" fill="#00CCA6"/>
</svg>
