<svg width="24" height="24" viewBox="0 0 24 24" fill="none" xmlns="http://www.w3.org/2000/svg">
<circle cx="12" cy="12" r="9" fill="#8ECE4E"/>
<path d="M14.7339 16H9.37354V14.9365L11.9033 12.2402C12.2507 11.8607 12.5067 11.5295 12.6714 11.2466C12.8397 10.9637 12.9238 10.6951 12.9238 10.4409C12.9238 10.0936 12.8361 9.82145 12.6606 9.62451C12.4852 9.42399 12.2345 9.32373 11.9087 9.32373C11.5578 9.32373 11.2803 9.44548 11.0762 9.68896C10.8757 9.92887 10.7754 10.2458 10.7754 10.6396H9.21777C9.21777 10.1634 9.33057 9.72835 9.55615 9.33447C9.78532 8.94059 10.1076 8.63265 10.5229 8.41064C10.9383 8.18506 11.4092 8.07227 11.9355 8.07227C12.7412 8.07227 13.366 8.26562 13.8101 8.65234C14.2576 9.03906 14.4814 9.58512 14.4814 10.2905C14.4814 10.6772 14.3812 11.0711 14.1807 11.4722C13.9801 11.8732 13.6364 12.3405 13.1494 12.874L11.3716 14.7485H14.7339V16Z" fill="black"/>
</svg>
