<svg width="24" height="24" viewBox="0 0 24 24" fill="none" xmlns="http://www.w3.org/2000/svg">
    <path fill-rule="evenodd" clip-rule="evenodd" d="M12 1C12.4418 1 12.8 1.35817 12.8 1.8V5.0578C16.0198 5.42479 18.5752 7.98019 18.9422 11.2H22.2C22.6418 11.2 23 11.5582 23 12C23 12.4418 22.6418 12.8 22.2 12.8H18.9422C18.5752 16.0198 16.0198 18.5752 12.8 18.9422V22.2C12.8 22.6418 12.4418 23 12 23C11.5582 23 11.2 22.6418 11.2 22.2V18.9422C7.98019 18.5752 5.42479 16.0198 5.0578 12.8H1.8C1.35817 12.8 1 12.4418 1 12C1 11.5582 1.35817 11.2 1.8 11.2H5.05784C5.24429 9.56561 5.99494 8.10181 7.10871 7.00996C7.42422 6.70066 7.93073 6.70569 8.24003 7.0212C8.54933 7.33671 8.54429 7.84322 8.22879 8.15252C7.23041 9.13124 6.6125 10.4927 6.6125 12C6.6125 14.9754 9.02457 17.3875 12 17.3875C14.9754 17.3875 17.3875 14.9754 17.3875 12C17.3875 9.02457 14.9754 6.6125 12 6.6125C11.5582 6.6125 11.2 6.25433 11.2 5.8125C11.2 5.79359 11.2007 5.77483 11.2019 5.75625C11.2007 5.73767 11.2 5.71891 11.2 5.7V1.8C11.2 1.35817 11.5582 1 12 1ZM13.5 12C13.5 11.1664 12.8335 10.5 12 10.5C11.1684 10.5 10.5 11.1668 10.5 12C10.5 12.8331 11.1684 13.5 12 13.5C12.8335 13.5 13.5 12.8335 13.5 12Z" fill="#0070A6"/>
</svg>
