<svg width="20" height="15" viewBox="0 0 20 15" fill="none" xmlns="http://www.w3.org/2000/svg">
<rect y="5" width="20" height="5" fill="#0039A6"/>
<path d="M0 1C0 0.447715 0.447715 0 1 0H19C19.5523 0 20 0.447715 20 1V5H0V1Z" fill="white"/>
<path d="M0 10H20V14C20 14.5523 19.5523 15 19 15H1C0.447716 15 0 14.5523 0 14V10Z" fill="#E62D3B"/>
</svg>
