<svg width="24" height="24" viewBox="0 0 24 24" fill="none" xmlns="http://www.w3.org/2000/svg">
    <path d="M10.5 13.7321C9.16666 12.9623 9.16667 11.0378 10.5 10.268L18 5.93784C19.3333 5.16804 21 6.13029 21 7.66989L21 16.3301C21 17.8697 19.3333 18.832 18 18.0622L10.5 13.7321Z" fill="#0070A6"/>
    <path d="M4 18C4 18.5523 4.44772 19 5 19C5.55228 19 6 18.5523 6 18L6 6C6 5.44771 5.55229 5 5 5C4.44772 5 4 5.44771 4 6L4 18Z" fill="#0070A6"/>
</svg>
