<svg width="16" height="16" viewBox="0 0 16 16" fill="none" xmlns="http://www.w3.org/2000/svg">
<path fill-rule="evenodd" clip-rule="evenodd" d="M1.5 1C0.671573 1 0 1.67157 0 2.5V12.5C0 13.3284 0.671573 14 1.5 14H6.5C6.77614 14 7 13.7761 7 13.5C7 13.2239 6.77614 13 6.5 13H1.5C1.22386 13 1 12.7761 1 12.5V2.5C1 2.22386 1.22386 2 1.5 2H8.5C8.77614 2 9 2.22386 9 2.5V6C9 6.27614 9.22386 6.5 9.5 6.5C9.77614 6.5 10 6.27614 10 6V2.5C10 1.67157 9.32843 1 8.5 1H1.5ZM11.0033 11.3263L10.0033 11.3282V13.332C10.0033 13.6082 9.77944 13.832 9.50329 13.832C9.22715 13.832 9.00329 13.6082 9.00329 13.332V11.3301L8.00329 11.332L9.49362 9.33203L11.0033 11.3263Z" fill="#0070A6"/>
<rect x="3" y="5" width="4" height="1" fill="#0070A6"/>
<rect x="3" y="7" width="4" height="1" fill="#0070A6"/>
<rect x="3" y="9" width="2" height="1" fill="#0070A6"/>
</svg>
