<svg width="16" height="16" viewBox="0 0 16 16" fill="none" xmlns="http://www.w3.org/2000/svg">
<path d="M7.68018 1.60001V0H8.32018V1.60001H10.5602C10.7372 1.60001 10.8802 1.74337 10.8802 1.92001V3.52001H12.4802C12.6572 3.52001 12.8002 3.66337 12.8002 3.84001V5.71585L8.30548 4.20961C8.20788 4.17697 8.10516 4.16001 8.00084 4.16001C7.89876 4.16001 7.79732 4.17633 7.69972 4.20833L3.2002 5.70785V3.84001C3.2002 3.66337 3.34356 3.52001 3.5202 3.52001H5.1202V1.92001C5.1202 1.74337 5.26356 1.60001 5.4402 1.60001H7.68018Z" fill="#0070A6"/>
<path fill-rule="evenodd" clip-rule="evenodd" d="M14.9389 7.5392C14.8068 7.21984 14.5425 6.97408 14.2135 6.86464L8.10182 4.81664C8.03622 4.79456 7.96518 4.79488 7.89894 4.81664L1.75494 6.86464C1.44326 6.96864 1.19654 7.19232 1.06086 7.49504C0.924857 7.79808 0.920697 8.14496 1.0551 8.4576L2.24006 10.9523V13.0378C2.39974 12.927 2.58918 12.864 2.78406 12.864C3.0039 12.864 3.21862 12.9405 3.38982 13.0794C3.6679 13.3053 4.1831 13.4083 4.54406 13.4083C4.90502 13.4083 5.42022 13.3053 5.6983 13.0797C5.86886 12.9405 6.0839 12.864 6.30406 12.864C6.5239 12.864 6.73862 12.9405 6.90982 13.0794C7.1879 13.3053 7.7031 13.4083 8.06406 13.4083C8.42502 13.4083 8.9399 13.3053 9.21926 13.0784C9.39014 12.9402 9.60486 12.864 9.82438 12.864C10.0445 12.864 10.2593 12.9405 10.4298 13.0794C10.7079 13.3053 11.2231 13.4083 11.5841 13.4083C11.945 13.4083 12.4599 13.3053 12.7393 13.0784C12.9101 12.9402 13.1249 12.864 13.3444 12.864C13.4893 12.864 13.6308 12.9002 13.7601 12.9626V10.9504L14.9105 8.46336C15.0532 8.17728 15.0634 7.84064 14.9389 7.5392ZM5.28006 9.6C5.01478 9.6 4.80006 9.24192 4.80006 8.8C4.80006 8.35808 5.01478 8 5.28006 8C5.54534 8 5.76006 8.35808 5.76006 8.8C5.76006 9.24192 5.54534 9.6 5.28006 9.6ZM10.7201 9.6C10.4551 9.6 10.2401 9.24192 10.2401 8.8C10.2401 8.35808 10.4551 8 10.7201 8C10.985 8 11.2001 8.35808 11.2001 8.8C11.2001 9.24192 10.985 9.6 10.7201 9.6Z" fill="#0070A6"/>
</svg>
