<svg width="16" height="16" viewBox="0 0 16 16" fill="none" xmlns="http://www.w3.org/2000/svg">
<path fill-rule="evenodd" clip-rule="evenodd" d="M0 2.625C0 1.72754 0.671573 1 1.5 1H8.5C9.32843 1 10 1.72754 10 2.625V6.41667C10 6.71582 9.77614 6.95833 9.5 6.95833C9.22386 6.95833 9 6.71582 9 6.41667V2.625C9 2.32585 8.77614 2.08333 8.5 2.08333H1.5C1.22386 2.08333 1 2.32585 1 2.625V12.375C1 12.6742 1.22386 12.9167 1.5 12.9167H6.5C6.77614 12.9167 7 13.1592 7 13.4583C7 13.7575 6.77614 14 6.5 14H1.5C0.671573 14 0 13.2725 0 12.375V2.625ZM4.55144 7.5L3.12996 4.79167H4.46209L5.16065 6.41304C5.21548 6.54099 5.26421 6.69837 5.30686 6.875H5.31498C5.3424 6.7697 5.39519 6.60439 5.46931 6.39493L6.24097 4.79167H7.45939L6.00541 7.47283L7.5 10.2083H6.20848L5.36372 8.44203C5.33224 8.37636 5.29975 8.25634 5.26625 8.07971H5.25812C5.24188 8.16236 5.20329 8.29144 5.1444 8.46014L4.29964 10.2083H3L4.55144 7.5ZM11.0033 11.1052L10.0033 11.1073V13.3197C10.0033 13.5959 9.77948 13.8197 9.50333 13.8197C9.22719 13.8197 9.00333 13.5959 9.00333 13.3197V11.1093L8.00333 11.1114L9.49366 8.94471L11.0033 11.1052Z" fill="#0070A6"/>
</svg>
