<svg width="24" height="24" viewBox="0 0 24 24" fill="none" xmlns="http://www.w3.org/2000/svg">
    <path d="M11.2079 2V3.6H8.0396V6H4.87129V10.725L4.20297 10.875V10.9C2.77352 11.2125 2.06498 12.8844 2.81683 14.15L4.07921 16.3V20.275C3.43874 20.0938 2.9901 19.775 2.9901 19.775L2 21.025C2 21.025 3.22215 22 4.89604 22C6.05322 22 6.7896 21.6125 7.24752 21.325C7.70854 21.6094 8.48205 22 9.64851 22C10.8057 22 11.5421 21.6125 12 21.325C12.461 21.6094 13.2345 22 14.401 22C15.5582 22 16.2946 21.6125 16.7525 21.325C17.2135 21.6094 17.987 22 19.1535 22C20.8274 22 22 21.025 22 21.025L21.0099 19.775C21.0099 19.775 20.5798 20.1219 19.9208 20.3V16.3L21.1832 14.15C21.935 12.8844 21.2265 11.2125 19.797 10.9L19.1287 10.75V6H15.9604V3.6H12.7921V2H11.2079ZM9.62376 5.2H14.3762V7.6H17.5446V10.4L12.1733 9.225L12 9.2L11.8267 9.225L6.45545 10.4V7.6H9.62376V5.2ZM12 10.85L19.4505 12.45C19.8651 12.5406 20.0662 12.9594 19.8465 13.325L18.4604 15.675L18.3366 15.85V20.275C17.6962 20.0938 17.2475 19.775 17.2475 19.775L16.7525 19.375L16.2574 19.775C16.2574 19.775 15.4623 20.4 14.401 20.4C13.3397 20.4 12.495 19.775 12.495 19.775L12 19.375L11.505 19.775C11.505 19.775 10.7098 20.4 9.64851 20.4C8.58725 20.4 7.74257 19.775 7.74257 19.775L7.24752 19.375L6.75248 19.775C6.75248 19.775 6.3224 20.1219 5.66337 20.3V15.85L5.5396 15.675L4.15347 13.325C3.93379 12.9563 4.1349 12.5406 4.5495 12.45L12 10.85ZM8.0396 12.4C7.56312 12.4 7.24752 12.9594 7.24752 13.6C7.24752 14.2406 7.56312 14.8 8.0396 14.8C8.51609 14.8 8.83168 14.2406 8.83168 13.6C8.83168 12.9594 8.51609 12.4 8.0396 12.4ZM15.9604 12.4C15.4839 12.4 15.1683 12.9594 15.1683 13.6C15.1683 14.2406 15.4839 14.8 15.9604 14.8C16.4369 14.8 16.7525 14.2406 16.7525 13.6C16.7525 12.9594 16.4369 12.4 15.9604 12.4Z" fill="#0070A6"/>
</svg>
