<svg width="16" height="14" viewBox="0 0 16 14" fill="none" xmlns="http://www.w3.org/2000/svg">
    <path fill-rule="evenodd" clip-rule="evenodd" d="M8 10V2H0V1C0 0.447715 0.447715 0 1 0H9C9.55228 0 10 0.447715 10 1V3H11.1019C11.6731 3 12.2172 3.2443 12.5967 3.67127L15.4948 6.93167C15.8202 7.29777 16 7.77057 16 8.2604V10C16 11.1046 15.1046 12 14 12C14 13.1046 13.1046 14 12 14C10.8954 14 10 13.1046 10 12C8.36869 12 6.66572 12 5 12C5 13.1046 4.10457 14 3 14C1.89543 14 1 13.1046 1 12C0.447716 12 0 11.5523 0 11V10H8ZM10 10H14V8.2604L11.1019 5H10V10ZM3.5 12C3.5 12.2761 3.27614 12.5 3 12.5C2.72386 12.5 2.5 12.2761 2.5 12C2.5 11.7239 2.72386 11.5 3 11.5C3.27614 11.5 3.5 11.7239 3.5 12ZM12 12.5C12.2761 12.5 12.5 12.2761 12.5 12C12.5 11.7239 12.2761 11.5 12 11.5C11.7239 11.5 11.5 11.7239 11.5 12C11.5 12.2761 11.7239 12.5 12 12.5Z" fill="#FFB137"/>
    <path d="M4.00946 7.99679C4.01025 8.4094 4.48226 8.64354 4.81124 8.3945L7.4692 6.38245C7.73475 6.18144 7.73324 5.78187 7.46618 5.58286L4.80065 3.59661C4.47049 3.35059 4.00111 3.58674 4.00189 3.99849L4.00379 5.00001L4 5H1C0.447715 5 0 5.44772 0 6C0 6.55228 0.447715 7 1 7H4L4.00758 6.99997L4.00946 7.99679Z" fill="#FFB137"/>
</svg>
