<svg width="24" height="24" viewBox="0 0 24 24" fill="none" xmlns="http://www.w3.org/2000/svg">
<path fill-rule="evenodd" clip-rule="evenodd" d="M17.8948 4.52959L6.34926 16.0751L5.28231 18.9603L8.16753 17.8934L19.713 6.34787L17.8948 4.52959ZM18.6061 2.60611C18.2713 2.27138 17.7051 2.29493 17.3413 2.65872L4.98158 15.0184C4.87932 15.1207 4.80037 15.2434 4.75099 15.377L2.97274 20.1857C2.71061 20.8945 3.3481 21.532 4.05695 21.2699L8.86565 19.4916C8.9992 19.4423 9.12196 19.3633 9.22422 19.2611L21.5839 6.90136C21.9477 6.53757 21.9713 5.9713 21.6365 5.63657L18.6061 2.60611Z" fill="#0070A6"/>
<path fill-rule="evenodd" clip-rule="evenodd" d="M17.0257 10.2474L13.3891 6.61087L14.7065 5.29348L18.3431 8.93003L17.0257 10.2474Z" fill="#0070A6"/>
<path fill-rule="evenodd" clip-rule="evenodd" d="M7.85647 18.2044L5.43211 15.78L6.7495 14.4626L9.17386 16.887L7.85647 18.2044Z" fill="#0070A6"/>
</svg>
