<svg width="24" height="24" viewBox="0 0 24 24" fill="none" xmlns="http://www.w3.org/2000/svg">
    <path d="M18 2C16.3438 2 15 3.34375 15 5C15 6.65625 16.3438 8 18 8C19.6562 8 21 6.65625 21 5C21 3.34375 19.6562 2 18 2ZM18 16C16.3438 16 15 17.3438 15 19C15 20.6562 16.3438 22 18 22C19.6562 22 21 20.6562 21 19C21 17.3438 19.6562 16 18 16ZM6 9C4.34375 9 3 10.3438 3 12C3 13.6562 4.34375 15 6 15C7.65625 15 9 13.6562 9 12C9 10.3438 7.65625 9 6 9Z" fill="#0070A6"/>
    <path fill-rule="evenodd" clip-rule="evenodd" d="M7.98464 12L18.5039 5.86378L17.4961 4.13622L4.01537 12L17.4961 19.8638L18.5039 18.1362L7.98464 12Z" fill="#0070A6"/>
</svg>
