<svg width="24" height="24" viewBox="0 0 24 24" fill="none" xmlns="http://www.w3.org/2000/svg">
    <path fill-rule="evenodd" clip-rule="evenodd" d="M6.44737 7.10638C6.44737 4.01111 8.92447 1.5 12 1.5C15.0755 1.5 17.5526 4.01111 17.5526 7.10638V8.73404H18.7368C19.7104 8.73404 20.5 9.5397 20.5 10.5106V20.7234C20.5 21.6943 19.7104 22.5 18.7368 22.5H5.26316C4.28961 22.5 3.5 21.6943 3.5 20.7234V10.5106C3.5 9.5397 4.28961 8.73404 5.26316 8.73404H6.44737V7.10638ZM15.7105 7.10638C15.7105 5.00884 14.0626 3.35106 12 3.35106C9.93737 3.35106 8.28947 5.00884 8.28947 7.10638V8.73404H15.7105V7.10638ZM5.34211 10.5851V20.6489H18.6579V10.5851H5.34211ZM10.2368 14.766C10.2368 13.7717 11.0034 12.9894 12 12.9894C12.9966 12.9894 13.7632 13.7717 13.7632 14.766C13.7632 15.2034 13.6043 15.6046 13.3421 15.9046V16.8936C13.3421 17.6335 12.7449 18.2447 12 18.2447C11.2551 18.2447 10.6579 17.6335 10.6579 16.8936V15.9046C10.3957 15.6046 10.2368 15.2034 10.2368 14.766Z" fill="#0070A6"/>
</svg>
