<svg width="18" height="43" viewBox="0 0 18 43" fill="none" xmlns="http://www.w3.org/2000/svg">
    <circle cx="9" cy="34" r="3.5" fill="#B0C6E7" stroke="white"/>
    <path d="M2.74346 17.9581C2.0333 19.0976 2.94842 20.5 4.22851 20.5H13.7715C15.0516 20.5 15.9667 19.0976 15.2565 17.9581L10.4851 10.3025C10.485 10.3025 10.485 10.3024 10.485 10.3024C9.8184 9.23251 8.17996 9.23253 7.51339 10.3025L2.74346 17.9581ZM2.74346 17.9581C2.74348 17.9581 2.74349 17.9581 2.74351 17.9581L7.51337 10.3025L2.74346 17.9581Z" fill="#10CF96" stroke="white"/>
    <path fill-rule="evenodd" clip-rule="evenodd" d="M8.5 31L8.5 20L9.5 20L9.5 31L8.5 31Z" fill="#B0C6E7"/>
</svg>
