[
  {
    "uuid": "fd65aa3a-a9f8-4e20-be0e-702c8df64555",
    "parent_uuid": "8f28eec4-ded4-4736-ade6-f3c10904b5a5",
    "code": "dictionaries__sb_dictionaries__requisite_groups",
    "title": "Группы реквизитов",
    "position": 1,
    "level": 3
  },
  {
    "uuid": "23961e74-f9e2-4720-96ae-25a50a3e7f9d",
    "parent_uuid": "2a4dd894-49a3-45b5-bba7-faa3868739b7",
    "code": "dictionaries__services__service_measurement_units",
    "title": "Единицы измерения",
    "position": 3,
    "level": 3
  },
  {
    "uuid": "8f28eec4-ded4-4736-ade6-f3c10904b5a5",
    "parent_uuid": "f6bd4b89-4c1f-49c2-a120-72d4595e34f3",
    "code": "dictionaries__sb_dictionaries",
    "title": "СБ",
    "position": 7,
    "level": 2
  },
  {
    "uuid": "3c956b5f-ece8-4ad3-bcdb-2815e5724341",
    "parent_uuid": "408e0c2b-0c30-417f-9947-2bac2abf7919",
    "code": "settings__admin__contractor_roles",
    "title": "Роли участников",
    "position": 1,
    "level": 3
  },
  {
    "uuid": "97949288-e1db-4d05-aa98-ad47cf8cca9f",
    "parent_uuid": null,
    "code": "seal",
    "title": "Пломба",
    "position": 2,
    "level": 1
  },
  {
    "uuid": "cbccb467-de44-4bb5-94e9-b5120dc9e4e6",
    "parent_uuid": "156241d2-2442-4857-a494-8b52280d8e01",
    "code": "dictionaries__cargo__tnved",
    "title": "Коды ТН ВЭД",
    "position": 4,
    "level": 3
  },
  {
    "uuid": "8fb89bdb-47f6-467c-a825-d7a8d2e48f91",
    "parent_uuid": null,
    "code": "task_monitor",
    "title": "Монитор задач",
    "position": 9,
    "level": 3
  },
  {
    "uuid": "33e596ba-838a-4936-badb-8e5618a6f05b",
    "parent_uuid": "8f28eec4-ded4-4736-ade6-f3c10904b5a5",
    "code": "dictionaries__sb_dictionaries__law_articles",
    "title": "Статьи ГК и УК",
    "position": 7,
    "level": 3
  },
  {
    "uuid": "b28eca68-1b72-44d7-bedc-0bd05936d96d",
    "parent_uuid": "04d30882-5316-478a-a934-d341945b8a4d",
    "code": "dictionaries__resources__pattern_masks",
    "title": "Маски ресурсов",
    "position": 4,
    "level": 3
  },
  {
    "uuid": "074f1d33-bdcb-45ec-a734-fea692271bfa",
    "parent_uuid": "2dd6d2e9-6316-4ed9-b5b5-9094909e0262",
    "code": "settings__sb_settings__participant_fields",
    "title": "Поля участников",
    "position": 1,
    "level": 3
  },
  {
    "uuid": "9be9e40d-ad68-4832-a26a-8fb20c616591",
    "parent_uuid": "408e0c2b-0c30-417f-9947-2bac2abf7919",
    "code": "settings__admin__all_users",
    "title": "Все пользователи",
    "position": 5,
    "level": 3
  },
  {
    "uuid": "d4e3775d-2136-4b9e-b43a-89d7d90bfed0",
    "parent_uuid": null,
    "code": "analytics",
    "title": "Аналитика",
    "position": 5,
    "level": 1
  },
  {
    "uuid": "90406a21-edff-47e1-a47b-8584b2ac9f8d",
    "parent_uuid": "2d132903-70f3-4daa-ad7a-4d1c5b97eae3",
    "code": "dictionaries__locations__location_types",
    "title": "Типы локаций",
    "position": 1,
    "level": 3
  },
  {
    "uuid": "361b8501-9e18-4dda-95f6-367bfe12fb66",
    "parent_uuid": "00531cb8-d5fc-4ce8-8de1-0539be7f13ab",
    "code": "settings__log_domains__individual_domain_settings",
    "title": "Индивидуальные настройки",
    "position": 4,
    "level": 3
  },
  {
    "uuid": "94f65e70-bc4f-42ae-8158-2f908588dc00",
    "parent_uuid": "2a4dd894-49a3-45b5-bba7-faa3868739b7",
    "code": "dictionaries__services__activities",
    "title": "Направления деятельности",
    "position": 5,
    "level": 3
  },
  {
    "uuid": "408e0c2b-0c30-417f-9947-2bac2abf7919",
    "parent_uuid": "8069f14d-2e63-48c4-b6ab-e9035e38e3ad",
    "code": "settings__admin",
    "title": "Администрирование",
    "position": 1,
    "level": 2
  },
  {
    "uuid": "de39f30d-5b37-4267-a5c6-85fb43fefc0f",
    "parent_uuid": "156241d2-2442-4857-a494-8b52280d8e01",
    "code": "dictionaries__cargo__dangerous_goods_classes",
    "title": "Классы опасных грузов",
    "position": 2,
    "level": 3
  },
  {
    "uuid": "5822f853-978f-420f-b74e-ceb6ea850120",
    "parent_uuid": "f6bd4b89-4c1f-49c2-a120-72d4595e34f3",
    "code": "dictionaries__temperature",
    "title": "Температура",
    "position": 3,
    "level": 2
  },
  {
    "uuid": "65190845-e883-49d0-985b-d25b9e91ceb2",
    "parent_uuid": "2a4dd894-49a3-45b5-bba7-faa3868739b7",
    "code": "dictionaries__services__document_types",
    "title": "Типы документов",
    "position": 4,
    "level": 3
  },
  {
    "uuid": "37a8d979-4292-4e95-804c-e2cea2a84ed1",
    "parent_uuid": "408e0c2b-0c30-417f-9947-2bac2abf7919",
    "code": "settings__admin__user_roles",
    "title": "Роли пользователей",
    "position": 3,
    "level": 3
  },
  {
    "uuid": "2dd6d2e9-6316-4ed9-b5b5-9094909e0262",
    "parent_uuid": "8069f14d-2e63-48c4-b6ab-e9035e38e3ad",
    "code": "settings__sb_settings",
    "title": "СБ",
    "position": 3,
    "level": 2
  },
  {
    "uuid": "04d30882-5316-478a-a934-d341945b8a4d",
    "parent_uuid": "f6bd4b89-4c1f-49c2-a120-72d4595e34f3",
    "code": "dictionaries__resources",
    "title": "Ресурсы",
    "position": 5,
    "level": 2
  },
  {
    "uuid": "f6bd4b89-4c1f-49c2-a120-72d4595e34f3",
    "parent_uuid": null,
    "code": "dictionaries",
    "title": "Справочники",
    "position": 8,
    "level": 1
  },
  {
    "uuid": "a1d675a6-ed3a-45fa-a8d2-87f2c8b42696",
    "parent_uuid": "04d30882-5316-478a-a934-d341945b8a4d",
    "code": "dictionaries__resources__patterns",
    "title": "Шаблоны характеристик ресурсов",
    "position": 3,
    "level": 3
  },
  {
    "uuid": "2b7ffe39-4dfe-461d-8c56-c4252e1cd9f9",
    "parent_uuid": "5822f853-978f-420f-b74e-ceb6ea850120",
    "code": "dictionaries__temperature__temperature_transportation_modes",
    "title": "Температурные режимы транспортировки",
    "position": 2,
    "level": 3
  },
  {
    "uuid": "da3b527f-0a86-454b-bb5b-e6ca90cd0b66",
    "parent_uuid": "8f28eec4-ded4-4736-ade6-f3c10904b5a5",
    "code": "dictionaries__sb_dictionaries__registration_docs",
    "title": "Типы регистрационных документов",
    "position": 3,
    "level": 3
  },
  {
    "uuid": "0e1f6315-795e-48eb-be9b-c3c1ad834b55",
    "parent_uuid": "8f28eec4-ded4-4736-ade6-f3c10904b5a5",
    "code": "dictionaries__sb_dictionaries__loss_risks",
    "title": "Риски утери груза",
    "position": 6,
    "level": 3
  },
  {
    "uuid": "7ec1b945-66fe-49af-93ee-e4de3a8dbb5e",
    "parent_uuid": "8f28eec4-ded4-4736-ade6-f3c10904b5a5",
    "code": "dictionaries__sb_dictionaries__okved",
    "title": "ОКВЭД",
    "position": 9,
    "level": 3
  },
  {
    "uuid": "431143d3-fef9-4087-ae3c-d378dc2c0563",
    "parent_uuid": "2dd6d2e9-6316-4ed9-b5b5-9094909e0262",
    "code": "settings__sb_settings__resource_fields",
    "title": "Поля ресурсов",
    "position": 2,
    "level": 3
  },
  {
    "uuid": "ac17952b-8212-4978-8359-12562d0c6b6c",
    "parent_uuid": "04d30882-5316-478a-a934-d341945b8a4d",
    "code": "dictionaries__resources__tracking_methods",
    "title": "Методы трекинга",
    "position": 6,
    "level": 3
  },
  {
    "uuid": "8787233b-9128-48ab-be9c-b160996dff15",
    "parent_uuid": "0f8feb2c-a6a7-45d5-a210-f317cf143f84",
    "code": "dictionaries__common__countries",
    "title": "Страны",
    "position": 1,
    "level": 3
  },
  {
    "uuid": "8069f14d-2e63-48c4-b6ab-e9035e38e3ad",
    "parent_uuid": null,
    "code": "settings",
    "title": "Настройки",
    "position": 9,
    "level": 1
  },
  {
    "uuid": "90cf2d4d-daba-4466-b79e-69a8b4507ff9",
    "parent_uuid": "5822f853-978f-420f-b74e-ceb6ea850120",
    "code": "dictionaries__temperature__temperature_recorders",
    "title": "Температурные регистраторы",
    "position": 1,
    "level": 3
  },
  {
    "uuid": "0af5a8e8-88b5-409c-aaaf-2c0f734e5f18",
    "parent_uuid": "8f28eec4-ded4-4736-ade6-f3c10904b5a5",
    "code": "dictionaries__sb_dictionaries__organization_forms",
    "title": "Формы организации",
    "position": 8,
    "level": 3
  },
  {
    "uuid": "e68ca0db-a04e-42a9-a49e-74ae6547f503",
    "parent_uuid": null,
    "code": "payments",
    "title": "Оплаты",
    "position": 6,
    "level": 1
  },
  {
    "uuid": "0bb299fd-5a83-472c-9865-8fe8cf9211ba",
    "parent_uuid": "8f28eec4-ded4-4736-ade6-f3c10904b5a5",
    "code": "dictionaries__sb_dictionaries__verification_date",
    "title": "Сроки действия проверки",
    "position": 4,
    "level": 3
  },
  {
    "uuid": "0f8feb2c-a6a7-45d5-a210-f317cf143f84",
    "parent_uuid": "f6bd4b89-4c1f-49c2-a120-72d4595e34f3",
    "code": "dictionaries__common",
    "title": "Общие",
    "position": 1,
    "level": 2
  },
  {
    "uuid": "848a1441-7db7-4cbf-aaa9-969e157fee4d",
    "parent_uuid": "8f28eec4-ded4-4736-ade6-f3c10904b5a5",
    "code": "dictionaries__sb_dictionaries__price_categories",
    "title": "Категории стоимости",
    "position": 5,
    "level": 3
  },
  {
    "uuid": "6b555a69-380a-4517-b628-c1a40586fa6d",
    "parent_uuid": "00531cb8-d5fc-4ce8-8de1-0539be7f13ab",
    "code": "settings__log_domains__individual_domain_settings_exp",
    "title": "Индивидуальные настройки экспедитора",
    "position": 5,
    "level": 3
  },
  {
    "uuid": "cfe413d9-2319-4d28-8287-a435cbbc6bc5",
    "parent_uuid": "00531cb8-d5fc-4ce8-8de1-0539be7f13ab",
    "code": "settings__log_domains__domain_settings_exp",
    "title": "Доменные настройки экспедитора",
    "position": 3,
    "level": 3
  },
  {
    "uuid": "4450d6e3-cc64-46ca-b744-630274091f9b",
    "parent_uuid": null,
    "code": "contracts",
    "title": "Договор",
    "position": 7,
    "level": 1
  },
  {
    "uuid": "83ba89db-e8c1-4ef3-92cf-1b2c94d4342f",
    "parent_uuid": null,
    "code": "monitoring",
    "title": "Мониторинг",
    "position": 3,
    "level": 1
  },
  {
    "uuid": "c29f04c0-9a08-4d5e-b6d6-ccbbcedf1076",
    "parent_uuid": null,
    "code": "documents",
    "title": "Документы",
    "position": 4,
    "level": 1
  },
  {
    "uuid": "544a7ba0-3fd6-4c72-bc8e-9c4bf3dbbe9e",
    "parent_uuid": "156241d2-2442-4857-a494-8b52280d8e01",
    "code": "dictionaries__cargo__etsng",
    "title": "Коды ЕТСНГ",
    "position": 3,
    "level": 3
  },
  {
    "uuid": "aeb582c2-a72e-43e7-ace1-066014d63927",
    "parent_uuid": "2a4dd894-49a3-45b5-bba7-faa3868739b7",
    "code": "dictionaries__services__services_list",
    "title": "Услуги",
    "position": 1,
    "level": 3
  },
  {
    "uuid": "08d940bb-7fce-4013-b026-762c2a5f7639",
    "parent_uuid": "0f8feb2c-a6a7-45d5-a210-f317cf143f84",
    "code": "dictionaries__common__customs_unions",
    "title": "Таможенные союзы",
    "position": 2,
    "level": 3
  },
  {
    "uuid": "e6dd568c-db82-469b-9df7-fc7b5209739b",
    "parent_uuid": "04d30882-5316-478a-a934-d341945b8a4d",
    "code": "dictionaries__resources__resource_types",
    "title": "Типы ресурсов",
    "position": 1,
    "level": 3
  },
  {
    "uuid": "c295da45-0d18-4b6e-b867-9ef4f0007aef",
    "parent_uuid": "156241d2-2442-4857-a494-8b52280d8e01",
    "code": "dictionaries__cargo__cargo_types",
    "title": "Типы грузов",
    "position": 1,
    "level": 3
  },
  {
    "uuid": "2b15dd8a-b22d-430d-a6c0-49b412eac3fb",
    "parent_uuid": "00531cb8-d5fc-4ce8-8de1-0539be7f13ab",
    "code": "settings__log_domains__domain_settings",
    "title": "Доменные настройки модератора",
    "position": 2,
    "level": 3
  },
  {
    "uuid": "bc716b15-0013-41d3-8ae7-2bfb91014362",
    "parent_uuid": null,
    "code": "developing",
    "title": "В процессе разработки",
    "position": 10,
    "level": 3
  },
  {
    "uuid": "2d132903-70f3-4daa-ad7a-4d1c5b97eae3",
    "parent_uuid": "f6bd4b89-4c1f-49c2-a120-72d4595e34f3",
    "code": "dictionaries__locations",
    "title": "Локации",
    "position": 2,
    "level": 2
  },
  {
    "uuid": "e9d43f29-692c-442a-97c7-cf3356250a4a",
    "parent_uuid": "408e0c2b-0c30-417f-9947-2bac2abf7919",
    "code": "settings__admin__access",
    "title": "Доступы",
    "position": 2,
    "level": 3
  },
  {
    "uuid": "0bcb03ab-c35e-4bcc-9135-b57b7a171cca",
    "parent_uuid": "04d30882-5316-478a-a934-d341945b8a4d",
    "code": "dictionaries__resources__resource_species",
    "title": "Виды ресурсов",
    "position": 2,
    "level": 3
  },
  {
    "uuid": "205a552e-2980-4c8e-9096-6214c16280fb",
    "parent_uuid": "04d30882-5316-478a-a934-d341945b8a4d",
    "code": "dictionaries__resources__forwarding_unit",
    "title": "Единицы экспедиторского учёта",
    "position": 5,
    "level": 3
  },
  {
    "uuid": "a666c8b1-9ab3-4348-9db6-b3c845a14d9b",
    "parent_uuid": "2d132903-70f3-4daa-ad7a-4d1c5b97eae3",
    "code": "dictionaries__locations__locations_list",
    "title": "Локации",
    "position": 2,
    "level": 3
  },
  {
    "uuid": "d79c5975-9ffe-47fa-9c20-6fc61242bfa5",
    "parent_uuid": null,
    "code": "order",
    "title": "Заказы",
    "position": 1,
    "level": 1
  },
  {
    "uuid": "a2c55175-8a2e-4f5d-acec-a831bff09182",
    "parent_uuid": "2a4dd894-49a3-45b5-bba7-faa3868739b7",
    "code": "dictionaries__services__service_types",
    "title": "Типы услуг",
    "position": 2,
    "level": 3
  },
  {
    "uuid": "156241d2-2442-4857-a494-8b52280d8e01",
    "parent_uuid": "f6bd4b89-4c1f-49c2-a120-72d4595e34f3",
    "code": "dictionaries__cargo",
    "title": "Грузы",
    "position": 4,
    "level": 2
  },
  {
    "uuid": "97f95657-1ee5-4b9b-ba98-b44ae392b57f",
    "parent_uuid": "408e0c2b-0c30-417f-9947-2bac2abf7919",
    "code": "settings__admin__users",
    "title": "Пользователи",
    "position": 4,
    "level": 3
  },
  {
    "uuid": "00531cb8-d5fc-4ce8-8de1-0539be7f13ab",
    "parent_uuid": "8069f14d-2e63-48c4-b6ab-e9035e38e3ad",
    "code": "settings__log_domains",
    "title": "Логистические домены",
    "position": 2,
    "level": 2
  },
  {
    "uuid": "741e2d43-814e-4f34-a440-1873e8ed620d",
    "parent_uuid": "0f8feb2c-a6a7-45d5-a210-f317cf143f84",
    "code": "dictionaries__common__currencies",
    "title": "Валюты",
    "position": 3,
    "level": 3
  },
  {
    "uuid": "2a4dd894-49a3-45b5-bba7-faa3868739b7",
    "parent_uuid": "f6bd4b89-4c1f-49c2-a120-72d4595e34f3",
    "code": "dictionaries__services",
    "title": "Услуги",
    "position": 6,
    "level": 2
  },
  {
    "uuid": "9443f491-f9aa-4e30-a4d1-f1c765835921",
    "parent_uuid": "8f28eec4-ded4-4736-ade6-f3c10904b5a5",
    "code": "dictionaries__sb_dictionaries__external_sources",
    "title": "Внешние сервисы",
    "position": 2,
    "level": 3
  },
  {
    "uuid": "ab785f5e-e525-4da7-91d0-b09a2c3feaaf",
    "parent_uuid": "00531cb8-d5fc-4ce8-8de1-0539be7f13ab",
    "code": "settings__log_domains__link_browser",
    "title": "Браузер линков",
    "position": 1,
    "level": 3
  }
]