<svg width="24" height="24" viewBox="0 0 24 24" fill="none" xmlns="http://www.w3.org/2000/svg">
    <path fill-rule="evenodd" clip-rule="evenodd" d="M2 6C2 4.89543 2.89543 4 4 4H20C21.1046 4 22 4.89543 22 6V18C22 19.1046 21.1046 20 20 20H4C2.89543 20 2 19.1046 2 18V6ZM20 6L4 6V18H20V6Z" fill="#0070A6"/>
    <path d="M6 8H7V16H6V8Z" fill="#0070A6"/>
    <path d="M8 8H10V16H8V8Z" fill="#0070A6"/>
    <path d="M11 8H13V16H11V8Z" fill="#0070A6"/>
    <path d="M14 8H15V16H14V8Z" fill="#0070A6"/>
    <path d="M16 8H18V16H16V8Z" fill="#0070A6"/>
</svg>
