<svg width="24" height="24" viewBox="0 0 24 24" fill="none" xmlns="http://www.w3.org/2000/svg">
    <path d="M21.5 10.6011C22.8333 11.3709 22.8333 13.2954 21.5 14.0652L14 18.3953C12.6667 19.1651 11 18.2028 11 16.6632V8.00298C11 6.46338 12.6667 5.50113 14 6.27093L21.5 10.6011Z" fill="#0070A6"/>
    <path d="M12.5 10.6011C13.8333 11.3709 13.8333 13.2954 12.5 14.0652L5 18.3953C3.66666 19.1651 2 18.2028 2 16.6632L2 8.00298C2 6.46338 3.66667 5.50113 5 6.27093L12.5 10.6011Z" fill="#0070A6"/>
</svg>
