<svg width="51" height="24" viewBox="0 0 51 24" fill="none" xmlns="http://www.w3.org/2000/svg">
<g clip-path="url(#clip0)">
<path d="M16 13C15.4 13 15 12.6 15 12V5.00003C15 4.40003 15.4 4.00003 16 4.00003C16.6 4.00003 17 4.40003 17 5.00003V12C17 12.5 16.6 13 16 13Z" fill="#9DA0AC"/>
<path d="M13 11.2C12.7 11.2 12.3 11 12.1 10.7C11.8 10.2 12 9.60004 12.5 9.30004L18.6 5.80004C19.1 5.50004 19.7 5.70004 20 6.20004C20.3 6.70004 20.1 7.30003 19.6 7.60003L13.5 11.1C13.3 11.2 13.1 11.2 13 11.2Z" fill="#9DA0AC"/>
<path d="M19 11.2C18.8 11.2 18.7 11.2 18.5 11.1L12.4 7.60002C11.9 7.30002 11.8 6.70003 12 6.20003C12.2 5.70003 12.9 5.60004 13.4 5.80004L19.5 9.30004C20 9.60004 20.1 10.2 19.9 10.7C19.7 11.1 19.4 11.2 19 11.2Z" fill="#9DA0AC"/>
<path d="M43 24C40.8 24 39 22.2 39 20C39 17.8 40.8 16 43 16C45.2 16 47 17.8 47 20C47 22.2 45.2 24 43 24ZM43 18C41.9 18 41 18.9 41 20C41 21.1 41.9 22 43 22C44.1 22 45 21.1 45 20C45 18.9 44.1 18 43 18Z" fill="#9DA0AC"/>
<path d="M13 24C10.8 24 9 22.2 9 20C9 17.8 10.8 16 13 16C15.2 16 17 17.8 17 20C17 22.2 15.2 24 13 24ZM13 18C11.9 18 11 18.9 11 20C11 21.1 11.9 22 13 22C14.1 22 15 21.1 15 20C15 18.9 14.1 18 13 18Z" fill="#9DA0AC"/>
<path d="M40 21H16C15.4 21 15 20.6 15 20C15 19.4 15.4 19 16 19H40C40.6 19 41 19.4 41 20C41 20.6 40.6 21 40 21Z" fill="#9DA0AC"/>
<path d="M50 17H49C48.4 17 48 16.6 48 16C48 15.4 48.4 15 49 15H50C50.6 15 51 15.4 51 16C51 16.6 50.6 17 50 17Z" fill="#9DA0AC"/>
<path d="M49 21H46C45.4 21 45 20.6 45 20C45 19.4 45.4 19 46 19H49V13.9C49 13.5 48.8 13.2 48.5 13L46.2 11.8C46 11.7 45.9 11.5 45.8 11.3L43.9 7.10004C43.6 6.40004 42.9 5.90002 42.1 5.90002H36C35.4 5.90002 35 6.30002 35 6.90002V15.9C35 16.5 34.6 16.9 34 16.9H29C28.4 16.9 28 16.5 28 15.9V4.90002C28 4.30002 28.4 3.90002 29 3.90002H30V1.90002H2V13.9C2 14.5 2.4 14.9 3 14.9H25C25.6 14.9 26 15.3 26 15.9C26 16.5 25.6 16.9 25 16.9H3C1.3 16.9 0 15.6 0 13.9V0.900024C0 0.300024 0.4 -0.0999756 1 -0.0999756H30C31.1 -0.0999756 32 0.800024 32 1.90002V3.90002C32 5.00002 31.1 5.90002 30 5.90002V14.9H33V6.90002C33 5.20002 34.3 3.90002 36 3.90002H42.1C43.7 3.90002 45.1 4.80005 45.7 6.30005L47.4 10.2L49.4 11.3C50.4 11.8 51 12.8 51 13.9V19C51 20.1 50.1 21 49 21Z" fill="#9DA0AC"/>
<path d="M48.5 12H41C40.4 12 40 11.6 40 11V9.00003C40 8.40003 40.4 8.00003 41 8.00003H45L48.5 12Z" fill="#9DA0AC"/>
</g>
<defs>
<clipPath id="clip0">
<path d="M0 0H51V24H0V0Z" fill="white"/>
</clipPath>
</defs>
</svg>
