<svg width="24" height="24" viewBox="0 0 24 24" fill="none" xmlns="http://www.w3.org/2000/svg">
<path fill-rule="evenodd" clip-rule="evenodd" d="M12 18C16.4183 18 20 14.4183 20 10C20 5.58172 16.4183 2 12 2C7.58172 2 4 5.58172 4 10C4 14.4183 7.58172 18 12 18ZM22 10C22 15.1853 18.0533 19.4489 13 19.9506V23C13 23.5523 12.5523 24 12 24C11.4477 24 11 23.5523 11 23V19.9506C5.94668 19.4489 2 15.1853 2 10C2 4.47715 6.47715 0 12 0C17.5228 0 22 4.47715 22 10ZM12 15C12.5523 15 13 14.5523 13 14V5.92488C13 5.41408 12.5859 5 12.0751 5C11.6729 5 11.3181 5.26385 11.1103 5.60823C10.8437 6.05022 10.4103 6.56841 9.81005 6.83019C9.38819 7.01419 9 7.3731 9 7.83333C9 8.29357 9.3731 8.66667 9.83333 8.66667H11V14C11 14.5523 11.4477 15 12 15Z" fill="#9DA0AC"/>
</svg>
