<svg width="24" height="24" viewBox="0 0 24 24" fill="none" xmlns="http://www.w3.org/2000/svg">
    <path d="M13.2374 3C8.98833 3 5.47471 6.51362 5.47471 10.7626C5.47471 12.642 6.12841 14.2763 7.19066 15.5837L3.5637 19.2813C3.2515 19.5996 3.25396 20.11 3.56922 20.4253C3.88665 20.7427 4.40129 20.7427 4.71871 20.4253L8.33463 16.8093C9.64202 17.8716 11.358 18.5253 13.1556 18.5253C17.4047 18.5253 20.9183 15.0117 20.9183 10.7626C21 6.51362 17.5681 3 13.2374 3ZM13.2374 4.63424C16.5875 4.63424 19.2023 7.24903 19.3658 10.5175L19.2023 10.3541C19.2023 10.3541 17.0778 7.16732 13.2374 7.16732C9.39689 7.16732 7.27237 10.3541 7.27237 10.3541L7.10895 10.5175C7.27237 7.24903 9.96887 4.63424 13.2374 4.63424ZM13.2374 8.71984C15.607 8.71984 16.9144 10.1907 17.4047 10.7626C16.9144 11.4163 15.607 12.8054 13.2374 12.8054C10.8677 12.8054 9.56031 11.3346 9.07004 10.7626C9.56031 10.1907 10.8677 8.71984 13.2374 8.71984ZM13.2374 9.1284C12.3385 9.1284 11.6031 9.86381 11.6031 10.7626C11.6031 11.6615 12.3385 12.3969 13.2374 12.3969C14.1362 12.3969 14.8716 11.6615 14.8716 10.7626C14.8716 10.5992 14.8716 10.4358 14.7899 10.2724C14.6265 10.5992 14.3813 10.7626 14.0545 10.7626C13.5642 10.7626 13.2374 10.4358 13.2374 9.94553C13.2374 9.61868 13.4008 9.37354 13.7276 9.21012C13.5642 9.1284 13.4008 9.1284 13.2374 9.1284ZM7.10895 11.0078L7.27237 11.2529C7.27237 11.2529 9.39689 14.4397 13.2374 14.4397C17.0778 14.4397 19.2023 11.2529 19.2023 11.2529L19.3658 11.0078C19.2023 14.2763 16.5875 16.8911 13.2374 16.8911C9.88716 16.8911 7.27237 14.2763 7.10895 11.0078Z" fill="#0070A6"/>
</svg>
