{
  "countries": {
    "content": [
      {
        "uuid": "bee58ccc-b338-856d-a146-28c7c343a6f5",
        "regions": [
          {
            "uuid": "447ee95e-8bcb-4c16-bca7-e94fb84d193e",
            "name": "Абхазия",
            "local_name": "Абхазия"
          }
        ],
        "short_title": "Абхазия",
        "name_label": "country_abh",
        "short_name_label": "country_short_abh",
        "number_code": "895",
        "short_symbol_code": "ab",
        "symbol_code": "abh",
        "is_active": true
      },
      {
        "uuid": "0bf12486-ee69-1806-1943-a78ae47b60ae",
        "title": "Australia",
        "regions": [
          {
            "uuid": "c60de70d-08f0-46fb-985a-8653e92107fa",
            "name": "New South Wales",
            "local_name": "New South Wales"
          },
          {
            "uuid": "7ac0e67a-76b9-431b-9261-8682bdcaf313",
            "name": "aus",
            "local_name": "aus"
          },
          {
            "uuid": "4e2937bc-9223-4e4d-ab0c-9c5efc9515f6",
            "name": "Queensland",
            "local_name": "Queensland"
          },
          {
            "uuid": "f4abd7e5-daf5-469f-9c67-938737af9bea",
            "name": "Tasmania",
            "local_name": "Tasmania"
          },
          {
            "uuid": "3f584c63-80b7-4be2-83ab-bfc290add5f2",
            "name": "Western Australia",
            "local_name": "Western Australia"
          },
          {
            "uuid": "59cc5270-0fed-4db7-af7a-b4e9849729f4",
            "name": "Victoria",
            "local_name": "Victoria"
          },
          {
            "uuid": "9adb8f78-b51d-11e9-a2a3-2a2ae2dbcce4",
            "name": "регион",
            "local_name": "регион"
          },
          {
            "uuid": "dd2e77d1-9f66-4e4e-af90-ee65b4183c76",
            "name": "Northern Territory",
            "local_name": "Northern Territory"
          },
          {
            "uuid": "34601823-a956-4207-9257-9b6c06e9df92",
            "name": "None",
            "local_name": "None"
          },
          {
            "uuid": "5d5c5cd5-411a-451b-88a2-dad81d2b9d6d",
            "name": "South Australia",
            "local_name": "South Australia"
          },
          {
            "uuid": "f1ac8f31-b880-4c1f-9507-e65a54d82b35",
            "name": "Australian Capital Territory",
            "local_name": "Australian Capital Territory"
          },
          {
            "uuid": "3e497d98-5862-4731-8387-a152e6079430",
            "name": "aus1",
            "local_name": null
          }
        ],
        "title_eng": "Australia",
        "short_title": "Австралия",
        "name_label": "country_aus",
        "short_name_label": "country_short_aus",
        "number_code": "036",
        "short_symbol_code": "au",
        "symbol_code": "aus",
        "is_active": true
      },
      {
        "uuid": "ea0cacbf-1bb8-d62b-80b1-7d6c8c71a430",
        "regions": [
          {
            "uuid": "56c98e40-0388-4b53-adca-90ef1c490c0d",
            "name": "Steiermark",
            "local_name": "Steiermark"
          },
          {
            "uuid": "f726b05c-37a8-45ef-af40-73b13985484e",
            "name": "Salzburg",
            "local_name": "Salzburg"
          },
          {
            "uuid": "dfaa435e-e440-4136-9af8-2c4d11c62150",
            "name": "Vorarlberg",
            "local_name": "Vorarlberg"
          },
          {
            "uuid": "e57b0a91-a07b-47c2-83d9-1fa5f6852b12",
            "name": "Burgenland",
            "local_name": "Burgenland"
          },
          {
            "uuid": "b7a42a48-fbe7-4a0a-9e08-76e212ae1688",
            "name": "Wien",
            "local_name": "Wien"
          },
          {
            "uuid": "27a3cbb5-f667-4d04-b378-d1a75ec84f41",
            "name": "Niedersterreich",
            "local_name": "Niedersterreich"
          },
          {
            "uuid": "d415ba42-adbc-46c3-9e32-4090c7b508d8",
            "name": "Krnten",
            "local_name": "Krnten"
          },
          {
            "uuid": "fc86dd4e-8092-4d02-a38f-3c4dbeede3c5",
            "name": "Obersterreich",
            "local_name": "Obersterreich"
          },
          {
            "uuid": "6770a566-8a7d-4443-a46c-99275cca502f",
            "name": "Tirol",
            "local_name": "Tirol"
          }
        ],
        "short_title": "Австрия",
        "name_label": "country_aut",
        "short_name_label": "country_short_aut",
        "number_code": "040",
        "short_symbol_code": "at",
        "symbol_code": "aut",
        "is_active": true
      },
      {
        "uuid": "0f4c6008-b49d-b6a4-2e2b-850a441808bc",
        "regions": [
          {
            "uuid": "c4e6a6aa-7e30-4fb0-b035-7b7e83572d59",
            "name": "Нахичеванская обл.",
            "local_name": "Нахичеванская обл."
          },
          {
            "uuid": "fb967c04-f00a-4075-a5a9-6ddb6da7dd8a",
            "name": "Нагорный Карабах",
            "local_name": "Нагорный Карабах"
          },
          {
            "uuid": "24ccd5c0-cbe1-4913-b8c4-ae2db2b71c04",
            "name": "Азербайджан",
            "local_name": "Азербайджан"
          }
        ],
        "short_title": "Азербайджан",
        "name_label": "country_aze",
        "short_name_label": "country_short_aze",
        "number_code": "031",
        "short_symbol_code": "az",
        "symbol_code": "aze",
        "is_active": true
      },
      {
        "uuid": "e3d75564-f887-9d49-6611-579a89bbab40",
        "regions": [
          {
            "uuid": "3acedcd1-3c7b-461c-8d04-4f9918647126",
            "name": "Fier",
            "local_name": "Fier"
          },
          {
            "uuid": "074d5db4-e799-442d-add8-0e5b21600e68",
            "name": "Korce",
            "local_name": "Korce"
          },
          {
            "uuid": "b89d983c-a655-44b2-929f-be95cd362bd6",
            "name": "Diber",
            "local_name": "Diber"
          },
          {
            "uuid": "278f70f3-fa0b-4766-b315-cdf3bfc29daf",
            "name": "Tirane",
            "local_name": "Tirane"
          },
          {
            "uuid": "2001fa3e-205d-45a6-81b2-ab8282f0cf61",
            "name": "None",
            "local_name": "None"
          },
          {
            "uuid": "acbe7d21-92e9-4aa4-84ff-01690e156e04",
            "name": "Gjirokaster",
            "local_name": "Gjirokaster"
          },
          {
            "uuid": "c08a9cc0-a22e-4f4e-9959-96fec99919da",
            "name": "Vlore",
            "local_name": "Vlore"
          },
          {
            "uuid": "6d0aa77d-8fa7-4960-a910-c6725d764bca",
            "name": "Durres",
            "local_name": "Durres"
          },
          {
            "uuid": "4d0b9990-26dc-4efd-80c6-c95e65737174",
            "name": "Elbasan",
            "local_name": "Elbasan"
          },
          {
            "uuid": "8e746d41-a3b2-435c-a5b1-26d0ba6c4fb6",
            "name": "Shkoder",
            "local_name": "Shkoder"
          },
          {
            "uuid": "ccd4e51a-3264-42d4-9412-dcaa1d3ad947",
            "name": "Berat",
            "local_name": "Berat"
          },
          {
            "uuid": "1d69e6d0-f364-4182-96dc-533eab38cd87",
            "name": "Kukes",
            "local_name": "Kukes"
          }
        ],
        "short_title": "Албания",
        "name_label": "country_alb",
        "short_name_label": "country_short_alb",
        "number_code": "008",
        "short_symbol_code": "al",
        "symbol_code": "alb",
        "is_active": true
      },
      {
        "uuid": "b0edeedc-8e09-9625-2b71-4da6af85c802",
        "regions": [
          {
            "uuid": "d5442156-6f5e-4803-b420-7c24111afc7c",
            "name": "Алжир",
            "local_name": "Алжир"
          },
          {
            "uuid": "507fa0e2-c115-4349-8e8e-c33e432c7d09",
            "name": "dza",
            "local_name": "dza"
          }
        ],
        "short_title": "Алжир",
        "name_label": "country_dza",
        "short_name_label": "country_short_dza",
        "number_code": "012",
        "short_symbol_code": "dz",
        "symbol_code": "dza",
        "is_active": true
      },
      {
        "uuid": "2838b3df-ee75-4122-bd94-36cc2ffae4bc",
        "short_title": "Американское Самоа",
        "name_label": "country_asm",
        "short_name_label": "country_short_asm",
        "number_code": "016",
        "short_symbol_code": "as",
        "symbol_code": "asm",
        "is_active": true
      },
      {
        "uuid": "1fcb36b0-a13a-417b-9cab-3add532a249e",
        "short_title": "Ангилья",
        "name_label": "country_aia",
        "short_name_label": "country_short_aia",
        "number_code": "660",
        "short_symbol_code": "ai",
        "symbol_code": "aia",
        "is_active": true
      },
      {
        "uuid": "b3d51ceb-625f-1eef-0f4d-64ab968ea01d",
        "regions": [
          {
            "uuid": "8df878d4-1f13-4fec-a4cb-88b07b0f66c0",
            "name": "Ангола",
            "local_name": "Ангола"
          }
        ],
        "short_title": "Ангола",
        "name_label": "country_ago",
        "short_name_label": "country_short_ago",
        "number_code": "024",
        "short_symbol_code": "ao",
        "symbol_code": "ago",
        "is_active": true
      },
      {
        "uuid": "f07ed5ed-abb8-8c61-3661-c9d4843e323b",
        "regions": [
          {
            "uuid": "9e76acc4-9c0e-4167-85e9-cf06ebc1e90f",
            "name": "None",
            "local_name": "None"
          },
          {
            "uuid": "a615e775-f669-41b5-adf3-61b01a30717f",
            "name": "Sant Julia de Loria",
            "local_name": "Sant Julia de Loria"
          },
          {
            "uuid": "d1943dd1-b8c7-49b5-b6a8-94fdfc19846b",
            "name": "La Massana",
            "local_name": "La Massana"
          },
          {
            "uuid": "1d250c05-3695-4a29-9b22-51af6a079edf",
            "name": "Ordino",
            "local_name": "Ordino"
          },
          {
            "uuid": "29e0ca3f-3cec-4b9b-b389-28f714033fe6",
            "name": "Escaldes-Engordany",
            "local_name": "Escaldes-Engordany"
          },
          {
            "uuid": "43947dff-64f0-4894-897f-4fccab77c873",
            "name": "Andorra la Vella",
            "local_name": "Andorra la Vella"
          },
          {
            "uuid": "0f26f92f-8cac-4950-b010-e8b5294d86ff",
            "name": "Canillo",
            "local_name": "Canillo"
          },
          {
            "uuid": "dfd8e0ee-35cb-4a8c-917e-def2077129c0",
            "name": "Encamp",
            "local_name": "Encamp"
          }
        ],
        "short_title": "Андорра",
        "name_label": "country_and",
        "short_name_label": "country_short_and",
        "number_code": "020",
        "short_symbol_code": "ad",
        "symbol_code": "and",
        "is_active": true
      },
      {
        "uuid": "c2eb32f3-b020-4da6-bac3-d2d6e9133a43",
        "short_title": "Антарктида",
        "name_label": "country_ata",
        "short_name_label": "country_short_ata",
        "number_code": "010",
        "short_symbol_code": "aq",
        "symbol_code": "ata",
        "is_active": true
      },
      {
        "uuid": "8c3140d1-9e19-3d9a-675f-e6b97fcc5f97",
        "regions": [
          {
            "uuid": "b1514e6c-5713-4a2d-8bd4-f6ad2a0e2f16",
            "name": "Антигуа и Барбуда",
            "local_name": "Антигуа и Барбуда"
          }
        ],
        "short_title": "Антигуа и Барбуда",
        "name_label": "country_atg",
        "short_name_label": "country_short_atg",
        "number_code": "028",
        "short_symbol_code": "ag",
        "symbol_code": "atg",
        "is_active": true
      },
      {
        "uuid": "9bf612b2-4f8d-1294-0562-f76d4b6ea416",
        "regions": [
          {
            "uuid": "189be4ec-804b-4c34-8ed7-d05a1befbe1c",
            "name": "Tierra del Fuego",
            "local_name": "Tierra del Fuego"
          },
          {
            "uuid": "c12ae741-f825-4201-8118-df90028cc978",
            "name": "Distrito Federal",
            "local_name": "Distrito Federal"
          },
          {
            "uuid": "61ea23de-af57-41ae-9155-5d61b3a466bb",
            "name": "La Pampa",
            "local_name": "La Pampa"
          },
          {
            "uuid": "07a2d9e2-fe87-4faf-8883-984c1b7a1267",
            "name": "Santa Cruz",
            "local_name": "Santa Cruz"
          },
          {
            "uuid": "04ed5546-ca36-4c18-90e5-2962e8d574c8",
            "name": "Entre Ros",
            "local_name": "Entre Ros"
          },
          {
            "uuid": "27c196ab-058c-4bd8-a088-16ba075046e4",
            "name": "Chaco",
            "local_name": "Chaco"
          },
          {
            "uuid": "faaba477-9026-4c12-9f2d-8deba47dc149",
            "name": "Santa Fe",
            "local_name": "Santa Fe"
          },
          {
            "uuid": "691df57d-ef28-4998-95dc-301ac13fb7bb",
            "name": "Salta",
            "local_name": "Salta"
          },
          {
            "uuid": "17be2112-968e-4a70-8310-3ef7608249c6",
            "name": "Ro Negro",
            "local_name": "Ro Negro"
          },
          {
            "uuid": "982fd710-61d7-4dba-acd9-c2acfd036156",
            "name": "Jujuy",
            "local_name": "Jujuy"
          },
          {
            "uuid": "797a3bfc-4990-43a8-9430-7035918e3e9a",
            "name": "Tucumn",
            "local_name": "Tucumn"
          },
          {
            "uuid": "47057b2f-f193-48af-84b1-a06ff7a5ee77",
            "name": "Buenos Aires",
            "local_name": "Buenos Aires"
          },
          {
            "uuid": "3dec8a90-2a85-4127-9ebd-5fc3760a3b64",
            "name": "La Rioja",
            "local_name": "La Rioja"
          },
          {
            "uuid": "16fe8ad0-20a3-40c5-9092-c300edaf758a",
            "name": "San Juan",
            "local_name": "San Juan"
          },
          {
            "uuid": "74e32627-5678-4325-a32f-3b0148220f02",
            "name": "Corrientes",
            "local_name": "Corrientes"
          },
          {
            "uuid": "dcb929bd-023d-4a51-8906-e99fb8c6ebd0",
            "name": "Formosa",
            "local_name": "Formosa"
          },
          {
            "uuid": "b2111042-e1cf-4e77-8c29-161c6945eb22",
            "name": "Catamarca",
            "local_name": "Catamarca"
          },
          {
            "uuid": "1508d6c2-e88b-4b91-a3ca-d9c047a254d4",
            "name": "Santiago del Estero",
            "local_name": "Santiago del Estero"
          },
          {
            "uuid": "676e1cf4-346c-4e00-965d-c39b3c292041",
            "name": "San Luis",
            "local_name": "San Luis"
          },
          {
            "uuid": "0637a2c1-962d-4595-9f22-58a7241e078a",
            "name": "Misiones",
            "local_name": "Misiones"
          },
          {
            "uuid": "c5956269-05f9-43fd-9b8b-44e2326ca2ed",
            "name": "Chubut",
            "local_name": "Chubut"
          },
          {
            "uuid": "0686493b-edbf-4950-a595-40912719e0ef",
            "name": "Crdoba",
            "local_name": "Crdoba"
          },
          {
            "uuid": "30cbdadd-b48b-4f35-ac23-d5d93a6f5d7d",
            "name": "Neuqun",
            "local_name": "Neuqun"
          },
          {
            "uuid": "8122884c-93a1-4015-9052-df33e2404df2",
            "name": "Mendoza",
            "local_name": "Mendoza"
          }
        ],
        "short_title": "Аргентина",
        "name_label": "country_arg",
        "short_name_label": "country_short_arg",
        "number_code": "032",
        "short_symbol_code": "ar",
        "symbol_code": "arg",
        "is_active": true
      },
      {
        "uuid": "f69406fc-549c-9b90-de9d-5267cdef88d2",
        "regions": [
          {
            "uuid": "428c3052-fdcb-40a2-bd28-45c3d457d568",
            "name": "Vayots'' Dzor",
            "local_name": "Vayots'' Dzor"
          },
          {
            "uuid": "cfb3e981-4d60-4d75-815c-22616d4a4236",
            "name": "Syunik''",
            "local_name": "Syunik''"
          },
          {
            "uuid": "1f98ac05-c5bf-4b76-bc92-703962e39c14",
            "name": "Ararat",
            "local_name": "Ararat"
          },
          {
            "uuid": "37dbf8ac-4fdb-477f-a8bb-f2aba812a630",
            "name": "Armavir",
            "local_name": "Armavir"
          },
          {
            "uuid": "232b267c-4b7b-48f3-ab20-cf5a966509eb",
            "name": "Geghark''unik''",
            "local_name": "Geghark''unik''"
          },
          {
            "uuid": "3a161793-9dfe-44be-8191-765f6331fb6e",
            "name": "Shirak",
            "local_name": "Shirak"
          },
          {
            "uuid": "f5d323cb-9156-4d12-8b58-f21a3bb6068d",
            "name": "Lorri",
            "local_name": "Lorri"
          },
          {
            "uuid": "ba726a42-3095-4a8c-ba29-86eb1b8983a8",
            "name": "Tavush",
            "local_name": "Tavush"
          },
          {
            "uuid": "da5955bc-6afc-4610-bbf5-52f335602678",
            "name": "None",
            "local_name": "None"
          },
          {
            "uuid": "972801d0-a5a8-4e7e-aa3c-567f9d9ee206",
            "name": "Aragatsotn",
            "local_name": "Aragatsotn"
          },
          {
            "uuid": "421e1549-7fb9-4c32-9410-6270c49927af",
            "name": "Yerevan",
            "local_name": "Yerevan"
          },
          {
            "uuid": "28ad23c6-3f67-4afe-92d3-011321074a58",
            "name": "Kotayk''",
            "local_name": "Kotayk''"
          }
        ],
        "short_title": "Армения",
        "name_label": "country_arm",
        "short_name_label": "country_short_arm",
        "number_code": "051",
        "short_symbol_code": "am",
        "symbol_code": "arm",
        "is_active": true
      },
      {
        "uuid": "94b8ac99-6b21-45e0-bdf3-6338b0251de7",
        "short_title": "Аруба",
        "name_label": "country_abw",
        "short_name_label": "country_short_abw",
        "number_code": "533",
        "short_symbol_code": "aw",
        "symbol_code": "abw",
        "is_active": true
      },
      {
        "uuid": "f2e0509a-d915-afe3-87da-ac89798ec0f0",
        "regions": [
          {
            "uuid": "8b34b57b-f160-47e9-a5ef-76a12db20eee",
            "name": "Афганистан",
            "local_name": "Афганистан"
          }
        ],
        "short_title": "Афганистан",
        "name_label": "country_afg",
        "short_name_label": "country_short_afg",
        "number_code": "004",
        "short_symbol_code": "af",
        "symbol_code": "afg",
        "is_active": true
      },
      {
        "uuid": "2fcf2169-4a37-d598-6b1d-72e56611277f",
        "regions": [
          {
            "uuid": "63bb96aa-02f5-4261-9a0d-fbbfa9be5bd0",
            "name": "Багамы",
            "local_name": "Багамы"
          }
        ],
        "short_title": "Багамы",
        "name_label": "country_bhs",
        "short_name_label": "country_short_bhs",
        "number_code": "044",
        "short_symbol_code": "bs",
        "symbol_code": "bhs",
        "is_active": true
      },
      {
        "uuid": "963dda3f-b491-bb62-3fff-acc6e2625224",
        "regions": [
          {
            "uuid": "fb900c87-11a5-4aee-8bf3-a3247e386cc6",
            "name": "Бангладеш",
            "local_name": "Бангладеш"
          }
        ],
        "short_title": "Бангладеш",
        "name_label": "country_bgd",
        "short_name_label": "country_short_bgd",
        "number_code": "050",
        "short_symbol_code": "bd",
        "symbol_code": "bgd",
        "is_active": true
      },
      {
        "uuid": "95cf6c39-6d02-18eb-9efd-b042fd3348fd",
        "regions": [
          {
            "uuid": "42f6c3e3-39ed-485f-9b34-964f7f71c30d",
            "name": "Барбадос",
            "local_name": "Барбадос"
          }
        ],
        "short_title": "Барбадос",
        "name_label": "country_brb",
        "short_name_label": "country_short_brb",
        "number_code": "052",
        "short_symbol_code": "bb",
        "symbol_code": "brb",
        "is_active": true
      },
      {
        "uuid": "6160ad23-75d6-3cf9-d708-8921071c87b9",
        "regions": [
          {
            "uuid": "f0338f57-3b16-47ee-81d7-1abdb3772a9e",
            "name": "Бахрейн",
            "local_name": "Бахрейн"
          }
        ],
        "short_title": "Бахрейн",
        "name_label": "country_bhr",
        "short_name_label": "country_short_bhr",
        "number_code": "048",
        "short_symbol_code": "bh",
        "symbol_code": "bhr",
        "is_active": true
      }
    ],
    "page": 0,
    "size": 20,
    "total_elements": 251,
    "total_pages": 13,
    "number_of_elements": 20
  },
  "country_detail": {
    "uuid": "ea0cacbf-1bb8-d62b-80b1-7d6c8c71a430",
    "regions": [
      {
        "uuid": "56c98e40-0388-4b53-adca-90ef1c490c0d",
        "name": "Steiermark",
        "local_name": "Steiermark"
      },
      {
        "uuid": "f726b05c-37a8-45ef-af40-73b13985484e",
        "name": "Salzburg",
        "local_name": "Salzburg"
      },
      {
        "uuid": "dfaa435e-e440-4136-9af8-2c4d11c62150",
        "name": "Vorarlberg",
        "local_name": "Vorarlberg"
      },
      {
        "uuid": "e57b0a91-a07b-47c2-83d9-1fa5f6852b12",
        "name": "Burgenland",
        "local_name": "Burgenland"
      },
      {
        "uuid": "b7a42a48-fbe7-4a0a-9e08-76e212ae1688",
        "name": "Wien",
        "local_name": "Wien"
      },
      {
        "uuid": "27a3cbb5-f667-4d04-b378-d1a75ec84f41",
        "name": "Niedersterreich",
        "local_name": "Niedersterreich"
      },
      {
        "uuid": "d415ba42-adbc-46c3-9e32-4090c7b508d8",
        "name": "Krnten",
        "local_name": "Krnten"
      },
      {
        "uuid": "fc86dd4e-8092-4d02-a38f-3c4dbeede3c5",
        "name": "Obersterreich",
        "local_name": "Obersterreich"
      },
      {
        "uuid": "6770a566-8a7d-4443-a46c-99275cca502f",
        "name": "Tirol",
        "local_name": "Tirol"
      }
    ],
    "short_title": "Австрия",
    "name_label": "country_aut",
    "short_name_label": "country_short_aut",
    "number_code": "040",
    "short_symbol_code": "at",
    "symbol_code": "aut",
    "is_active": true
  }
}
