<svg width="36" height="36" viewBox="0 0 36 36" fill="none" xmlns="http://www.w3.org/2000/svg">
<path fill-rule="evenodd" clip-rule="evenodd" d="M33 15C33 24.9407 18.7594 36 18 36C17.2406 36 3 24.9407 3 15C3 5.0593 12.0425 0 18 0C23.9575 0 33 5.0593 33 15ZM24 15C24 18.3136 21.3141 21 18 21C14.6859 21 12 18.3136 12 15C12 11.6864 14.6859 9 18 9C21.3141 9 24 11.6864 24 15Z" fill="#99B7E9"/>
<circle cx="18" cy="15" r="10" fill="white"/>
<path d="M17.9995 8.60001C16.6256 8.60001 14.8773 10.7333 12.6661 10.7333C12.5247 10.7333 12.389 10.7895 12.289 10.8895C12.189 10.9896 12.1328 11.1252 12.1328 11.2667C12.1329 11.3383 12.1474 11.4091 12.1755 11.475C12.3705 12.0368 13.1995 12.8667 13.1995 12.8667H22.7995C22.7995 12.8667 23.6252 12.0399 23.8224 11.4781C23.8512 11.4114 23.8661 11.3394 23.8661 11.2667C23.8661 11.1252 23.81 10.9896 23.7099 10.8895C23.6099 10.7895 23.4743 10.7333 23.3328 10.7333C21.1216 10.7333 19.3733 8.60001 17.9995 8.60001ZM17.1995 10.2H18.7995C18.7995 11.2667 17.9995 11.8 17.9995 11.8C17.9995 11.8 17.1995 11.2667 17.1995 10.2ZM13.1995 13.9333V15V16.9042V17.5604C13.1995 18.236 13.4998 18.7315 13.8078 19.001C13.9962 19.1659 14.0773 19.1687 14.2047 19.2188C14.3421 19.5786 15.2816 21.8949 17.9401 21.9302C17.9598 21.9324 17.9796 21.9334 17.9995 21.9333C18.0204 21.9335 18.0412 21.9325 18.062 21.9302C20.718 21.893 21.6569 19.5785 21.7943 19.2188C21.9216 19.1687 22.0028 19.1659 22.1911 19.001C22.4992 18.7315 22.7995 18.236 22.7995 17.5604V16.7063V14.4667V13.9333H13.1995ZM21.6484 15.3563C21.7298 15.9306 21.7328 16.6533 21.7328 17.1333V17.5604C21.7328 17.9515 21.6066 18.0952 21.488 18.199C21.3694 18.3028 21.2839 18.3229 21.2839 18.3229L20.9995 18.3938L20.9068 18.6708C20.9068 18.6708 20.2039 20.8667 17.9995 20.8667C15.795 20.8667 15.0922 18.6708 15.0922 18.6708L14.9995 18.3938L14.7151 18.3229C14.7151 18.3229 14.6296 18.3028 14.5109 18.199C14.3923 18.0952 14.2661 17.9515 14.2661 17.5604V16.9042C14.2661 16.316 14.3592 15.8625 14.5172 15.5073C15.2129 16.1377 16.5353 17.1333 17.9995 17.1333C19.5813 17.1333 21.0121 15.9627 21.6484 15.3563Z" fill="#004BC8"/>
</svg>
