<svg width="24" height="24" viewBox="0 0 24 24" fill="none" xmlns="http://www.w3.org/2000/svg">
<path fill-rule="evenodd" clip-rule="evenodd" d="M5.00004 15.0089L5 15V5C5 4.44772 5.44772 4 6 4C6.55229 4 7 4.44771 7 5V15L6.99999 15.0053L8.96153 15.0018C9.38046 15.0011 9.61451 15.485 9.35383 15.813L6.41416 19.5114C6.21496 19.762 5.83484 19.7635 5.63372 19.5144L2.65587 15.8265C2.39208 15.4998 2.6241 15.0131 3.04399 15.0124L5.00004 15.0089ZM21.3441 8.17354C21.6079 8.50023 21.3759 8.9869 20.956 8.98765L19 8.99112V19C19 19.5523 18.5523 20 18 20C17.4477 20 17 19.5523 17 19V8.99467L15.0385 8.99816C14.6195 8.9989 14.3855 8.515 14.6462 8.18704L17.5859 4.48858C17.7851 4.23797 18.1652 4.23651 18.3663 4.48559L21.3441 8.17354Z" fill="#9DA0AC"/>
</svg>
