<svg width="20" height="20" viewBox="0 0 20 20" fill="none" xmlns="http://www.w3.org/2000/svg">
<path fill-rule="evenodd" clip-rule="evenodd" d="M19.0043 0H1.08115C1.06679 0 1.05251 0.000305161 1.0383 0.000909377C0.769473 -0.0105715 0.496899 0.0867568 0.291642 0.292894C-0.0972138 0.683418 -0.0972143 1.31658 0.291642 1.70711L8.97677 10.4295C8.99939 10.4522 8.97584 10.4736 9 10.4937V19C9 19.5523 9.45007 20 10 20C10.5499 20 11 19.5523 11 19V10.3284L19.4236 1.90729C19.764 1.74835 20 1.40186 20 1C20 0.447717 19.5542 0 19.0043 0ZM16.5149 2L3.39963 2L9.95726 8.58576L16.5149 2Z" fill="#9DA0AC"/>
</svg>
