<svg width="54" height="19" viewBox="0 0 54 19" fill="none" xmlns="http://www.w3.org/2000/svg">
    <path fill-rule="evenodd" clip-rule="evenodd" d="M48.75 18C50.009 18 51.0933 17.214 51.5365 16.1085C52.573 16.0436 53.1988 15.8043 53.4406 15.7118C53.5005 15.6889 53.5368 15.675 53.55 15.675C53.85 15.525 54 15.3 54 15V8.925C53.7 6.6 53.1 2.55001 52.275 1.72501C51.15 0.600014 45.225 0 44.25 0C43.8 0 43.5 0.3 43.5 0.75C43.5 1.2 43.8 1.5 44.25 1.5C45.9 1.5 50.625 2.25001 51.225 2.77501C51.4184 3.04578 51.6717 4.01484 51.9128 5.25H49.5C49.05 5.25 48.75 5.55 48.75 6V7.72501C48.75 8.02501 48.975 8.32501 49.275 8.40001L52.5 9.49529V11.25C52.05 11.25 51.75 11.55 51.75 12C51.75 12.45 52.05 12.75 52.5 12.75V14.475C52.318 14.5205 52.0533 14.566 51.7225 14.5947C51.5231 13.1346 50.2626 12 48.75 12C47.1 12 45.75 13.35 45.75 15H39C39 14.4546 38.8525 13.9419 38.5954 13.5H44.25C44.7 13.5 45 13.125 45 12.75V3.75C45 3.3 44.7 3 44.25 3C43.8 3 43.5 3.3 43.5 3.75V12H36C34.35 12 33 13.35 33 15C33 16.65 34.35 18 36 18C37.1048 18 38.075 17.3948 38.5956 16.4996C38.6017 16.4997 38.6078 16.4999 38.6139 16.4999C38.6176 16.5 38.6213 16.5 38.625 16.5H46.1546C46.6753 17.395 47.6454 18 48.75 18ZM36 13.5C35.175 13.5 34.5 14.175 34.5 15C34.5 15.825 35.175 16.5 36 16.5C36.825 16.5 37.5 15.825 37.5 15C37.5 14.175 36.825 13.5 36 13.5ZM48.75 13.5C47.925 13.5 47.25 14.175 47.25 15C47.25 15.825 47.925 16.5 48.75 16.5C49.575 16.5 50.25 15.825 50.25 15C50.25 14.175 49.575 13.5 48.75 13.5Z" fill="#0070A6"/>
    <path fill-rule="evenodd" clip-rule="evenodd" d="M39.0795 9.75V1.67943C38.8889 1.69636 38.6787 1.71711 38.456 1.73909C37.692 1.8145 36.781 1.90442 36.0081 1.90442C35.1795 1.90442 34.32 1.81377 33.7045 1.70919V6.02939C33.7045 6.40439 33.3974 6.77939 32.9367 6.77939C32.476 6.77939 32.1688 6.47939 32.1688 6.02939V1.63841C31.3326 1.75299 30.0794 1.90442 29.0974 1.90442C28.1154 1.90442 26.8621 1.75299 26.0259 1.63841V6.02939C26.0259 6.40439 25.7188 6.77939 25.2581 6.77939C24.7974 6.77939 24.4902 6.47939 24.4902 6.02939V1.63841C23.6541 1.75299 22.4008 1.90442 21.4188 1.90442C20.4368 1.90442 19.1835 1.75299 18.3474 1.63841V6.02939C18.3474 6.40439 18.0402 6.77939 17.5795 6.77939C17.1188 6.77939 16.8117 6.47939 16.8117 6.02939V1.63841C15.9755 1.75299 14.7222 1.90442 13.7402 1.90442C12.7583 1.90442 11.505 1.75299 10.6688 1.63841V6.02939C10.6688 6.40439 10.3617 6.77939 9.90095 6.77939C9.44024 6.77939 9.13309 6.47939 9.13309 6.02939V1.63841C8.29692 1.75299 7.04364 1.90442 6.06166 1.90442C5.28875 1.90442 4.37774 1.8145 3.61377 1.73909C3.39108 1.71711 3.18088 1.69636 2.99023 1.67943V12.75H25.642C26.1819 12.75 26.8062 12.0908 27.4357 11.3904L27.5617 11.25C28.2335 10.5 28.9054 9.75 29.4813 9.75L29.5044 9.75H39.0795ZM32.8686 0.0316286L32.8599 0.0294212H32.5527C32.5527 0.0294212 30.3259 0.404421 28.867 0.404421C27.7992 0.404421 26.3199 0.203516 25.6036 0.0958099C25.5025 0.0526045 25.3863 0.0293884 25.2581 0.0293884C25.2361 0.0293884 25.2145 0.0300702 25.1933 0.0314174L25.1813 0.0294212H24.951C24.951 0.0294212 22.7242 0.404421 21.2652 0.404421C20.1297 0.404421 18.5289 0.177234 17.8751 0.0765231C17.7862 0.045736 17.6871 0.0293884 17.5795 0.0293884L17.5712 0.0294212H17.3492C17.3492 0.0294212 15.1224 0.404421 13.6634 0.404421C12.4023 0.404421 10.5672 0.124183 10.093 0.0482197C10.0691 0.0433129 10.0446 0.0393402 10.0195 0.0363309L9.97774 0.0294212H9.90928L9.90095 0.0293884L9.89262 0.0294212H9.74738C9.74738 0.0294212 7.52059 0.404421 6.06166 0.404421C4.60273 0.404421 2.37596 0.0294212 2.37596 0.0294212C2.1456 -0.0455788 1.91523 0.0294304 1.76166 0.17943C1.5313 0.32943 1.45452 0.554421 1.45452 0.779421V12.75H1.07059C0.609877 12.75 0.302734 13.05 0.302734 13.5V14.2794C0.302734 15.5544 1.30095 16.5294 2.60631 16.5294H4.64909C4.95413 17.4175 5.79545 18.0294 6.82952 18.0294C7.87496 18.0294 8.72339 17.404 9.01982 16.5H10.7821C11.0785 17.404 11.9269 18.0294 12.9724 18.0294C14.0178 18.0294 14.8662 17.404 15.1627 16.5H16.9249C17.2214 17.404 18.0698 18.0294 19.1152 18.0294C20.1493 18.0294 20.9906 17.4175 21.2957 16.5294H28.3295C28.7135 16.5294 29.3853 15.7794 30.0572 15.0294C30.7291 14.2794 31.401 13.5294 31.7849 13.5294H38.6956C40.001 13.5294 40.9992 12.4794 40.9992 11.2794V10.5C40.9992 10.1021 40.759 9.82146 40.3849 9.76183V0.779421C40.3849 0.554421 40.2313 0.32943 40.0777 0.17943C39.9242 0.0294304 39.6938 0.0294212 39.4635 0.0294212C39.4635 0.0294212 37.2367 0.404421 35.7777 0.404421C34.8527 0.404421 33.9276 0.253655 33.3745 0.143315C33.2543 0.0698398 33.1058 0.0293884 32.9367 0.0293884C32.9136 0.0293884 32.8909 0.0301414 32.8686 0.0316286ZM16.9451 15C17.0466 14.7176 17.2026 14.464 17.4019 14.25H14.6857C14.885 14.464 15.041 14.7176 15.1425 15H16.9451ZM11.2591 14.25C11.0597 14.464 10.9037 14.7176 10.8023 15H8.99963C8.89818 14.7176 8.74216 14.464 8.54283 14.25H11.2591ZM26.4099 14.25L20.8286 14.25C21.0294 14.4656 21.1863 14.7215 21.2877 15.0065C23.2635 15.0041 25.878 15.0022 26.4928 15.001L26.4945 15.001L26.5055 15.001C26.8534 15.0004 27.0505 15 27.1777 15C27.7536 15 28.4255 14.25 29.0974 13.5C29.7693 12.75 30.4411 12 31.017 12H38.6956C39.1466 12 39.4504 11.7126 39.463 11.2783C37.5937 11.2731 31.0461 11.2503 30.265 11.25L30.2492 11.25L30.2472 11.25C29.9018 11.2523 29.325 11.8574 28.6899 12.5235C27.9223 13.3286 27.0697 14.2229 26.4384 14.2494L26.4258 14.2498L26.4099 14.25ZM5.11621 14.25C4.91058 14.4707 4.75105 14.7337 4.64997 15.0268L2.60631 15.0294C2.14559 15.0294 1.83845 14.7 1.83845 14.25H5.11621ZM6.06166 15.7794C6.06166 15.3294 6.36881 15.0294 6.82952 15.0294C7.29024 15.0294 7.59738 15.3294 7.59738 15.7794C7.59738 16.2294 7.29024 16.5294 6.82952 16.5294C6.36881 16.5294 6.06166 16.2294 6.06166 15.7794ZM12.9724 15.0294C12.5117 15.0294 12.2045 15.3294 12.2045 15.7794C12.2045 16.2294 12.5117 16.5294 12.9724 16.5294C13.4331 16.5294 13.7402 16.2294 13.7402 15.7794C13.7402 15.3294 13.4331 15.0294 12.9724 15.0294ZM19.1152 15.0294C18.6545 15.0294 18.3474 15.3294 18.3474 15.7794C18.3474 16.2294 18.6545 16.5294 19.1152 16.5294C19.576 16.5294 19.8831 16.2294 19.8831 15.7794C19.8831 15.3294 19.576 15.0294 19.1152 15.0294Z" fill="#0070A6"/>
</svg>