<svg width="54" height="18" viewBox="0 0 54 18" fill="none" xmlns="http://www.w3.org/2000/svg">
    <path fill-rule="evenodd" clip-rule="evenodd" d="M49.113 18C50.2852 18 51.2947 17.214 51.7074 16.1085C52.6724 16.0436 53.255 15.8043 53.4801 15.7118C53.5359 15.6889 53.5697 15.675 53.582 15.675C53.8613 15.525 54.0009 15.3 54.0009 15V8.925C53.7216 6.6 53.163 2.55001 52.3949 1.72501C51.3475 0.600014 45.8311 0 44.9234 0C44.5044 0 44.2251 0.3 44.2251 0.75C44.2251 1.2 44.5044 1.5 44.9234 1.5C46.4596 1.5 50.8587 2.25001 51.4173 2.77501C51.5974 3.04578 51.8332 4.01484 52.0577 5.25H49.8113C49.3923 5.25 49.113 5.55 49.113 6V7.72501C49.113 8.02501 49.3225 8.32501 49.6018 8.40001L52.6044 9.49529V11.25C52.1854 11.25 51.9061 11.55 51.9061 12C51.9061 12.45 52.1854 12.75 52.6044 12.75V14.475C52.435 14.5205 52.1885 14.566 51.8805 14.5947C51.6949 13.1346 50.5213 12 49.113 12C47.5768 12 46.3199 13.35 46.3199 15H40.0354C40.0354 14.4546 39.8981 13.9419 39.6587 13.5H44.9234C45.3423 13.5 45.6216 13.125 45.6216 12.75V3.75C45.6216 3.3 45.3423 3 44.9234 3C44.5044 3 44.2251 3.3 44.2251 3.75V12H37.2423C35.7061 12 34.4492 13.35 34.4492 15C34.4492 16.65 35.7061 18 37.2423 18C38.2709 18 39.1742 17.3948 39.6589 16.4996C39.6646 16.4997 39.6702 16.4999 39.6759 16.4999C39.6794 16.5 39.6828 16.5 39.6863 16.5H46.6966C47.1814 17.395 48.0846 18 49.113 18ZM37.2423 13.5C36.4742 13.5 35.8458 14.175 35.8458 15C35.8458 15.825 36.4742 16.5 37.2423 16.5C38.0104 16.5 38.6389 15.825 38.6389 15C38.6389 14.175 38.0104 13.5 37.2423 13.5ZM49.113 13.5C48.3449 13.5 47.7165 14.175 47.7165 15C47.7165 15.825 48.3449 16.5 49.113 16.5C49.8811 16.5 50.5096 15.825 50.5096 15C50.5096 14.175 49.8811 13.5 49.113 13.5Z" fill="#0070A6"/>
    <path fill-rule="evenodd" clip-rule="evenodd" d="M39.4635 10.5294H1.83845V11.25C1.83845 11.7 2.14559 12 2.60631 12H7.21345H14.892H22.5706H38.6956C39.1563 12 39.4635 11.7 39.4635 11.25V10.5294ZM1.07059 0.779421V9C0.609877 9 0.302734 9.3 0.302734 9.75V11.25C0.302734 12.525 1.30095 13.5 2.60631 13.5H4.55627C4.29305 13.9419 4.14202 14.4546 4.14202 15C4.14202 16.65 5.52416 18 7.21345 18C8.34433 18 9.33756 17.395 9.87063 16.5H12.2348C12.7679 17.395 13.7611 18 14.892 18C16.0229 18 17.0161 17.395 17.5492 16.5H19.9134C20.4465 17.395 21.4397 18 22.5706 18C24.2599 18 25.642 16.65 25.642 15C25.642 14.4546 25.491 13.9419 25.2278 13.5H38.6956C40.001 13.5 40.9992 12.45 40.9992 11.25V9.75C40.9992 9.3 40.692 9 40.2313 9H40.0009V0.779421C40.0009 0.554421 39.8474 0.32943 39.6938 0.17943C39.5402 0.0294304 39.3099 0.0294212 39.0795 0.0294212C39.0795 0.0294212 36.8527 0.404421 35.3938 0.404421C33.9349 0.404421 32.4759 0.0294212 32.4759 0.0294212H32.1688C32.1688 0.0294212 29.942 0.404421 28.4831 0.404421C27.0242 0.404421 24.7974 0.0294212 24.7974 0.0294212H24.567C24.567 0.0294212 22.3402 0.404421 20.8813 0.404421C19.4224 0.404421 17.1956 0.0294212 17.1956 0.0294212H16.9652C16.9652 0.0294212 14.7384 0.404421 13.2795 0.404421C11.8206 0.404421 9.59381 0.0294212 9.59381 0.0294212H9.36345C9.36345 0.0294212 7.13666 0.404421 5.67773 0.404421C4.21881 0.404421 1.99203 0.0294212 1.99203 0.0294212C1.76167 -0.0455788 1.5313 0.0294304 1.37773 0.17943C1.14737 0.32943 1.07059 0.554421 1.07059 0.779421ZM2.60631 9H38.6956V1.67943C38.505 1.69636 38.2948 1.71711 38.0721 1.73909C37.3081 1.8145 36.3971 1.90442 35.6242 1.90442C34.3188 1.90442 32.9367 1.67942 32.5527 1.52942C32.4976 1.53712 32.4279 1.54718 32.3457 1.55905C31.6269 1.66283 29.9538 1.90442 28.7135 1.90442C27.4731 1.90442 25.8 1.66284 25.0812 1.55905C24.9991 1.54719 24.9293 1.53712 24.8742 1.52942C24.8191 1.53711 24.7494 1.54717 24.6673 1.55902C23.9486 1.6628 22.2752 1.90442 21.0349 1.90442C19.7946 1.90442 18.1214 1.66284 17.4027 1.55905C17.3206 1.5472 17.2507 1.53711 17.1956 1.52942C17.1405 1.53711 17.0708 1.54717 16.9888 1.55902C16.27 1.6628 14.5966 1.90442 13.3563 1.90442C12.116 1.90442 10.4429 1.66283 9.72409 1.55905C9.64191 1.54719 9.57217 1.53712 9.51702 1.52942C9.46187 1.53712 9.39217 1.54718 9.30999 1.55905C8.59123 1.66283 6.91804 1.90442 5.67773 1.90442C4.90482 1.90442 3.99381 1.8145 3.22985 1.73909C3.00715 1.71711 2.79695 1.69636 2.60631 1.67943V9ZM17.5492 13.5H19.9134C19.6502 13.9419 19.4992 14.4546 19.4992 15H17.9634C17.9634 14.4546 17.8124 13.9419 17.5492 13.5ZM11.8206 15C11.8206 14.4546 11.9716 13.9419 12.2348 13.5H9.87063C10.1339 13.9419 10.2849 14.4546 10.2849 15H11.8206ZM14.892 13.5C14.0474 13.5 13.3563 14.175 13.3563 15C13.3563 15.825 14.0474 16.5 14.892 16.5C15.7367 16.5 16.4277 15.825 16.4277 15C16.4277 14.175 15.7367 13.5 14.892 13.5ZM22.5706 13.5C21.726 13.5 21.0349 14.175 21.0349 15C21.0349 15.825 21.726 16.5 22.5706 16.5C23.4152 16.5 24.1063 15.825 24.1063 15C24.1063 14.175 23.4152 13.5 22.5706 13.5ZM7.21345 13.5C6.36881 13.5 5.67773 14.175 5.67773 15C5.67773 15.825 6.36881 16.5 7.21345 16.5C8.05809 16.5 8.74916 15.825 8.74916 15C8.74916 14.175 8.05809 13.5 7.21345 13.5ZM30.1997 8.05711C30.5583 7.92852 30.8308 7.75902 31.017 7.5486V5.4514H28.9651V6.29659H29.8065V7.08918C29.6525 7.2318 29.418 7.30311 29.103 7.30311C28.7351 7.30311 28.465 7.17568 28.2926 6.92084C28.1224 6.66366 28.0374 6.28023 28.0374 5.77054V5.46192C28.0397 4.97562 28.1236 4.60154 28.2891 4.33968C28.4546 4.07782 28.6892 3.94689 28.9926 3.94689C29.2455 3.94689 29.441 4.00768 29.5789 4.12926C29.7169 4.25084 29.8065 4.45424 29.8479 4.73948H31.0136C30.9561 4.16199 30.7538 3.72829 30.4066 3.43838C30.0617 3.14613 29.5766 3 28.9513 3C28.5236 3 28.1466 3.1017 27.8201 3.30511C27.4959 3.50618 27.2465 3.79492 27.0717 4.17134C26.897 4.54542 26.8096 4.9838 26.8096 5.48647L26.8131 5.92836C26.8407 6.65782 27.051 7.22712 27.4442 7.63627C27.8373 8.04542 28.3627 8.25 29.0202 8.25C29.4479 8.25 29.841 8.18571 30.1997 8.05711ZM18.9314 7.05411C19.1131 6.67067 19.2039 6.22996 19.2039 5.73196V5.49699C19.2016 5.00601 19.1073 4.57114 18.9211 4.19238C18.7372 3.81129 18.4785 3.51787 18.1451 3.31212C17.8118 3.10638 17.4324 3.00351 17.0071 3.00351C16.5771 3.00351 16.1932 3.10755 15.8552 3.31563C15.5195 3.52371 15.2609 3.81947 15.0792 4.20291C14.8999 4.584 14.8102 5.02472 14.8102 5.52505V5.81263C14.8194 6.29426 14.916 6.72094 15.0999 7.09269C15.2862 7.46443 15.5448 7.75084 15.8759 7.9519C16.207 8.15063 16.5863 8.25 17.014 8.25C17.4416 8.25 17.8221 8.14713 18.1555 7.94138C18.4911 7.7333 18.7498 7.43754 18.9314 7.05411ZM17.7209 4.36423C17.8888 4.62609 17.9727 5.01069 17.9727 5.51804V5.75301C17.9704 6.24866 17.8865 6.62859 17.7209 6.89279C17.5554 7.15698 17.3197 7.28908 17.014 7.28908C16.6921 7.28908 16.4495 7.15464 16.2863 6.88577C16.1231 6.6169 16.0414 6.2323 16.0414 5.73196L16.0449 5.35671C16.0794 4.43086 16.4001 3.96794 17.0071 3.96794C17.3174 3.96794 17.5554 4.10003 17.7209 4.36423ZM13.6025 7.23297H11.4954V3.07365H10.2849V8.17986H13.6025V7.23297ZM25.0811 8.17986H23.8775L22.098 5.00251V8.17986H20.8875V3.07365H22.098L23.8741 6.251V3.07365H25.0811V8.17986Z" fill="#0070A6"/>
</svg>