<svg width="24" height="24" viewBox="0 0 24 24" fill="none" xmlns="http://www.w3.org/2000/svg">
<path d="M23 12C23 18.0751 18.0751 23 12 23C5.92487 23 1 18.0751 1 12C1 5.92487 5.92487 1 12 1C18.0751 1 23 5.92487 23 12Z" stroke="#E5EDF9" stroke-width="2"/>
<rect x="11" y="10" width="2" height="8" fill="#E5EDF9"/>
<rect x="11" y="6" width="2" height="2" fill="#E5EDF9"/>
</svg>
