<svg width="54" height="19" viewBox="0 0 54 19" fill="none" xmlns="http://www.w3.org/2000/svg">
    <path fill-rule="evenodd" clip-rule="evenodd" d="M48.75 18C50.009 18 51.0933 17.214 51.5365 16.1085C52.573 16.0436 53.1988 15.8043 53.4406 15.7118C53.5005 15.6889 53.5368 15.675 53.55 15.675C53.85 15.525 54 15.3 54 15V8.925C53.7 6.6 53.1 2.55001 52.275 1.72501C51.15 0.600014 45.225 0 44.25 0C43.8 0 43.5 0.3 43.5 0.75C43.5 1.2 43.8 1.5 44.25 1.5C45.9 1.5 50.625 2.25001 51.225 2.77501C51.4184 3.04578 51.6717 4.01484 51.9128 5.25H49.5C49.05 5.25 48.75 5.55 48.75 6V7.72501C48.75 8.02501 48.975 8.32501 49.275 8.40001L52.5 9.49529V11.25C52.05 11.25 51.75 11.55 51.75 12C51.75 12.45 52.05 12.75 52.5 12.75V14.475C52.318 14.5205 52.0533 14.566 51.7225 14.5947C51.5231 13.1346 50.2626 12 48.75 12C47.1 12 45.75 13.35 45.75 15H39C39 14.4546 38.8525 13.9419 38.5954 13.5H44.25C44.7 13.5 45 13.125 45 12.75V3.75C45 3.3 44.7 3 44.25 3C43.8 3 43.5 3.3 43.5 3.75V12H36C34.35 12 33 13.35 33 15C33 16.65 34.35 18 36 18C37.1048 18 38.075 17.3948 38.5956 16.4996C38.6017 16.4997 38.6078 16.4999 38.6139 16.4999C38.6176 16.5 38.6213 16.5 38.625 16.5H46.1546C46.6753 17.395 47.6454 18 48.75 18ZM36 13.5C35.175 13.5 34.5 14.175 34.5 15C34.5 15.825 35.175 16.5 36 16.5C36.825 16.5 37.5 15.825 37.5 15C37.5 14.175 36.825 13.5 36 13.5ZM48.75 13.5C47.925 13.5 47.25 14.175 47.25 15C47.25 15.825 47.925 16.5 48.75 16.5C49.575 16.5 50.25 15.825 50.25 15C50.25 14.175 49.575 13.5 48.75 13.5Z" fill="#0070A6"/>
    <path fill-rule="evenodd" clip-rule="evenodd" d="M40.0009 8.27941V0.779421C40.0009 0.554421 39.8474 0.32943 39.6938 0.17943C39.5402 0.0294304 39.3099 0.0294212 39.0795 0.0294212C39.0795 0.0294212 36.8527 0.404421 35.3938 0.404421C34.4687 0.404421 33.5436 0.253645 32.9905 0.143304C32.8703 0.0698502 32.7219 0.0294113 32.5527 0.0294113C32.5297 0.0294113 32.507 0.0301627 32.4847 0.0316467C32.4789 0.0301861 32.4759 0.0294212 32.4759 0.0294212H32.1688C32.1688 0.0294212 29.942 0.404421 28.4831 0.404421C27.4152 0.404421 25.9359 0.203501 25.2196 0.0957975C25.1185 0.0526149 25.0023 0.0294113 24.8742 0.0294113C24.8522 0.0294113 24.8307 0.0300909 24.8094 0.0314339L24.7974 0.0294212H24.567C24.567 0.0294212 22.3402 0.404421 20.8813 0.404421C19.7457 0.404421 18.1448 0.177207 17.4911 0.0765048C17.4022 0.0457457 17.3031 0.0294189 17.1956 0.0294212H16.9652C16.9652 0.0294212 14.7384 0.404421 13.2795 0.404421C12.0179 0.404421 10.182 0.123982 9.70856 0.0481378C9.68498 0.0433135 9.66083 0.0393974 9.63613 0.0364174L9.59381 0.0294212H9.52161L9.51702 0.0294113L9.51243 0.0294212H9.36345C9.36345 0.0294212 7.13666 0.404421 5.67773 0.404421C4.21881 0.404421 1.99203 0.0294212 1.99203 0.0294212C1.76167 -0.0455788 1.5313 0.0294304 1.37773 0.17943C1.14737 0.32943 1.07059 0.554421 1.07059 0.779421V8.27941C0.609877 8.27941 0.302734 8.57941 0.302734 9.02941V11.2794C0.302734 12.5544 1.30095 13.5294 2.60631 13.5294H4.55627C4.29305 13.9713 4.14202 14.484 4.14202 15.0294C4.14202 16.6794 5.52416 18.0294 7.21345 18.0294C8.34433 18.0294 9.33756 17.4244 9.87063 16.5294H12.2348C12.7679 17.4244 13.7611 18.0294 14.892 18.0294C16.0229 18.0294 17.0161 17.4244 17.5492 16.5294H19.9134C20.4465 17.4244 21.4397 18.0294 22.5706 18.0294C24.2599 18.0294 25.642 16.6794 25.642 15.0294C25.642 14.484 25.491 13.9713 25.2278 13.5294H38.6956C40.001 13.5294 40.9992 12.4794 40.9992 11.2794V9.02941C40.9992 8.57941 40.692 8.27941 40.2313 8.27941H40.0009ZM1.83845 9.77942V11.2794C1.83845 11.7294 2.14559 12.0294 2.60631 12.0294H38.6956C39.1563 12.0294 39.4635 11.7294 39.4635 11.2794V9.77942H1.83845ZM31.7849 1.63841C30.9487 1.75299 29.6954 1.90442 28.7135 1.90442C27.7315 1.90442 26.4782 1.75299 25.642 1.63841V6.02941C25.642 6.40441 25.3349 6.77941 24.8742 6.77941C24.4135 6.77941 24.1063 6.47941 24.1063 6.02941V1.63841C23.2701 1.75299 22.0169 1.90442 21.0349 1.90442C20.0529 1.90442 18.7996 1.75299 17.9634 1.63841V6.02941C17.9634 6.40441 17.6563 6.77941 17.1956 6.77941C16.7349 6.77941 16.4277 6.47941 16.4277 6.02941V1.63841C15.5916 1.75299 14.3383 1.90442 13.3563 1.90442C12.3743 1.90442 11.121 1.75299 10.2849 1.63841V6.02941C10.2849 6.40441 9.97774 6.77941 9.51702 6.77941C9.05631 6.77941 8.74916 6.47941 8.74916 6.02941V1.63841C7.91299 1.75299 6.65971 1.90442 5.67773 1.90442C4.90482 1.90442 3.99381 1.8145 3.22985 1.73909C3.00715 1.71711 2.79695 1.69636 2.60631 1.67943V8.27941L38.6956 8.27942V1.67943C38.505 1.69636 38.2948 1.71711 38.0721 1.73909C37.3081 1.8145 36.3971 1.90442 35.6242 1.90442C34.7956 1.90442 33.9361 1.81377 33.3206 1.70919V6.02941C33.3206 6.40441 33.0135 6.77941 32.5527 6.77941C32.092 6.77941 31.7849 6.47941 31.7849 6.02941V1.63841ZM19.4992 15.0294C19.4992 14.484 19.6502 13.9713 19.9134 13.5294H17.5492C17.8124 13.9713 17.9634 14.484 17.9634 15.0294H19.4992ZM9.87063 13.5294H12.2348C11.9716 13.9713 11.8206 14.484 11.8206 15.0294H10.2849C10.2849 14.484 10.1339 13.9713 9.87063 13.5294ZM13.3563 15.0294C13.3563 14.2044 14.0474 13.5294 14.892 13.5294C15.7367 13.5294 16.4277 14.2044 16.4277 15.0294C16.4277 15.8544 15.7367 16.5294 14.892 16.5294C14.0474 16.5294 13.3563 15.8544 13.3563 15.0294ZM5.67773 15.0294C5.67773 14.2044 6.36881 13.5294 7.21345 13.5294C8.05809 13.5294 8.74916 14.2044 8.74916 15.0294C8.74916 15.8544 8.05809 16.5294 7.21345 16.5294C6.36881 16.5294 5.67773 15.8544 5.67773 15.0294ZM21.0349 15.0294C21.0349 14.2044 21.726 13.5294 22.5706 13.5294C23.4152 13.5294 24.1063 14.2044 24.1063 15.0294C24.1063 15.8544 23.4152 16.5294 22.5706 16.5294C21.726 16.5294 21.0349 15.8544 21.0349 15.0294Z" fill="#0070A6"/>
</svg>