<svg width="12" height="12" viewBox="0 0 12 12" fill="none" xmlns="http://www.w3.org/2000/svg">
<circle cx="6" cy="6" r="5.5" fill="#10CF96" stroke="#10CF96"/>
<path fill-rule="evenodd" clip-rule="evenodd" d="M8.76759 3.63782C9.02934 3.84103 9.07678 4.21796 8.87356 4.4797L5.55231 8.75748C5.44474 8.89604 5.28192 8.98058 5.1067 8.98886C4.93148 8.99713 4.76141 8.92832 4.64125 8.80052L3.1625 7.22771C2.93552 6.98629 2.94722 6.60657 3.18864 6.37959C3.43006 6.1526 3.80978 6.16431 4.03677 6.40573L5.03482 7.46726L7.92571 3.74379C8.12892 3.48205 8.50585 3.4346 8.76759 3.63782Z" fill="white"/>
</svg>
