<svg width="24" height="24" viewBox="0 0 24 24" fill="none" xmlns="http://www.w3.org/2000/svg">
<path fill-rule="evenodd" clip-rule="evenodd" d="M2 12C2 13.1047 2.89548 14 4 14C5.10452 14 6 13.1047 6 12C6 10.8953 5.10452 10 4 10C2.89548 10 2 10.8953 2 12ZM12 14C10.8955 14 10 13.1047 10 12C10 10.8953 10.8955 10 12 10C13.1045 10 14 10.8953 14 12C14 13.1047 13.1045 14 12 14ZM20 14C18.8955 14 18 13.1047 18 12C18 10.8953 18.8955 10 20 10C21.1045 10 22 10.8953 22 12C22 13.1047 21.1045 14 20 14Z" fill="#9DA0AC"/>
</svg>
