<svg width="970" height="299" viewBox="0 0 970 299" fill="none" xmlns="http://www.w3.org/2000/svg">
<path d="M169.925 80.5777L184.308 110.78H147.632C120.307 110.78 113.116 119.05 113.116 152.49C113.116 186.287 120.307 194.198 147.632 194.198H184.308L169.925 224.4C162.015 226.198 151.948 227.276 144.756 227.276C90.4628 227.276 77.1602 212.535 77.1602 152.49C77.1602 92.803 90.4628 77.7017 144.756 77.7017C151.948 77.7017 162.015 78.7804 169.925 80.5777Z" fill="#0070A6"/>
<path d="M0.573242 149.613C0.573242 37.7905 38.3266 0.755798 151.228 0.755798C264.129 0.755798 301.881 37.7905 301.881 149.613C301.881 209.3 291.096 247.772 263.769 270.424L242.196 245.254C261.971 226.557 270.241 195.996 270.241 149.613C270.241 59.7238 239.679 29.8811 151.228 29.8811C62.7759 29.8811 32.2146 59.7238 32.2146 149.613C32.2146 234.469 61.6986 269.705 133.249 269.705C173.16 269.705 184.307 261.076 184.307 223.681V80.5784H220.263V223.681C220.263 281.929 204.083 298.829 129.655 298.829C39.4052 298.829 0.573242 254.244 0.573242 149.613Z" fill="#0070A6"/>
<path d="M460.078 56.7785C475.745 56.7785 499.619 58.5185 510.311 60.5079L512.798 86.6199H460.078C423.522 86.6199 414.322 98.3052 414.322 146.301C414.322 194.297 423.522 205.984 460.078 205.984H487.929V147.547L520.258 144.561V205.984L517.773 232.095C505.586 234.084 477.983 235.825 460.078 235.825C401.638 235.825 381.994 213.444 381.994 146.301C381.994 79.1599 401.638 56.7785 460.078 56.7785Z" fill="#0070A6"/>
<path d="M550.113 233.339V109H581.199V136.356L593.881 109C600.844 107.506 608.056 106.511 614.273 106.511C624.468 106.511 634.169 107.506 641.131 109L643.616 136.356H581.199V233.339H550.113Z" fill="#0070A6"/>
<path d="M664.764 109H695.846V171.168C695.846 200.264 701.566 207.228 722.952 207.228H754.533V109H785.618V233.339H754.533V207.724L742.348 233.339C735.632 234.829 726.93 235.825 720.466 235.825C674.958 235.825 664.764 217.673 664.764 171.168V109Z" fill="#0070A6"/>
<path d="M871.678 141.327V136.356H811.995L809.261 109H913.705V137.596L847.557 201.012V205.984H917.434V233.339H805.527V204.743L871.678 141.327Z" fill="#0070A6"/>
<path d="M968.421 233.339H937.336V109H968.421V233.339ZM953.005 56.7788C966.681 56.7788 969.666 61.7495 969.666 74.6802C969.666 87.6148 966.681 92.5855 953.005 92.5855C939.326 92.5855 936.096 87.6148 936.096 74.6802C936.096 61.7495 939.326 56.7788 953.005 56.7788Z" fill="#0070A6"/>
</svg>
