<svg width="12" height="12" viewBox="0 0 12 12" fill="none" xmlns="http://www.w3.org/2000/svg">
    <path d="M5 3.75C5 3.33579 5.33579 3 5.75 3C6.16421 3 6.5 3.33579 6.5 3.75V5.5H8.25C8.66421 5.5 9 5.83579 9 6.25C9 6.66421 8.66421 7 8.25 7H5.75C5.33579 7 5 6.66421 5 6.25V3.75Z" fill="#9DA0AC"/>
    <path fill-rule="evenodd" clip-rule="evenodd" d="M6 12C9.31409 12 12 9.31357 12 6C12 2.68643 9.31409 0 6 0C2.68591 0 0 2.68643 0 6C0 9.31357 2.68591 12 6 12ZM6 10.5C8.48557 10.5 10.5 8.48522 10.5 6C10.5 3.51478 8.48557 1.5 6 1.5C3.51443 1.5 1.5 3.51478 1.5 6C1.5 8.48522 3.51443 10.5 6 10.5Z" fill="#9DA0AC"/>
</svg>
