<svg width="24" height="24" viewBox="0 0 24 24" fill="none" xmlns="http://www.w3.org/2000/svg">
<path fill-rule="evenodd" clip-rule="evenodd" d="M20.9998 2H2.99985C2.98543 2 2.97108 2.00031 2.95681 2.00091C2.68684 1.98943 2.41309 2.08676 2.20696 2.29289C1.81643 2.68342 1.81643 3.31658 2.20696 3.70711L10.9293 12.4295C10.9521 12.4522 10.9756 12.4736 10.9998 12.4937L10.9998 21C10.9998 21.5523 11.4476 22 11.9998 22C12.5521 22 12.9998 21.5523 12.9998 21L12.9999 12.3284L21.4209 3.90729C21.7628 3.74835 21.9998 3.40186 21.9998 3C21.9998 2.44772 21.5521 2 20.9998 2ZM18.4998 4L5.32828 4L11.914 10.5858L18.4998 4Z" fill="#004BC8"/>
</svg>
