<svg width="24" height="24" viewBox="0 0 24 24" fill="none" xmlns="http://www.w3.org/2000/svg">
<path d="M20.2929 21.7071C20.6834 22.0976 21.3166 22.0976 21.7071 21.7071C22.0976 21.3166 22.0976 20.6834 21.7071 20.2929L20.2929 21.7071ZM16.2929 17.7071L20.2929 21.7071L21.7071 20.2929L17.7071 16.2929L16.2929 17.7071Z" fill="#004BC8"/>
<circle cx="11" cy="11" r="8" stroke="#004BC8" stroke-width="2"/>
</svg>
