<svg width="141" height="102" viewBox="0 0 141 102" fill="none" xmlns="http://www.w3.org/2000/svg">
    <path d="M131.386 0H9.61364C4.31172 0 0 4.28878 0 9.5625V92.4375C0 97.7112 4.31172 102 9.61364 102H131.386C136.688 102 141 97.7112 141 92.4375V9.5625C141 4.28878 136.688 0 131.386 0ZM9.61364 95.625C7.84793 95.625 6.40909 94.197 6.40909 92.4375V78.7042L44.8636 42.4718L101.275 95.625H9.61364ZM134.591 92.4375C134.591 94.197 133.152 95.625 131.386 95.625H110.589L95.01 80.945L112.159 64.7859L134.591 85.9254V92.4375ZM134.591 77.1439L114.362 58.081C113.128 56.9176 111.19 56.9176 109.956 58.081L90.3538 76.5558L47.0668 35.7653C45.833 34.6019 43.8943 34.6019 42.6605 35.7653L6.40909 69.9226V9.5625C6.40909 7.803 7.84793 6.375 9.61364 6.375H131.386C133.152 6.375 134.591 7.803 134.591 9.5625V77.1439ZM92.9318 15.9375C84.0969 15.9375 76.9091 23.0871 76.9091 31.875C76.9091 40.6629 84.0969 47.8125 92.9318 47.8125C101.767 47.8125 108.955 40.6629 108.955 31.875C108.955 23.0871 101.767 15.9375 92.9318 15.9375ZM92.9318 41.4375C87.6299 41.4375 83.3182 37.1487 83.3182 31.875C83.3182 26.6013 87.6299 22.3125 92.9318 22.3125C98.2337 22.3125 102.545 26.6013 102.545 31.875C102.545 37.1487 98.2337 41.4375 92.9318 41.4375Z" fill="white"/>
</svg>
