<svg width="32" height="29" viewBox="0 0 32 29" fill="none" xmlns="http://www.w3.org/2000/svg">
    <g filter="url(#filter0_d)">
        <path d="M28 17.1026C28 18.2071 27.1046 19.1026 26 19.1026L13.7333 19.1026L10.8444 23L7.95555 19.1026L6 19.1026C4.89543 19.1026 4 18.2071 4 17.1026L4 4C4 2.89543 4.89543 2 6 2L26 2C27.1046 2 28 2.89543 28 4L28 17.1026Z" fill="#292929"/>
    </g>
    <path d="M8.07198 9.239L8.98998 10.4L8.57598 10.706L7.89198 9.59L7.21698 10.697L6.79398 10.391L7.71198 9.239L7.63998 7.781H8.16198L8.07198 9.239ZM7.54998 8.987V9.212L7.44198 9.356L6.32598 9.059L6.49698 8.573L7.54998 8.987ZM9.46698 9.068L8.35098 9.356L8.23398 9.212V8.987L9.30498 8.573L9.46698 9.068ZM13.1137 8.708H14.4187C14.8747 8.708 15.2197 8.813 15.4537 9.023C15.6877 9.227 15.8047 9.563 15.8047 10.031V12.812H15.1567L15.0667 12.137C14.8807 12.329 14.6287 12.503 14.3107 12.659C13.9987 12.809 13.6747 12.884 13.3387 12.884C12.9787 12.884 12.6907 12.791 12.4747 12.605C12.2587 12.413 12.1507 12.14 12.1507 11.786V11.336C12.1507 11.036 12.2377 10.805 12.4117 10.643C12.5857 10.481 12.8437 10.4 13.1857 10.4H14.9857V10.058C14.9857 9.818 14.9317 9.653 14.8237 9.563C14.7217 9.473 14.5297 9.428 14.2477 9.428H13.1227C12.8287 9.428 12.6067 9.434 12.4567 9.446C12.3067 9.452 12.1537 9.482 11.9977 9.536C11.8477 9.584 11.7427 9.65 11.6827 9.734C11.6227 9.812 11.5657 9.941 11.5117 10.121C11.4577 10.295 11.4247 10.493 11.4127 10.715C11.4007 10.937 11.3947 11.231 11.3947 11.597C11.3947 11.885 11.3977 12.125 11.4037 12.317C11.4097 12.503 11.4277 12.683 11.4577 12.857C11.4937 13.025 11.5267 13.157 11.5567 13.253C11.5867 13.343 11.6467 13.43 11.7367 13.514C11.8267 13.592 11.9077 13.649 11.9797 13.685C12.0577 13.715 12.1807 13.742 12.3487 13.766C12.5227 13.79 12.6787 13.805 12.8167 13.811C12.9607 13.811 13.1677 13.811 13.4377 13.811H15.7867V14.459C14.8567 14.513 14.0767 14.54 13.4467 14.54C12.9847 14.546 12.6127 14.537 12.3307 14.513C12.0487 14.495 11.7907 14.444 11.5567 14.36C11.3227 14.276 11.1487 14.174 11.0347 14.054C10.9207 13.94 10.8247 13.763 10.7467 13.523C10.6687 13.277 10.6177 13.013 10.5937 12.731C10.5757 12.443 10.5667 12.065 10.5667 11.597C10.5667 11.141 10.5757 10.775 10.5937 10.499C10.6117 10.223 10.6537 9.968 10.7197 9.734C10.7917 9.494 10.8787 9.317 10.9807 9.203C11.0827 9.083 11.2357 8.984 11.4397 8.906C11.6497 8.822 11.8777 8.768 12.1237 8.744C12.3757 8.72 12.7057 8.708 13.1137 8.708ZM14.9857 10.931L13.4917 10.967C13.2877 10.973 13.1467 11.012 13.0687 11.084C12.9967 11.15 12.9607 11.27 12.9607 11.444V11.633C12.9607 12.005 13.1437 12.191 13.5097 12.191C13.7617 12.191 14.0227 12.143 14.2927 12.047C14.5687 11.945 14.7997 11.807 14.9857 11.633V10.931ZM21.1566 10.004L20.8866 11.561H21.8676L21.7596 12.11H20.7876L20.4636 14H19.7706L20.1036 12.11H18.5286L18.2046 14H17.5116L17.8446 12.11H16.8006L16.9086 11.561H17.9346L18.2136 10.004H17.1786L17.2866 9.455H18.3036L18.5916 7.79H19.2846L18.9966 9.455H20.5626L20.8506 7.79H21.5436L21.2556 9.455H22.2456L22.1376 10.004H21.1566ZM20.4726 10.004H18.8976L18.6276 11.561H20.1936L20.4726 10.004ZM24.3109 10.436L24.2209 12.083H23.5279L23.4379 10.436V7.745H24.3109V10.436ZM23.7709 12.884H23.9869C24.1069 12.884 24.1909 12.908 24.2389 12.956C24.2869 13.004 24.3109 13.085 24.3109 13.199V13.676C24.3109 13.796 24.2869 13.88 24.2389 13.928C24.1909 13.976 24.1069 14 23.9869 14H23.7709C23.6509 14 23.5669 13.976 23.5189 13.928C23.4769 13.88 23.4559 13.796 23.4559 13.676V13.199C23.4559 13.085 23.4799 13.004 23.5279 12.956C23.5759 12.908 23.6569 12.884 23.7709 12.884Z" fill="white"/>
    <defs>
        <filter id="filter0_d" x="0" y="0" width="32" height="29" filterUnits="userSpaceOnUse" color-interpolation-filters="sRGB">
            <feFlood flood-opacity="0" result="BackgroundImageFix"/>
            <feColorMatrix in="SourceAlpha" type="matrix" values="0 0 0 0 0 0 0 0 0 0 0 0 0 0 0 0 0 0 127 0"/>
            <feOffset dy="2"/>
            <feGaussianBlur stdDeviation="2"/>
            <feColorMatrix type="matrix" values="0 0 0 0 0 0 0 0 0 0 0 0 0 0 0 0 0 0 0.1 0"/>
            <feBlend mode="normal" in2="BackgroundImageFix" result="effect1_dropShadow"/>
            <feBlend mode="normal" in="SourceGraphic" in2="effect1_dropShadow" result="shape"/>
        </filter>
    </defs>
</svg>
