<svg width="42" height="52" viewBox="0 0 42 52" fill="none" xmlns="http://www.w3.org/2000/svg">
    <g filter="url(#filter0_d)">
        <path d="M4 2H38V46L21 36L4 46V2Z" fill="#D15151"/>
    </g>
    <circle cx="21" cy="19" r="12" fill="white"/>
    <path d="M15.6586 23H14.4586V16.592C14.4586 16.304 14.4786 16.056 14.5186 15.848L12.5266 16.46L12.3826 15.56L14.4586 14.72H15.6586V23ZM19.1307 18.728V18.68C18.3467 18.592 17.9547 17.96 17.9547 16.784C17.9547 15.992 18.1387 15.428 18.5067 15.092C18.8827 14.756 19.5827 14.588 20.6067 14.588C21.6387 14.596 22.3387 14.768 22.7067 15.104C23.0827 15.432 23.2707 15.992 23.2707 16.784C23.2707 17.96 22.8787 18.592 22.0947 18.68V18.728C22.5907 18.776 22.9427 18.988 23.1507 19.364C23.3587 19.732 23.4627 20.256 23.4627 20.936C23.4627 21.72 23.2627 22.28 22.8627 22.616C22.4707 22.952 21.7187 23.124 20.6067 23.132C19.5187 23.14 18.7707 22.972 18.3627 22.628C17.9627 22.284 17.7627 21.72 17.7627 20.936C17.7627 20.256 17.8627 19.732 18.0627 19.364C18.2707 18.988 18.6267 18.776 19.1307 18.728ZM21.8667 15.848C21.6667 15.656 21.2507 15.56 20.6187 15.56C19.9867 15.56 19.5667 15.656 19.3587 15.848C19.1507 16.032 19.0467 16.384 19.0467 16.904C19.0467 17.432 19.1507 17.784 19.3587 17.96C19.5667 18.136 19.9907 18.224 20.6307 18.224C21.2707 18.224 21.6867 18.14 21.8787 17.972C22.0787 17.796 22.1787 17.44 22.1787 16.904C22.1787 16.384 22.0747 16.032 21.8667 15.848ZM20.6307 19.184C19.9347 19.192 19.4707 19.296 19.2387 19.496C19.0067 19.688 18.8907 20.08 18.8907 20.672C18.8907 21.224 19.0067 21.6 19.2387 21.8C19.4707 22 19.9307 22.1 20.6187 22.1C21.2987 22.1 21.7507 22 21.9747 21.8C22.1987 21.6 22.3107 21.224 22.3107 20.672C22.3107 20.072 22.1987 19.676 21.9747 19.484C21.7587 19.284 21.3107 19.184 20.6307 19.184ZM30.1998 19.844H27.9918V21.932H27.1158V19.844H24.9078V18.98H27.1038V16.88H27.9918V18.98H30.1998V19.844Z" fill="#D15151"/>
    <defs>
        <filter id="filter0_d" x="0" y="0" width="42" height="52" filterUnits="userSpaceOnUse" color-interpolation-filters="sRGB">
            <feFlood flood-opacity="0" result="BackgroundImageFix"/>
            <feColorMatrix in="SourceAlpha" type="matrix" values="0 0 0 0 0 0 0 0 0 0 0 0 0 0 0 0 0 0 127 0"/>
            <feOffset dy="2"/>
            <feGaussianBlur stdDeviation="2"/>
            <feColorMatrix type="matrix" values="0 0 0 0 0 0 0 0 0 0 0 0 0 0 0 0 0 0 0.1 0"/>
            <feBlend mode="normal" in2="BackgroundImageFix" result="effect1_dropShadow"/>
            <feBlend mode="normal" in="SourceGraphic" in2="effect1_dropShadow" result="shape"/>
        </filter>
    </defs>
</svg>
