<svg width="32" height="32" viewBox="0 0 32 32" fill="none" xmlns="http://www.w3.org/2000/svg">
    <g filter="url(#filter0_d)">
        <circle cx="16" cy="14" r="12" fill="#D15151"/>
    </g>
    <path d="M10.6586 18H9.45858V11.592C9.45858 11.304 9.47858 11.056 9.51858 10.848L7.52658 11.46L7.38258 10.56L9.45858 9.72H10.6586V18ZM14.1307 13.728V13.68C13.3467 13.592 12.9547 12.96 12.9547 11.784C12.9547 10.992 13.1387 10.428 13.5067 10.092C13.8827 9.756 14.5827 9.588 15.6067 9.588C16.6387 9.596 17.3387 9.768 17.7067 10.104C18.0827 10.432 18.2707 10.992 18.2707 11.784C18.2707 12.96 17.8787 13.592 17.0947 13.68V13.728C17.5907 13.776 17.9427 13.988 18.1507 14.364C18.3587 14.732 18.4627 15.256 18.4627 15.936C18.4627 16.72 18.2627 17.28 17.8627 17.616C17.4707 17.952 16.7187 18.124 15.6067 18.132C14.5187 18.14 13.7707 17.972 13.3627 17.628C12.9627 17.284 12.7627 16.72 12.7627 15.936C12.7627 15.256 12.8627 14.732 13.0627 14.364C13.2707 13.988 13.6267 13.776 14.1307 13.728ZM16.8667 10.848C16.6667 10.656 16.2507 10.56 15.6187 10.56C14.9867 10.56 14.5667 10.656 14.3587 10.848C14.1507 11.032 14.0467 11.384 14.0467 11.904C14.0467 12.432 14.1507 12.784 14.3587 12.96C14.5667 13.136 14.9907 13.224 15.6307 13.224C16.2707 13.224 16.6867 13.14 16.8787 12.972C17.0787 12.796 17.1787 12.44 17.1787 11.904C17.1787 11.384 17.0747 11.032 16.8667 10.848ZM15.6307 14.184C14.9347 14.192 14.4707 14.296 14.2387 14.496C14.0067 14.688 13.8907 15.08 13.8907 15.672C13.8907 16.224 14.0067 16.6 14.2387 16.8C14.4707 17 14.9307 17.1 15.6187 17.1C16.2987 17.1 16.7507 17 16.9747 16.8C17.1987 16.6 17.3107 16.224 17.3107 15.672C17.3107 15.072 17.1987 14.676 16.9747 14.484C16.7587 14.284 16.3107 14.184 15.6307 14.184ZM25.1998 14.844H22.9918V16.932H22.1158V14.844H19.9078V13.98H22.1038V11.88H22.9918V13.98H25.1998V14.844Z" fill="white"/>
    <defs>
        <filter id="filter0_d" x="0" y="0" width="32" height="32" filterUnits="userSpaceOnUse" color-interpolation-filters="sRGB">
            <feFlood flood-opacity="0" result="BackgroundImageFix"/>
            <feColorMatrix in="SourceAlpha" type="matrix" values="0 0 0 0 0 0 0 0 0 0 0 0 0 0 0 0 0 0 127 0"/>
            <feOffset dy="2"/>
            <feGaussianBlur stdDeviation="2"/>
            <feColorMatrix type="matrix" values="0 0 0 0 0 0 0 0 0 0 0 0 0 0 0 0 0 0 0.1 0"/>
            <feBlend mode="normal" in2="BackgroundImageFix" result="effect1_dropShadow"/>
            <feBlend mode="normal" in="SourceGraphic" in2="effect1_dropShadow" result="shape"/>
        </filter>
    </defs>
</svg>
