<svg width="1405" height="1403" viewBox="0 0 1405 1403" fill="none" xmlns="http://www.w3.org/2000/svg">
<path d="M551.883 376.164C563.748 370.658 576.317 365.803 589.06 361.892L543.311 200.499L531.846 159.863C512.054 165.757 492.316 173.007 473.429 181.174L489.173 220.142L551.883 376.164Z" fill="#46CEFE" fill-opacity="0.05"/>
<path opacity="0.15" d="M386.572 660.257C387.917 649.317 389.939 638.32 392.637 627.267C404.496 578.678 427.155 535.597 457.293 499.866L426.339 471.098L303.408 356.907C249.84 418.075 209.766 492.701 189.101 577.368C185.436 592.382 182.397 607.55 180.084 622.453L344.961 652.531L386.572 660.257Z" fill="#00283A"/>
<path d="M465.018 431.032L361.118 299.295L335.011 266.043C318.581 279.614 302.942 294.307 288.36 309.976L317.866 339.966L435.865 459.246C445.035 449.162 454.704 439.668 465.018 431.032Z" fill="#009EE2" fill-opacity="0.1"/>
<path d="M346.895 637.078L183.435 600.064L142.334 590.854C137.864 613.248 134.75 635.587 133.051 657.666L174.966 661.748L341.974 678.783C342.642 664.898 344.194 651.045 346.895 637.078Z" fill="#46CEFE" fill-opacity="0.05"/>
<path opacity="0.15" d="M444.166 951.621C397.816 904.512 365.083 845.039 350.375 780.464L185.674 812.076L144.201 820.072C166.514 924.951 218.331 1021.12 293.14 1097.27L323.729 1067.84L444.166 951.621Z" fill="#00283A"/>
<path d="M346.834 764.657C345.967 759.937 345.159 755.01 344.764 750.203L177.987 767.872L136.012 772.488C136.722 780.067 137.843 787.766 139.231 795.319L181.005 789.081L346.834 764.657Z" fill="#46CEFE" fill-opacity="0.05"/>
<path d="M433.456 939.886L308.159 1051.12L276.355 1079.24C289.562 1093.79 303.361 1107.83 317.871 1120.97C326.715 1111.24 336.211 1100.8 346.297 1089.86C379.338 1053.61 418.74 1010.04 459.145 966.09C450.041 957.422 441.35 948.874 433.456 939.886Z" fill="#46CEFE" fill-opacity="0.05"/>
<path d="M679.279 1055.7C662.958 1055 646.523 1053.15 630.24 1050.01L601.604 1215.35L594.297 1256.81C620.769 1261.79 647.159 1264.73 673.469 1265.64L674.767 1223.34L679.279 1055.7Z" fill="#46CEFE" fill-opacity="0.05"/>
<path opacity="0.15" d="M838.065 1027.66L910.159 1179.16L928.053 1217.11C1053.5 1160.89 1157.62 1059.03 1214.76 927.144L1175.55 911.387L1020.18 848.716C983.213 930.508 917.323 993.309 838.065 1027.66Z" fill="#00283A"/>
<path d="M807.139 993.48C801.858 995.527 796.43 997.309 791.267 998.944L805.623 1038.85L862.288 1196.48C871.403 1193.53 880.637 1190.17 889.52 1186.48L823.886 1032.07L807.139 993.48Z" fill="#009EE2" fill-opacity="0.1"/>
<path d="M791.575 358.139L838.169 197.095L849.863 156.679C828.434 150.479 806.793 145.782 785.207 142.441L778.253 184.228L750.355 349.342C764.078 351.301 777.71 354.351 791.575 358.139Z" fill="#009EE2" fill-opacity="0.1"/>
<path d="M1033.1 813.717L992.509 801.973C987.595 816.641 981.77 830.598 974.623 843.726L1013.13 861.124L1165.72 930.301C1176.85 908.046 1186.1 884.576 1193.82 860.216L1033.1 813.717V813.717Z" fill="#009EE2" fill-opacity="0.1"/>
<path opacity="0.15" d="M924.473 428.508C981.176 475.714 1021.58 539.933 1040.44 611.044L1201.15 563.211L1241.35 551.37C1210.84 440.291 1146.51 340.183 1057.67 266.352L1030.95 298.94L924.473 428.508Z" fill="#00283A"/>
<path d="M935.406 437.517L1047.26 312.559L1075.33 281.129C1058.85 266.305 1041.52 252.128 1023.09 239.421L998.804 273.96L902.234 410.936C913.962 419.022 925.185 428.079 935.406 437.517Z" fill="#46CEFE" fill-opacity="0.05"/>
<path d="M1002.61 635.063C1006.12 651.497 1008.21 668.191 1009.1 685.207L1051.24 681.535L1218.4 666.433C1216.67 638.447 1212.58 610.895 1206.34 583.839L1043.75 624.843L1002.61 635.063Z" fill="#46CEFE" fill-opacity="0.05"/>
</svg>
