{
    "name": "Русский",
    "language": "Язык:",
    "footer": {
        "menu": {
            "service": "О сервисе",
            "conditions": "Условия использования",
            "offer": "Оферта",
            "contacts": "Контакты"
        },
        "copyright": "© 2018-{{currentYear}}. IPEX. Биржа интеллектуальной собственности."
    },
    "header": {
        "menu": {
            "ois": "Мои оис",
            "favorites": "Избранное <span class=\"header-nav__item-favorites\">{{ favorites }}</span>",
            "personalData": "{{ personalData }}",
            "profile": "Профиль",
            "verify": "Идентификация",
            "settings": "Настройки",
            "exit": "Выход"
        }
    },
    "home": {
        "info": {
            "service": "Сервис",
            "buisnes": "Бизнес",
            "technology": "Технологии",
            "science": "Наука"
        }
    },
    "form": {
        "inputs": {
            "holder": {
                "emailPhone": "E-mail или телефон",
                "password": "Пароль",
                "repassword": "Повторите пароль"
            }
        }
    },
    "information": {
        "ipex": {
            "header": "Пользовательское соглашение с сервисом ipex",
            "text": "<p>Настоящее Пользовательское соглашение сайта nris.ru (далее&nbsp;— «Пользовательское соглашение» или «Соглашение») регламентирует отношения между АО&nbsp;«Биржа интеллектуальной собственности Айпекс»&nbsp;— администратором и&nbsp;владельцем сайта ipex.global (далее&nbsp;— «IPEX»), предоставляющим неограниченному кругу лиц право использовать возможности (функционал) Сайта предусмотренными Сайтом способами, и&nbsp;лицом, использующим какие-либо из&nbsp;таких возможностей (далее&nbsp;— «Пользователь»).</p>\n    <p>Используя Сайт, Пользователь подтверждает, что прочитал и&nbsp;выразил полное согласие (акцепт) с&nbsp;условиями настоящего Соглашения без какого-либо изменения или изъятия.</p>\n    <p>1. ПОНЯТИЯ И&nbsp;ОПРЕДЕЛЕНИЯ </p>\n    <p>Для целей настоящего Соглашения следующие термины (в&nbsp;случае, если в&nbsp;тексте Соглашения они будут написаны с&nbsp;заглавной буквы), будут иметь указанные ниже значения:</p>\n    <ul>\n      <li>1.1. Объект интеллектуальной собственности (ОИС)&nbsp;— охраняемый результат интеллектуальной деятельности и&nbsp;средства индивидуализации, как они указаны и&nbsp;понимаются в&nbsp;статье 1225 Гражданского кодекса Российской Федерации.</li>\n      <li>1.2. Эталонный экземпляр (Цифровой эталон)&nbsp;— запись ОИС, представленная в&nbsp;виде файла в&nbsp;определённом формате (txt, mp3, wav, mpeg, DivX и&nbsp;пр.).</li>\n      <li>1.3. Метаинформация (Метаданные)&nbsp;— совокупность систематизированной информации, имеющей отношение к&nbsp;ОИС и&nbsp;описывающей его, включая, но&nbsp;не&nbsp;ограничиваясь: автор, год создания, альбом, хронометраж, исполнитель и&nbsp;пр.</li>\n      <li>1.4. Базовая метаинформация (Базовые метаданные)&nbsp;— часть Метаинформации (Метаданных), допустимая к&nbsp;открытой публикации без разрешения Пользователя.</li>\n      <li>1.5. Расширенная метаинформация (Расширенные метаданные)&nbsp;— часть Метаинформации (Метаданных), допустимая к&nbsp;открытой публикации с&nbsp;соблюдением определённых условий, в&nbsp;т.ч. часть Метаинформации (Метаданных), представляющая из&nbsp;себя самостоятельный результат интеллектуальной деятельности.</li>\n      <li>1.6. Цифровой отпечаток&nbsp;— файл, представляющий собой необратимо преобразованный определённым образом Эталонный экземпляр (Цифровой эталон) или иной файл, при этом целью такого преобразования является систематизированное хранение, позволяющее с&nbsp;помощью электронно-вычислительной машины (ЭВМ) производить сравнение содержания различных Эталонных экземпляров (Цифровых эталонов) и&nbsp;иных файлов между собой и&nbsp;определение сходности такого содержанияю.</li>\n    </ul>"
        },
        "ipchain": {
            "header": "Пользовательское соглашение с сервисом ipchain",
            "text": "<p>Настоящее Пользовательское соглашение сайта nris.ru (далее&nbsp;— «Пользовательское соглашение» или «Соглашение») регламентирует отношения между АО&nbsp;«Биржа интеллектуальной собственности Айпекс»&nbsp;— администратором и&nbsp;владельцем сайта ipex.global (далее&nbsp;— «IPEX»), предоставляющим неограниченному кругу лиц право использовать возможности (функционал) Сайта предусмотренными Сайтом способами, и&nbsp;лицом, использующим какие-либо из&nbsp;таких возможностей (далее&nbsp;— «Пользователь»).</p>\n    <p>Используя Сайт, Пользователь подтверждает, что прочитал и&nbsp;выразил полное согласие (акцепт) с&nbsp;условиями настоящего Соглашения без какого-либо изменения или изъятия.</p>\n    <p>1. ПОНЯТИЯ И&nbsp;ОПРЕДЕЛЕНИЯ </p>\n    <p>Для целей настоящего Соглашения следующие термины (в&nbsp;случае, если в&nbsp;тексте Соглашения они будут написаны с&nbsp;заглавной буквы), будут иметь указанные ниже значения:</p>\n    <ul>\n      <li>1.1. Объект интеллектуальной собственности (ОИС)&nbsp;— охраняемый результат интеллектуальной деятельности и&nbsp;средства индивидуализации, как они указаны и&nbsp;понимаются в&nbsp;статье 1225 Гражданского кодекса Российской Федерации.</li>\n      <li>1.2. Эталонный экземпляр (Цифровой эталон)&nbsp;— запись ОИС, представленная в&nbsp;виде файла в&nbsp;определённом формате (txt, mp3, wav, mpeg, DivX и&nbsp;пр.).</li>\n      <li>1.3. Метаинформация (Метаданные)&nbsp;— совокупность систематизированной информации, имеющей отношение к&nbsp;ОИС и&nbsp;описывающей его, включая, но&nbsp;не&nbsp;ограничиваясь: автор, год создания, альбом, хронометраж, исполнитель и&nbsp;пр.</li>\n      <li>1.4. Базовая метаинформация (Базовые метаданные)&nbsp;— часть Метаинформации (Метаданных), допустимая к&nbsp;открытой публикации без разрешения Пользователя.</li>\n      <li>1.5. Расширенная метаинформация (Расширенные метаданные)&nbsp;— часть Метаинформации (Метаданных), допустимая к&nbsp;открытой публикации с&nbsp;соблюдением определённых условий, в&nbsp;т.ч. часть Метаинформации (Метаданных), представляющая из&nbsp;себя самостоятельный результат интеллектуальной деятельности.</li>\n      <li>1.6. Цифровой отпечаток&nbsp;— файл, представляющий собой необратимо преобразованный определённым образом Эталонный экземпляр (Цифровой эталон) или иной файл, при этом целью такого преобразования является систематизированное хранение, позволяющее с&nbsp;помощью электронно-вычислительной машины (ЭВМ) производить сравнение содержания различных Эталонных экземпляров (Цифровых эталонов) и&nbsp;иных файлов между собой и&nbsp;определение сходности такого содержанияю.</li>\n    </ul>"
        },
        "confirmEmail": {
            "header": "Подтверждение email",
            "text": "<p>На указанный email мы отправили письмо с ссылкой для подтверждения адреса электронной почты.</p>\n<p>Пожалуйста, проверьте Вашу почту.</p>"
        }
    }
}
