<svg width="714" height="729" viewBox="0 0 714 729" fill="none" xmlns="http://www.w3.org/2000/svg">
<path opacity="0.2" d="M217.867 63.5288C166.284 87.4886 121.505 124.498 88.2069 170.738L144.156 211.102C170.509 174.494 205.967 145.212 246.794 126.201L217.867 63.5288ZM96.5117 395.93L28.0167 404.15C34.8678 461.837 56.6411 515.529 89.7087 560.816L145.34 519.927C119.164 484.1 101.9 441.603 96.5117 395.93ZM438.907 614.184C404.519 625.542 367.282 629.947 328.967 625.852C321.195 625.021 313.589 623.827 306.056 622.345L292.686 690.108C302.161 692.01 311.81 693.465 321.629 694.514C370.014 699.685 417.052 694.126 460.422 679.79L438.907 614.184ZM624.057 168.467L568.425 209.356C594.643 245.187 611.903 287.726 617.296 333.358L685.791 325.137C678.902 267.404 657.129 213.712 624.057 168.467ZM458.023 48.5854L436.961 114.384C480.722 128.419 519.124 153.442 549.204 185.959L599.776 139.025C561.741 97.9079 513.312 66.2662 458.023 48.5854ZM569.614 518.139C543.261 554.747 507.803 584.029 466.976 603.041L495.903 665.712C547.449 641.706 592.265 604.743 625.563 558.503L569.614 518.139ZM164.566 543.282L113.994 590.216C151.982 631.371 200.416 662.97 255.747 680.656L276.809 614.857C233.044 600.864 194.683 575.846 164.566 543.282ZM392.141 34.7268C343.756 29.5559 296.676 35.1108 253.307 49.4466L274.863 115.057C309.251 103.699 346.488 99.2945 384.803 103.389C392.575 104.22 400.181 105.414 407.714 106.896L421.084 39.1327C411.609 37.2309 401.96 35.7762 392.141 34.7268Z" fill="url(#paint0_linear)"/>
<defs>
<linearGradient id="paint0_linear" x1="183.129" y1="148.852" x2="592.05" y2="654.594" gradientUnits="userSpaceOnUse">
<stop stop-color="#46CEFE"/>
<stop offset="1" stop-color="#1C57BD"/>
</linearGradient>
</defs>
</svg>
