<svg width="40" height="58" viewBox="0 0 40 58" fill="none" xmlns="http://www.w3.org/2000/svg">
    <rect x="1.78906" y="56.1992" width="54.4554" height="36.5613" transform="rotate(-90 1.78906 56.1992)" stroke="#709DCC" stroke-width="2" stroke-linecap="round" stroke-linejoin="round"/>
    <rect x="6" y="26.9995" width="18" height="28" transform="rotate(-90 6 26.9995)" stroke="#709DCC" stroke-width="2" stroke-linecap="round" stroke-linejoin="round"/>
    <line x1="11" y1="13.9995" x2="20.8812" y2="13.9995" stroke="#709DCC" stroke-width="2" stroke-linecap="round" stroke-linejoin="round"/>
    <line x1="11" y1="17.9521" x2="28.802" y2="17.9522" stroke="#709DCC" stroke-width="2" stroke-linecap="round" stroke-linejoin="round"/>
    <line x1="11" y1="21.9043" x2="24.8416" y2="21.9043" stroke="#709DCC" stroke-width="2" stroke-linecap="round" stroke-linejoin="round"/>
    <line x1="28.7256" y1="51.0078" x2="19.856" y2="51.0078" stroke="#709DCC" stroke-width="2" stroke-linecap="round" stroke-linejoin="round"/>
    <line x1="15.8794" y1="51.0078" x2="11.9505" y2="51.0078" stroke="#709DCC" stroke-width="2" stroke-linecap="round" stroke-linejoin="round"/>
</svg>
