<svg width="7" height="4" viewBox="0 0 7 4" fill="none" xmlns="http://www.w3.org/2000/svg">
    <path opacity="0.2" d="M1 1L3.5 3L6 1" stroke="white" stroke-width="1.3" stroke-linecap="square" stroke-linejoin="round"/>
</svg>
