<svg width="29" height="33" viewBox="0 0 29 33" fill="none" xmlns="http://www.w3.org/2000/svg">
<path fill-rule="evenodd" clip-rule="evenodd" d="M19.9984 6.08726C19.2956 3.61498 17.0723 1.80367 14.4462 1.80367C11.2571 1.80367 8.66265 4.47433 8.66265 7.75616V12.8068C8.66265 16.0891 11.2571 18.7593 14.4462 18.7593C17.6349 18.7593 20.2298 16.0891 20.2298 12.8068V7.99911C19.4738 8.37544 18.7671 8.58354 17.9526 8.58354C17.0911 8.58354 16.1097 8.35109 14.8218 7.8385C12.5597 6.93713 11.4527 7.78991 11.4068 7.82658C11.0295 8.12597 10.4816 8.06866 10.1813 7.68858C9.88107 7.30758 9.92294 6.75694 10.2856 6.43921C10.3608 6.37365 12.1614 4.84598 15.4539 6.15586C17.8614 7.11329 18.6951 6.86692 19.9984 6.08726ZM0.897994 33C0.445837 33 0.0627307 32.6428 0.025311 32.1711C0.0132815 32.0138 -0.260238 28.2909 1.31941 25.7097C3.59935 21.9826 7.72177 20.488 7.89639 20.4261C8.1953 20.3197 8.52851 20.3894 8.76462 20.6063C8.79224 20.631 11.5087 23.0885 14.3518 23.0885H14.4921C17.3369 23.0885 20.0788 20.6283 20.1055 20.6035C20.334 20.3968 20.6516 20.3257 20.9425 20.4169C21.1198 20.4724 25.3082 21.8249 27.5979 25.5675C29.1691 28.136 28.9989 31.951 28.9909 32.1124C28.9669 32.6094 28.5686 32.994 28.0719 32.967C27.589 32.9418 27.217 32.5186 27.2407 32.0211C27.2424 31.9877 27.3877 28.6096 26.1145 26.5285C24.5705 24.0036 21.8927 22.7217 20.8561 22.3013C19.8796 23.0821 17.3115 24.8922 14.4921 24.8922H14.3518C11.5493 24.8922 9.01053 23.1046 8.02603 22.3146C6.98496 22.779 4.34553 24.1481 2.8024 26.6706C1.53102 28.7494 1.7698 31.9927 1.77247 32.0253C1.81167 32.5218 1.45218 32.9569 0.969729 32.9972C0.945659 32.9991 0.922053 33 0.897994 33ZM14.4462 20.5634C10.2904 20.5634 6.90971 17.084 6.90971 12.8068V7.75615C6.90971 3.47943 10.2904 0 14.4462 0C18.6016 0 21.9823 3.47943 21.9823 7.75616V12.8068C21.9823 17.084 18.6016 20.5634 14.4462 20.5634Z" fill="#08BDF1"/>
</svg>
