<svg width="1410" height="436" viewBox="0 0 1410 436" fill="none" xmlns="http://www.w3.org/2000/svg">
<g opacity="0.3">
<path opacity="0.15" d="M705 1411.59C1093.81 1411.59 1409 1095.7 1409 706.022C1409 316.346 1093.81 0.450928 705 0.450928C316.192 0.450928 1 316.346 1 706.022C1 1095.7 316.192 1411.59 705 1411.59Z" stroke="white" stroke-width="0.621" stroke-miterlimit="10"/>
<path opacity="0.3" d="M705.179 1294.96C1029.76 1294.96 1292.89 1031.25 1292.89 705.938C1292.89 380.63 1029.76 116.915 705.179 116.915C380.593 116.915 117.464 380.63 117.464 705.938C117.464 1031.25 380.593 1294.96 705.179 1294.96Z" stroke="white" stroke-width="0.621" stroke-miterlimit="10"/>
<path opacity="0.6" d="M1212.79 709.154C1214.23 428.532 987.918 199.871 707.296 198.425C426.675 196.978 198.014 423.294 196.567 703.916C195.121 984.537 421.437 1213.2 702.058 1214.64C982.68 1216.09 1211.34 989.775 1212.79 709.154Z" stroke="white" stroke-width="0.621" stroke-miterlimit="10"/>
<path opacity="0.8" d="M707.486 1153.89C954.115 1152.67 1153.06 951.749 1151.85 705.11C1150.63 458.471 949.715 259.515 703.087 260.73C456.458 261.945 257.511 462.871 258.726 709.51C259.941 956.149 460.858 1155.1 707.486 1153.89Z" stroke="white" stroke-width="0.621" stroke-miterlimit="10"/>
<path d="M985.592 986.295C1140.29 831.597 1140.29 580.782 985.592 426.084C830.894 271.386 580.079 271.386 425.382 426.084C270.684 580.782 270.684 831.597 425.382 986.295C580.079 1140.99 830.894 1140.99 985.592 986.295Z" stroke="white" stroke-width="0.621" stroke-miterlimit="10"/>
<path d="M949.24 951C1084.45 815.795 1084.45 596.584 949.24 461.378C814.035 326.173 594.824 326.173 459.618 461.378C324.413 596.584 324.413 815.795 459.618 951C594.824 1086.21 814.035 1086.21 949.24 951Z" stroke="white" stroke-width="0.621" stroke-miterlimit="10"/>
<path d="M922.259 922.885C1041.94 803.208 1041.94 609.171 922.259 489.493C802.581 369.816 608.545 369.816 488.867 489.493C369.189 609.171 369.189 803.208 488.867 922.885C608.545 1042.56 802.581 1042.56 922.259 922.885Z" stroke="white" stroke-width="0.621" stroke-miterlimit="10"/>
</g>
</svg>
