{
    "name": "Русский",
    "language": "Язык:",
    "buy": "купить",
    "sell": "продать",
    "nameCompany": "IPEX. Биржа интеллектуальной собственности.",
    "footer": {
        "menu": {
            "service": "О сервисе",
            "conditions": "Условия использования",
            "offer": "Оферта",
            "contacts": "Контакты"
        },
        "copyright": "© 2018-{{currentYear}}. IPEX. Биржа интеллектуальной собственности."
    },
    "header": {
        "entrance": "Войти",
        "menu": {
            "ois": "Мои оис",
            "favorites": "Избранное",
            "identification": "Идентификация",
            "personalData": "{{ personalData }}",
            "profile": "Профиль",
            "verify": "Идентификация",
            "settings": "Настройки",
            "exit": "Выход"
        }
    },
    "home": {
        "title": {
            "service": "Сервис",
            "business": "Бизнес",
            "technology": "Технологии",
            "science": "Наука"
        },
        "info": {
            "service": "IPEX — цифровая платформа, состоящая из взаимосвязанных компонентов и сервисов, которые позволяют совершать все многообразие операций с объекатми интеллектуальной собственности.",
            "business": "Благодаря интеграции IPEX в инфраструктуру IPChain, биржа интеллектуальной собственности напрямую взаимодействует с остальными сервисами системы.",
            "technology": "Вся информация об объектах интеллектуальной собственности и данные о совершаемым с ними сделках записываются в IPChain, что гарантирует достоверность и неизменность информации.",
            "science": "IPEX является узлом распределенного реестра интеллектальной собственности, созданного с применением блокчейн-технологий."
        }
    },
    "form": {
        "entrance": "Вход",
        "passwordRecovery": "Восстановить пароль",
        "registration": "Регистрация",
        "firstStep": "Впервые на IPEX",
        "entranceByPartner": "Войти через партнерский сервис:",
        "sms-again": "Выслать код еще раз",
        "6-digit_password": "Пароль должен быть не менее 6 символов, содержать латинские строчные и заглавные буквы, и цифры.",
        "6-digit_code": "Введите 6-значный проверочный код, который мы выслали на номер телефона",
        "has_account": "Уже есть аккаунт?",
        "i_agree": {
            "i_accept": "Я принимаю",
            "user_agreement": "пользовательское соглашение",
            "with_IPEX": "с сервисом IPEX.",
            "with_IPCHAIN": "c Контуром ПДн ассоциации IPChain."
        },
        "inputs": {
            "holder": {
                "emailPhone": "E-mail или телефон",
                "password": "Пароль",
                "repassword": "Повторите пароль"
            },
            "confirm-form": {
                "verification_code": "Проверочный код"
            }
        }
    },
    "entrance_with_partner": {
        "title": "Вход через",
        "password": "Пароль",
        "i_agree": "Данным действием я подтверждаю передачу логина и пароля в сервис IPEX",
        "agreement": {
            "i_accept": "Я принимаю",
            "user_agreement": "пользовательское соглашение",
            "with_IPEX": "с сервисом IPEX.",
            "with_IPCHAIN": "c Контуром ПДн ассоциации IPChain."
        }
    },
    "password-recovery": {
        "title": "Восстановление пароля",
        "text": "На указанный адрес мы пришлем ссылку для сброса пароля.",
        "check": "Пожалуйста, проверьте Вашу почту.",
        "inMain": "На главную",
        "button": "Отправить"
    },
    "information": {
        "ipex": {
            "header": "Пользовательское соглашение с сервисом ipex",
            "text": "<p>Настоящее Пользовательское соглашение сайта nris.ru (далее&nbsp;— «Пользовательское соглашение» или «Соглашение») регламентирует отношения между АО&nbsp;«Биржа интеллектуальной собственности Айпекс»&nbsp;— администратором и&nbsp;владельцем сайта ipex.global (далее&nbsp;— «IPEX»), предоставляющим неограниченному кругу лиц право использовать возможности (функционал) Сайта предусмотренными Сайтом способами, и&nbsp;лицом, использующим какие-либо из&nbsp;таких возможностей (далее&nbsp;— «Пользователь»).</p>\n    <p>Используя Сайт, Пользователь подтверждает, что прочитал и&nbsp;выразил полное согласие (акцепт) с&nbsp;условиями настоящего Соглашения без какого-либо изменения или изъятия.</p>\n    <p>1. ПОНЯТИЯ И&nbsp;ОПРЕДЕЛЕНИЯ </p>\n    <p>Для целей настоящего Соглашения следующие термины (в&nbsp;случае, если в&nbsp;тексте Соглашения они будут написаны с&nbsp;заглавной буквы), будут иметь указанные ниже значения:</p>\n    <ul>\n      <li>1.1. Объект интеллектуальной собственности (ОИС)&nbsp;— охраняемый результат интеллектуальной деятельности и&nbsp;средства индивидуализации, как они указаны и&nbsp;понимаются в&nbsp;статье 1225 Гражданского кодекса Российской Федерации.</li>\n      <li>1.2. Эталонный экземпляр (Цифровой эталон)&nbsp;— запись ОИС, представленная в&nbsp;виде файла в&nbsp;определённом формате (txt, mp3, wav, mpeg, DivX и&nbsp;пр.).</li>\n      <li>1.3. Метаинформация (Метаданные)&nbsp;— совокупность систематизированной информации, имеющей отношение к&nbsp;ОИС и&nbsp;описывающей его, включая, но&nbsp;не&nbsp;ограничиваясь: автор, год создания, альбом, хронометраж, исполнитель и&nbsp;пр.</li>\n      <li>1.4. Базовая метаинформация (Базовые метаданные)&nbsp;— часть Метаинформации (Метаданных), допустимая к&nbsp;открытой публикации без разрешения Пользователя.</li>\n      <li>1.5. Расширенная метаинформация (Расширенные метаданные)&nbsp;— часть Метаинформации (Метаданных), допустимая к&nbsp;открытой публикации с&nbsp;соблюдением определённых условий, в&nbsp;т.ч. часть Метаинформации (Метаданных), представляющая из&nbsp;себя самостоятельный результат интеллектуальной деятельности.</li>\n      <li>1.6. Цифровой отпечаток&nbsp;— файл, представляющий собой необратимо преобразованный определённым образом Эталонный экземпляр (Цифровой эталон) или иной файл, при этом целью такого преобразования является систематизированное хранение, позволяющее с&nbsp;помощью электронно-вычислительной машины (ЭВМ) производить сравнение содержания различных Эталонных экземпляров (Цифровых эталонов) и&nbsp;иных файлов между собой и&nbsp;определение сходности такого содержанияю.</li>\n    </ul>"
        },
        "ipchain": {
            "header": "Пользовательское соглашение с сервисом ipchain",
            "text": "<p>Настоящее Пользовательское соглашение сайта nris.ru (далее&nbsp;— «Пользовательское соглашение» или «Соглашение») регламентирует отношения между АО&nbsp;«Биржа интеллектуальной собственности Айпекс»&nbsp;— администратором и&nbsp;владельцем сайта ipex.global (далее&nbsp;— «IPEX»), предоставляющим неограниченному кругу лиц право использовать возможности (функционал) Сайта предусмотренными Сайтом способами, и&nbsp;лицом, использующим какие-либо из&nbsp;таких возможностей (далее&nbsp;— «Пользователь»).</p>\n    <p>Используя Сайт, Пользователь подтверждает, что прочитал и&nbsp;выразил полное согласие (акцепт) с&nbsp;условиями настоящего Соглашения без какого-либо изменения или изъятия.</p>\n    <p>1. ПОНЯТИЯ И&nbsp;ОПРЕДЕЛЕНИЯ </p>\n    <p>Для целей настоящего Соглашения следующие термины (в&nbsp;случае, если в&nbsp;тексте Соглашения они будут написаны с&nbsp;заглавной буквы), будут иметь указанные ниже значения:</p>\n    <ul>\n      <li>1.1. Объект интеллектуальной собственности (ОИС)&nbsp;— охраняемый результат интеллектуальной деятельности и&nbsp;средства индивидуализации, как они указаны и&nbsp;понимаются в&nbsp;статье 1225 Гражданского кодекса Российской Федерации.</li>\n      <li>1.2. Эталонный экземпляр (Цифровой эталон)&nbsp;— запись ОИС, представленная в&nbsp;виде файла в&nbsp;определённом формате (txt, mp3, wav, mpeg, DivX и&nbsp;пр.).</li>\n      <li>1.3. Метаинформация (Метаданные)&nbsp;— совокупность систематизированной информации, имеющей отношение к&nbsp;ОИС и&nbsp;описывающей его, включая, но&nbsp;не&nbsp;ограничиваясь: автор, год создания, альбом, хронометраж, исполнитель и&nbsp;пр.</li>\n      <li>1.4. Базовая метаинформация (Базовые метаданные)&nbsp;— часть Метаинформации (Метаданных), допустимая к&nbsp;открытой публикации без разрешения Пользователя.</li>\n      <li>1.5. Расширенная метаинформация (Расширенные метаданные)&nbsp;— часть Метаинформации (Метаданных), допустимая к&nbsp;открытой публикации с&nbsp;соблюдением определённых условий, в&nbsp;т.ч. часть Метаинформации (Метаданных), представляющая из&nbsp;себя самостоятельный результат интеллектуальной деятельности.</li>\n      <li>1.6. Цифровой отпечаток&nbsp;— файл, представляющий собой необратимо преобразованный определённым образом Эталонный экземпляр (Цифровой эталон) или иной файл, при этом целью такого преобразования является систематизированное хранение, позволяющее с&nbsp;помощью электронно-вычислительной машины (ЭВМ) производить сравнение содержания различных Эталонных экземпляров (Цифровых эталонов) и&nbsp;иных файлов между собой и&nbsp;определение сходности такого содержанияю.</li>\n    </ul>"
        },
        "confirmEmail": {
            "header": "Подтверждение email",
            "text": "<p>На указанный email мы отправили письмо с ссылкой для подтверждения адреса электронной почты.</p>\n<p>Пожалуйста, проверьте Вашу почту.</p>"
        }
    },
    "profile": {
        "title": "Профиль",
        "text_percent": "Ваша анкета заполнена на ",
        "block": "Ваши данные проверяются модераторами. Процесс проверки может занимать до 1 рабочего дня. Благодарим за понимание!",
        "personal-data": {
            "title": "Личные данные",
            "surname": "Фамилия",
            "name": "Имя",
            "patronymic": "Отчество",
            "b_day": "День рождения",
            "phone": "Телефон"
        },
        "passport-data": {
            "title": "Паспортные данные",
            "series": "Серия и номер паспорта",
            "date": "Когда выдан",
            "issue": "Кем выдан",
            "code": "Код подразделения",
            "address": "Адрес регистрации"
        },
        "scan": {
            "title": "Скан паспорта",
            "passport-data": "Разворот с паспортными данными",
            "registration": "Разворот с пропиской",
            "selected": "Выберите файл или перетащите его сюда",
            "size": "PDF, JPEG, PNG или TIFF до 40 МБ",
            "change-file": "Заменить файл"
        },
        "setting": "Настройки",
        "password": {
            "title": "Пароль",
            "old_password": "Старый пароль",
            "new_password": "Новый пароль",
            "new_password_again": "Новый пароль еще раз"
        },
        "contact_data": {
            "title": "Контактные данные",
            "email": "Email адрес",
            "extra_email": "Дополнительный Email адрес (опционально)"
        },
        "confidentiality": {
            "title": "Конфиденциальность",
            "first_profile": "Показывать мой профиль другим пользователям",
            "list": "Показывать список моих ОИС"
        },
        "view": {
            "title": "Отображение моих ОИС",
            "info": "Показывать информацию о правах другим пользователям",
            "transactions": "Показывать историю транзакций другим пользователям",
            "rest_proposals": "Показывать остальные предложения другим пользователям",
            "exception": "Исключить из поисковой выдачи"
        }
    },
    "registration-verify": {
        "title": "Подтверждение...",
        "confirm": "Ваш email {{ email }} подтвержден.",
        "over_registration": "Еще немного и регистрация будет закончена",
        "error": "Что-то пошло не так...",
        "has_error": "Произошла ошибка!"
    },
    "event": {
        "load": "Загрузка...",
        "message-edit": "При редактировании неправильно заполнены обязательные поля. Пожалуйста, заполните их и снова нажмите кнопку сохранить."
    },
    "ois": {
        "title": "Мой ОИС",
        "not_alone": "Вы пока не добавили ни один ОИС.",
        "first_ois": "Загрузите ваш первый ОИС\nили приобретите на бирже.",
        "upload": {
            "load": "Загружено",
            "load_another_file": "Загрузить другой файл",
            "mp3": "MP3 (не менее 320 kbps), WAV, AIFF или OGG до 200 МБ",
            "my_ois": "Мой ОИС",
            "select": {
                "file": "ВЫБЕРИТЕ ФАЙЛ",
                "or": "или",
                "add": "ПЕРЕТАЩИТЕ ЕГО СЮДА"
            },
            "addOis": "Добавление ОИС",
            "name": "Название",
            "add_lang": "Добавить язык",
            "alt_name": "Альтернативное название (необязательно)",
            "select_ois": "Выберите тип ОИС",
            "description": "Описание",
            "cover_img": "Изображение обложки",
            "cover": "Обложка",
            "category": "Категории",
            "styles": "Жанры / стили",
            "mood": "Настроение",
            "tags": "Теги",
            "profanity": "Ненормативная лексика",
            "adult": "Контент для взрослых 18+"
        }
    },
    "button": {
        "save": "Сохранить",
        "send": "Отправить",
        "skip": "Пропустить",
        "clear": "Отчистить",
        "inMain": "На главную",
        "back": "Вернуться на главную",
        "farther": "Дальше",
        "registration": "Зарегистрироваться",
        "login": "Авторизоваться",
        "send_moderator": "Отправить на модерацию",
        "sell": "Купить ОИС",
        "add_ois": "Добавить ОИС"
    },
    "not_found": {
        "title": "Ошибка 404",
        "desc": "Что-то пошло не так ...",
        "not_page": "Такой страницы не существует или она временно недоступна. Пожалуйста, перезагрузите страницу или вернитесь на главную.",
        "call-center": "Если Вы считаете, что здесь точно должно что-то быть, свяжитесь со Службой поддержки. Мы ответим в самые короткие сроки.",
        "buttons": {
            "back": "Вернуться на Главную",
            "call": "Написать в Службу поддержки"
        }
    }
}
