<svg width="1440" height="911" viewBox="0 0 1440 911" fill="none" xmlns="http://www.w3.org/2000/svg">
<mask id="mask0" mask-type="alpha" maskUnits="userSpaceOnUse" x="0" y="0" width="1440" height="911">
<rect width="1440" height="911" fill="url(#paint0_linear)"/>
</mask>
<g mask="url(#mask0)">
</g>
<mask id="mask1" mask-type="alpha" maskUnits="userSpaceOnUse" x="0" y="0" width="1440" height="911">
<rect width="1440" height="911" fill="url(#paint1_linear)"/>
</mask>
<g mask="url(#mask1)">
<g opacity="0.06">
<path opacity="0.15" d="M719.5 1299.76C1184.25 1299.76 1561 922.163 1561 456.378C1561 -9.40656 1184.25 -387 719.5 -387C254.752 -387 -122 -9.40656 -122 456.378C-122 922.163 254.752 1299.76 719.5 1299.76Z" stroke="white" stroke-width="0.621" stroke-miterlimit="10"/>
<path opacity="0.3" d="M719.714 1160.34C1107.7 1160.34 1422.22 845.123 1422.22 456.278C1422.22 67.4327 1107.7 -247.789 719.714 -247.789C331.733 -247.789 17.2119 67.4327 17.2119 456.278C17.2119 845.123 331.733 1160.34 719.714 1160.34Z" stroke="white" stroke-width="0.621" stroke-miterlimit="10"/>
<path opacity="0.6" d="M1326.47 460.122C1328.2 124.692 1057.68 -148.63 722.25 -150.359C386.82 -152.088 113.498 118.431 111.769 453.861C110.04 789.291 380.559 1062.61 715.989 1064.34C1051.42 1066.07 1324.74 795.552 1326.47 460.122Z" stroke="white" stroke-width="0.621" stroke-miterlimit="10"/>
<path opacity="0.8" d="M722.47 991.718C1017.27 990.265 1255.07 750.097 1253.62 455.286C1252.17 160.475 1012.01 -77.3386 717.211 -75.8865C422.413 -74.4343 184.609 165.734 186.061 460.545C187.513 755.356 427.672 993.17 722.47 991.718Z" stroke="white" stroke-width="0.621" stroke-miterlimit="10"/>
<path d="M1054.89 791.391C1239.81 606.479 1239.81 306.676 1054.89 121.764C869.981 -63.1487 570.179 -63.1487 385.266 121.764C200.354 306.676 200.354 606.479 385.266 791.391C570.179 976.304 869.981 976.304 1054.89 791.391Z" stroke="white" stroke-width="0.621" stroke-miterlimit="10"/>
<path d="M1011.45 749.203C1173.06 587.59 1173.06 325.565 1011.45 163.952C849.834 2.33922 587.808 2.33921 426.196 163.952C264.583 325.565 264.583 587.59 426.196 749.203C587.808 910.816 849.834 910.816 1011.45 749.203Z" stroke="white" stroke-width="0.621" stroke-miterlimit="10"/>
<path d="M965.219 701.621C1100.55 566.287 1100.55 346.868 965.219 211.534C829.886 76.2002 610.466 76.2001 475.132 211.534C339.799 346.868 339.799 566.287 475.132 701.621C610.466 836.954 829.886 836.954 965.219 701.621Z" stroke="white" stroke-width="0.621" stroke-miterlimit="10"/>
</g>
<path opacity="0.3" d="M729.891 759.356C901.16 759.356 1040 620.514 1040 449.245C1040 277.976 901.16 139.135 729.891 139.135C558.621 139.135 419.78 277.976 419.78 449.245C419.78 620.514 558.621 759.356 729.891 759.356Z" stroke="url(#paint2_linear)" stroke-miterlimit="10"/>
<path opacity="0.3" d="M729.265 699.092C866.905 699.092 978.484 587.513 978.484 449.873C978.484 312.234 866.905 200.655 729.265 200.655C591.626 200.655 480.047 312.234 480.047 449.873C480.047 587.513 591.626 699.092 729.265 699.092Z" stroke="url(#paint3_linear)" stroke-miterlimit="10" stroke-dasharray="6 30 6 12 8 20"/>
<path opacity="0.3" d="M729.891 685.281C860.25 685.281 965.926 579.605 965.926 449.246C965.926 318.887 860.25 213.21 729.891 213.21C599.532 213.21 493.855 318.887 493.855 449.246C493.855 579.605 599.532 685.281 729.891 685.281Z" stroke="url(#paint4_linear)" stroke-miterlimit="10"/>
<path opacity="0.1" d="M746.021 673.981C869.793 673.981 970.129 573.645 970.129 449.873C970.129 326.101 869.793 225.765 746.021 225.765C622.25 225.765 521.913 326.101 521.913 449.873C521.913 573.645 622.25 673.981 746.021 673.981Z" fill="#00283A"/>
</g>
<mask id="mask2" mask-type="alpha" maskUnits="userSpaceOnUse" x="295" y="380" width="849" height="102">
<path opacity="0.04" d="M421.86 396.629H425.302V440.374H421.86V396.629ZM464.111 396.629H467.554V440.374H464.111V396.629ZM506.363 396.629H509.806V440.374H506.363V396.629ZM548.719 396.629H552.162V440.374H548.719V396.629ZM594.31 440.268H590.867V396.523H594.31V440.268ZM633.223 396.629H636.666V440.374H633.223V396.629ZM675.475 396.629H678.917V440.374H675.475V396.629ZM717.831 396.629H721.274V440.374H717.831V396.629ZM760.083 396.629H763.525V440.374H760.083V396.629ZM805.777 440.268H802.334V396.523H805.777V440.268ZM844.586 396.629H848.029V440.374H844.586V396.629ZM886.838 396.629H890.281V440.374H886.838V396.629ZM929.194 396.629H932.637V440.374H929.194V396.629ZM971.446 396.629H974.888V440.374H971.446V396.629ZM1017.14 396.629V440.374H1013.7V396.629H1017.14ZM446.376 396.629H446.689V459.227H442.725V396.629H443.038H446.376ZM488.628 396.629H488.941V459.227H484.977V396.629H485.29H488.628ZM530.984 396.629H531.297V459.227H527.333V396.629H527.646H530.984ZM573.236 396.629H573.549V459.227H569.584V396.629H569.897H573.236ZM657.739 396.629H658.052V459.227H654.088V396.629H654.401H657.739ZM700.095 396.629H700.408V459.227H696.444V396.629H696.757H700.095ZM742.347 396.629H742.66V459.227H738.696V396.629H739.009H742.347ZM784.599 396.629H784.912V459.227H780.948V396.629H781.261H784.599ZM869.103 396.629H869.416V459.227H865.451V396.629H865.764H869.103ZM911.459 396.629H911.772V459.227H907.807V396.629H908.12H911.459ZM953.71 396.629H954.023V459.227H950.059V396.629H950.372H953.71ZM995.962 396.629H996.275V459.227H992.311V396.629H992.624H995.962ZM616.218 482H611.419V380H616.218V482ZM827.581 380V482H822.782V380H827.581ZM1059.39 440.268H1055.95V396.523H1059.39V440.268ZM1098.31 396.629H1101.75V440.374H1098.31V396.629ZM1140.56 396.629H1144V440.374H1140.56V396.629ZM1080.57 396.629H1080.88V459.227H1076.92V396.629H1077.23H1080.57ZM1122.82 396.629H1123.13V459.227H1119.17V396.629H1119.48H1122.82ZM1038.94 482H1034.15V380H1038.94V482ZM379.608 396.629H383.051V440.374H379.608V396.629ZM337.356 396.629H340.799V440.374H337.356V396.629ZM295 396.629H298.443V440.374H295V396.629ZM361.873 396.629H362.186V459.227H358.117V396.629H358.43H361.873ZM319.621 396.629H319.934V459.227H315.969V396.629H316.282H319.621ZM404.855 380V482H400.056V380H404.855Z" fill="#8CC1FF"/>
</mask>
<g mask="url(#mask2)">
</g>
<path opacity="0.04" d="M456.86 430.629H460.302V474.374H456.86V430.629ZM499.111 430.629H502.554V474.374H499.111V430.629ZM541.363 430.629H544.806V474.374H541.363V430.629ZM583.719 430.629H587.162V474.374H583.719V430.629ZM629.31 474.268H625.867V430.523H629.31V474.268ZM668.223 430.629H671.666V474.374H668.223V430.629ZM710.475 430.629H713.917V474.374H710.475V430.629ZM752.831 430.629H756.274V474.374H752.831V430.629ZM795.083 430.629H798.525V474.374H795.083V430.629ZM840.777 474.268H837.334V430.523H840.777V474.268ZM879.586 430.629H883.029V474.374H879.586V430.629ZM921.838 430.629H925.281V474.374H921.838V430.629ZM964.194 430.629H967.637V474.374H964.194V430.629ZM1006.45 430.629H1009.89V474.374H1006.45V430.629ZM1052.14 430.629V474.374H1048.7V430.629H1052.14ZM481.376 430.629H481.689V493.227H477.725V430.629H478.038H481.376ZM523.628 430.629H523.941V493.227H519.977V430.629H520.29H523.628ZM565.984 430.629H566.297V493.227H562.333V430.629H562.646H565.984ZM608.236 430.629H608.549V493.227H604.584V430.629H604.897H608.236ZM692.739 430.629H693.052V493.227H689.088V430.629H689.401H692.739ZM735.095 430.629H735.408V493.227H731.444V430.629H731.757H735.095ZM777.347 430.629H777.66V493.227H773.696V430.629H774.009H777.347ZM819.599 430.629H819.912V493.227H815.948V430.629H816.261H819.599ZM904.103 430.629H904.416V493.227H900.451V430.629H900.764H904.103ZM946.459 430.629H946.772V493.227H942.807V430.629H943.12H946.459ZM988.71 430.629H989.023V493.227H985.059V430.629H985.372H988.71ZM1030.96 430.629H1031.28V493.227H1027.31V430.629H1027.62H1030.96ZM651.218 516H646.419V414H651.218V516ZM862.581 414V516H857.782V414H862.581ZM1094.39 474.268H1090.95V430.523H1094.39V474.268ZM1133.31 430.629H1136.75V474.374H1133.31V430.629ZM1175.56 430.629H1179V474.374H1175.56V430.629ZM1115.57 430.629H1115.88V493.227H1111.92V430.629H1112.23H1115.57ZM1157.82 430.629H1158.13V493.227H1154.17V430.629H1154.48H1157.82ZM1073.94 516H1069.15V414H1073.94V516ZM414.608 430.629H418.051V474.374H414.608V430.629ZM372.356 430.629H375.799V474.374H372.356V430.629ZM330 430.629H333.443V474.374H330V430.629ZM396.873 430.629H397.186V493.227H393.117V430.629H393.43H396.873ZM354.621 430.629H354.934V493.227H350.969V430.629H351.282H354.621ZM439.855 414V516H435.056V414H439.855Z" fill="#8CC1FF"/>
<defs>
<linearGradient id="paint0_linear" x1="38.3999" y1="23.7465" x2="848.622" y2="1300.01" gradientUnits="userSpaceOnUse">
<stop stop-color="#26238B"/>
<stop offset="1" stop-color="#001D24"/>
</linearGradient>
<linearGradient id="paint1_linear" x1="38.3999" y1="23.7465" x2="848.622" y2="1300.01" gradientUnits="userSpaceOnUse">
<stop stop-color="#26238B"/>
<stop offset="1" stop-color="#001D24"/>
</linearGradient>
<linearGradient id="paint2_linear" x1="418.612" y1="451.146" x2="1040.71" y2="451.146" gradientUnits="userSpaceOnUse">
<stop stop-color="#AEF5FF"/>
<stop offset="1" stop-color="#CCF0FF"/>
</linearGradient>
<linearGradient id="paint3_linear" x1="479.108" y1="451.401" x2="979.053" y2="451.401" gradientUnits="userSpaceOnUse">
<stop stop-color="#AEF5FF"/>
<stop offset="1" stop-color="#CCF0FF"/>
</linearGradient>
<linearGradient id="paint4_linear" x1="492.966" y1="450.693" x2="966.466" y2="450.693" gradientUnits="userSpaceOnUse">
<stop stop-color="#919797"/>
<stop offset="1" stop-color="#CCF0FF"/>
</linearGradient>
</defs>
</svg>
