<svg width="35" height="35" viewBox="0 0 35 35" fill="none" xmlns="http://www.w3.org/2000/svg">
    <g filter="url(#filter0_d)">
        <path d="M17.5003 2.52148L21.6715 11.0801L31 12.4529L24.2499 19.1144L25.8433 28.5215L17.5003 24.0803L9.1567 28.5215L10.7501 19.1144L4 12.4529L13.3285 11.0801L17.5003 2.52148Z" fill="#FFA552"/>
        <path d="M17.5002 3.66268L21.2221 11.2991L21.3377 11.5363L21.5987 11.5747L29.9349 12.8015L23.8987 18.7585L23.7134 18.9413L23.7569 19.1979L25.1805 27.6022L17.7352 23.6389L17.5003 23.5139L17.2653 23.6389L9.81953 27.6022L11.2431 19.1979L11.2866 18.9413L11.1013 18.7585L5.0651 12.8015L13.4013 11.5747L13.6623 11.5363L13.7779 11.2991L17.5002 3.66268Z" stroke="#FFA552"/>
    </g>
    <defs>
        <filter id="filter0_d" x="0" y="0.521484" width="35" height="34" filterUnits="userSpaceOnUse" color-interpolation-filters="sRGB">
            <feFlood flood-opacity="0" result="BackgroundImageFix"/>
            <feColorMatrix in="SourceAlpha" type="matrix" values="0 0 0 0 0 0 0 0 0 0 0 0 0 0 0 0 0 0 127 0"/>
            <feOffset dy="2"/>
            <feGaussianBlur stdDeviation="2"/>
            <feColorMatrix type="matrix" values="0 0 0 0 0 0 0 0 0 0 0 0 0 0 0 0 0 0 0.1 0"/>
            <feBlend mode="normal" in2="BackgroundImageFix" result="effect1_dropShadow"/>
            <feBlend mode="normal" in="SourceGraphic" in2="effect1_dropShadow" result="shape"/>
        </filter>
    </defs>
</svg>
