<svg width="56" height="60" viewBox="0 0 56 60" fill="none" xmlns="http://www.w3.org/2000/svg">
<path d="M47.6886 11.5129C47.8612 11.5129 47.9187 11.4459 47.957 11.379C48.0337 11.2547 48.0337 11.0635 47.957 10.9296C47.9187 10.8723 47.8612 10.7958 47.6886 10.7958C47.4105 10.7958 47.3624 11.0157 47.3624 11.1495C47.3624 11.2834 47.4009 11.5129 47.6886 11.5129ZM48.7531 37.5575C47.0364 40.5214 43.8332 42.3668 40.4094 42.3668C39.8244 42.3668 39.2394 42.319 38.664 42.2042L38.0502 42.0895L38.146 41.4776C38.2228 40.9708 38.2611 40.4545 38.2611 39.9382V38.6475L39.038 38.8196C40.1025 39.0586 41.215 39.0108 42.2604 38.6857C43.7661 38.2172 45.0224 37.2133 45.8088 35.8556C46.5952 34.4979 46.835 32.9108 46.4898 31.3714C46.1445 29.8608 45.2621 28.5413 44.0058 27.6521L43.9867 27.6425C43.9771 27.633 43.9675 27.633 43.9675 27.6235C43.8236 27.5279 43.6702 27.4322 43.5168 27.3462L38.2515 24.3153V20.4047L45.2142 24.4109C45.8855 24.8029 46.5185 25.2714 47.0748 25.7972C50.2972 28.8759 50.9781 33.7139 48.7531 37.5575ZM43.766 28.3406L44.1114 28.656C46.0295 30.3962 46.4802 33.2741 45.1855 35.5019C44.2073 37.2037 42.3563 38.2555 40.3711 38.2555C39.8053 38.2555 39.2394 38.1694 38.7024 37.9973L38.2515 37.8539V31.5148L43.766 28.3406ZM37.7433 30.989L32.0083 34.2876L28.6132 32.3371L33.8784 29.3062L33.9264 29.2871C33.9551 29.2775 33.9839 29.2584 34.0126 29.2392L34.0509 29.2106L39.6901 25.9693L43.0851 27.9199L37.7433 30.989ZM37.5419 39.9382C37.5419 40.7126 37.446 41.4871 37.2638 42.2425C36.1993 46.5546 32.3439 49.5567 27.894 49.5567C23.818 49.5567 20.1641 46.9943 18.8023 43.1699L18.5912 42.5867L19.1667 42.3572C19.6462 42.166 20.1161 41.9461 20.5669 41.6879L21.689 41.0473L21.9287 41.8122C22.2548 42.8448 22.8494 43.7818 23.655 44.518C24.8154 45.5793 26.3211 46.1721 27.894 46.1721C29.4668 46.1721 30.9724 45.5889 32.1328 44.518C33.2837 43.4567 33.9935 42.0225 34.1277 40.4832C34.1469 40.3111 34.1469 40.1294 34.1469 39.9478V33.886L37.5419 31.926V39.9382ZM18.083 41.9843C17.2007 42.2329 16.2991 42.3668 15.388 42.3668C11.9642 42.3668 8.7611 40.5214 7.04441 37.5575C5.01124 34.039 5.41397 29.6026 8.05133 26.5143L8.45417 26.0458L8.94329 26.4283C9.34609 26.7534 9.77763 27.0402 10.2284 27.2984L11.3505 27.9389L10.8134 28.5222C10.0749 29.3157 9.56669 30.3006 9.31733 31.3714C8.97208 32.9012 9.2118 34.4979 9.99822 35.8556C10.7846 37.2133 12.0505 38.2172 13.5562 38.6857C14.1604 38.8769 14.7935 38.9726 15.4264 38.9726C16.3279 38.9726 17.2006 38.7813 18.0254 38.3989L18.0446 38.3893C18.0542 38.3893 18.0542 38.3893 18.0638 38.3798C18.2172 38.3033 18.3803 38.2268 18.5433 38.1312L23.8084 35.1002L27.2035 37.0603L20.2408 41.0665C19.5407 41.468 18.8214 41.774 18.083 41.9843ZM17.5363 31.5148V37.8539L17.0951 37.9973C16.5485 38.1694 15.9923 38.2555 15.4264 38.2555C13.4412 38.2555 11.5902 37.2037 10.612 35.5019C9.31731 33.2645 9.76806 30.3866 11.6861 28.656L12.0314 28.3406L17.5363 31.5148ZM7.04441 13.5398C8.7611 10.5759 11.9642 8.73059 15.388 8.73059C15.973 8.73059 16.5581 8.78794 17.1335 8.89311L17.7472 9.00784L17.6513 9.61977C17.5746 10.1265 17.5363 10.6428 17.5363 11.1591V12.4498L16.7595 12.2777C15.695 12.0387 14.5825 12.0865 13.5371 12.4116C12.0314 12.8801 10.7654 13.8841 9.97902 15.2417C9.1926 16.5994 8.95288 18.1866 9.29814 19.7259C9.64339 21.2366 10.5257 22.556 11.782 23.4452L11.8012 23.4548C11.8108 23.4643 11.8108 23.4643 11.8204 23.4739C11.9643 23.5695 12.1177 23.6747 12.2711 23.7607L15.9347 25.8642H15.9443H15.9538L17.5459 26.7821V30.6926L10.5832 26.6864C9.91189 26.2944 9.28857 25.8355 8.72273 25.3001C5.50036 22.2214 4.80985 17.3834 7.04441 13.5398ZM12.0218 22.7568L11.6765 22.4413C9.75846 20.7011 9.30771 17.8233 10.6024 15.5955C11.5902 13.8936 13.4316 12.8419 15.4168 12.8419C15.9827 12.8419 16.5485 12.9279 17.0855 13.1L17.5267 13.2434V19.5825L12.0218 22.7568ZM21.6506 22.7759V35.5209L18.2555 37.4715V24.7264L21.6506 22.7759ZM23.7892 16.8097L27.1843 18.7698L16.1073 25.1471L12.7123 23.1871L23.7892 16.8097ZM18.2459 11.1591C18.2459 10.3847 18.3419 9.61022 18.5241 8.85489C19.5886 4.5428 23.444 1.54057 27.894 1.54057C31.9699 1.54057 35.6238 4.10296 36.976 7.92743L37.187 8.51064L36.6116 8.74016C36.1321 8.93138 35.6622 9.15124 35.2114 9.4094L34.0893 10.05L33.8496 9.2851C33.5235 8.25249 32.9194 7.30597 32.1234 6.56976C30.9629 5.50847 29.4668 4.92521 27.894 4.92521C26.3211 4.92521 24.8154 5.50848 23.655 6.57933C22.5041 7.64062 21.7945 9.07476 21.6698 10.6141C21.6506 10.7862 21.6506 10.9679 21.6506 11.1495V17.2113L18.2555 19.1618V11.1591H18.2459ZM27.894 13.6259L22.3795 10.4516L22.4754 9.99267C23.022 7.46852 25.3045 5.63278 27.8844 5.63278C30.4738 5.63278 32.7467 7.46852 33.2934 9.99267L33.3892 10.4516L27.894 13.6259ZM22.3603 28.7325V22.3648L27.894 19.1809L33.4276 22.3648V28.7421L27.894 31.926L22.3603 28.7325ZM33.4084 40.6458L33.3126 41.1047C32.7659 43.6288 30.4834 45.4646 27.9036 45.4646C25.3141 45.4646 23.0412 43.6288 22.4946 41.1047L22.3987 40.6458L27.9132 37.4715L33.4084 40.6458ZM22.3603 33.4653V29.5548L33.4372 35.9321V39.8426L22.3603 33.4653ZM33.4372 17.632V21.5425L23.981 16.1022C23.9714 16.1022 23.9715 16.0926 23.9619 16.0926L22.3603 15.1748V11.2643L33.4372 17.632ZM34.1469 15.5764L37.5419 13.6163V24.4109L37.5322 24.4587C37.5227 24.4873 37.5227 24.5256 37.5322 24.5543L37.5419 24.6021V26.3614L34.1469 28.3214V15.5764ZM38.2611 13.2434L38.712 13.1C39.249 12.9279 39.8149 12.8419 40.3903 12.8419C42.3755 12.8419 44.2264 13.8936 45.2046 15.5955C46.4993 17.8328 46.0485 20.7107 44.1305 22.4413L43.7852 22.7568L38.2707 19.5825V13.2434H38.2611ZM50.6424 31.2376C50.3547 29.2871 49.5107 27.4609 48.216 25.9693L47.8515 25.5486L48.216 25.128C49.5107 23.6364 50.3547 21.8198 50.6424 19.8597C50.9876 17.5651 50.5369 15.1939 49.3669 13.1861C49.2998 13.0809 49.1846 13.0044 49.0599 13.0044C49.0024 13.0044 48.9353 13.0235 48.8874 13.0522C48.8011 13.1 48.7435 13.1765 48.7243 13.2721C48.6955 13.3678 48.7148 13.4633 48.7627 13.5398C50.7959 17.0583 50.393 21.4947 47.7557 24.583L47.3529 25.0515L46.8638 24.669C46.461 24.3535 46.0294 24.0571 45.5786 23.799L44.4566 23.1584L44.9936 22.5751C45.7321 21.772 46.25 20.7872 46.4898 19.7259C46.835 18.1961 46.5952 16.5994 45.8088 15.2417C45.0224 13.8841 43.7565 12.8801 42.2604 12.4116C41.6562 12.2204 41.0233 12.1248 40.3903 12.1248C39.4888 12.1248 38.616 12.316 37.7912 12.6889L37.7433 12.708C37.7337 12.708 37.7337 12.708 37.7241 12.7176L37.6953 12.7272C37.5419 12.8036 37.3981 12.8801 37.2734 12.947L32.0083 15.9779L28.6132 14.0275L35.5759 10.0213C36.2568 9.62932 36.9761 9.32335 37.7145 9.113C38.5777 8.86441 39.4696 8.74016 40.3807 8.74016C42.107 8.74016 43.8141 9.19905 45.3006 10.0691C45.3581 10.0978 45.4156 10.1169 45.4827 10.1169C45.6074 10.1169 45.7226 10.05 45.7897 9.94482C45.8377 9.86833 45.8472 9.76319 45.828 9.67714C45.8088 9.58152 45.7417 9.50505 45.665 9.45725C44.073 8.52025 42.2412 8.03259 40.3807 8.03259C39.719 8.03259 39.0668 8.08995 38.4242 8.21425L37.8776 8.31947L37.6953 7.79356C37.0432 5.92913 35.8827 4.29422 34.3387 3.06083C32.5165 1.61709 30.2244 0.823486 27.9036 0.823486C25.5731 0.823486 23.2905 1.61709 21.4683 3.06083C19.9147 4.28465 18.7542 5.92913 18.1117 7.79356L17.9295 8.31947L17.3829 8.21425C16.7403 8.08995 16.0786 8.02307 15.4264 8.02307C14.1029 8.02307 12.8178 8.27161 11.5999 8.74967C9.43242 9.60062 7.60065 11.1782 6.44021 13.1861C5.27977 15.1939 4.81936 17.5651 5.16461 19.8597C5.45232 21.8102 6.29631 23.6364 7.59101 25.128L7.95545 25.5486L7.59101 25.9693C6.29631 27.4609 5.45232 29.2775 5.16461 31.2376C4.81936 33.5322 5.27018 35.9034 6.44021 37.9112C7.60065 39.9191 9.44201 41.4967 11.5999 42.3476C12.8178 42.8257 14.1125 43.0743 15.436 43.0743C16.0882 43.0743 16.7498 43.0073 17.3924 42.883L17.9391 42.7779L18.1213 43.3037C18.7734 45.1682 19.9339 46.8031 21.4779 48.0365C23.3001 49.4803 25.5827 50.2738 27.9132 50.2738C30.2436 50.2738 32.5261 49.4803 34.3483 48.0365C35.9019 46.8127 37.0624 45.1682 37.7049 43.3037L37.8871 42.7779L38.4338 42.883C39.0764 43.0073 39.7381 43.0743 40.3903 43.0743C41.7138 43.0743 42.9989 42.8352 44.2169 42.3476C46.3843 41.4967 48.2161 39.9191 49.3765 37.9112C50.5369 35.9034 50.9876 33.5322 50.6424 31.2376Z" fill="white"/>
<path opacity="0.2" d="M51.5808 12.8695C51.7874 12.8695 51.8562 12.7894 51.9021 12.7093C51.9939 12.5605 51.9939 12.3316 51.9021 12.1714C51.8562 12.1027 51.7874 12.0112 51.5808 12.0112C51.248 12.0112 51.1905 12.2744 51.1905 12.4346C51.1905 12.5948 51.2365 12.8695 51.5808 12.8695ZM52.8548 44.0441C50.8004 47.5919 46.967 49.8007 42.8697 49.8007C42.1696 49.8007 41.4695 49.7435 40.7809 49.6062L40.0463 49.4688L40.1611 48.7364C40.2529 48.1298 40.2988 47.5118 40.2988 46.8938V45.3488L41.2285 45.5548C42.5025 45.8409 43.8338 45.7837 45.0848 45.3945C46.8867 44.8338 48.3901 43.6322 49.3312 42.007C50.2724 40.3819 50.5594 38.4822 50.1462 36.6396C49.733 34.8314 48.677 33.252 47.1736 32.1877L47.1507 32.1763C47.1392 32.1648 47.1277 32.1649 47.1277 32.1534C46.9556 32.039 46.772 31.9245 46.5884 31.8215L40.2873 28.1936V23.5128L48.6197 28.308C49.4231 28.7772 50.1806 29.338 50.8463 29.9675C54.7026 33.6526 55.5175 39.4435 52.8548 44.0441ZM46.8866 33.0117L47.2999 33.3894C49.5953 35.4722 50.1348 38.9171 48.5854 41.5836C47.4147 43.6207 45.1996 44.8796 42.8238 44.8796C42.1467 44.8796 41.4696 44.7766 40.8269 44.5706L40.2873 44.3989V36.8112L46.8866 33.0117ZM39.6791 36.1818L32.8159 40.1301L28.753 37.7955L35.0539 34.1676L35.1113 34.1447C35.1457 34.1333 35.1801 34.1103 35.2146 34.0874L35.2604 34.0532L42.0089 30.1735L46.0718 32.5082L39.6791 36.1818ZM39.438 46.8938C39.438 47.8208 39.3234 48.7478 39.1053 49.6519C37.8313 54.8133 33.2175 58.4069 27.8922 58.4069C23.0144 58.4069 18.6417 55.3398 17.012 50.762L16.7594 50.0639L17.4481 49.7892C18.022 49.5603 18.5843 49.2971 19.1237 48.9881L20.4666 48.2214L20.7535 49.1369C21.1437 50.3729 21.8552 51.4945 22.8193 52.3757C24.208 53.646 26.01 54.3556 27.8922 54.3556C29.7744 54.3556 31.5762 53.6575 32.965 52.3757C34.3422 51.1054 35.1916 49.3887 35.3523 47.5461C35.3752 47.3401 35.3753 47.1227 35.3753 46.9052V39.6495L39.438 37.3034V46.8938ZM16.1512 49.3429C15.0953 49.6404 14.0164 49.8007 12.9261 49.8007C8.82877 49.8007 4.99549 47.5919 2.9411 44.0441C0.507961 39.8326 0.989913 34.5224 4.1461 30.8258L4.62819 30.265L5.21353 30.7229C5.69557 31.112 6.21199 31.4553 6.75142 31.7643L8.09428 32.531L7.4515 33.2291C6.56777 34.179 5.95955 35.3578 5.66115 36.6396C5.24798 38.4707 5.53486 40.3819 6.47598 42.007C7.4171 43.6322 8.93202 44.8338 10.7339 45.3945C11.457 45.6234 12.2145 45.7379 12.972 45.7379C14.0509 45.7379 15.0952 45.509 16.0823 45.0512L16.1052 45.0398C16.1167 45.0398 16.1167 45.0398 16.1282 45.0284C16.3118 44.9368 16.507 44.8453 16.7021 44.7308L23.003 41.1029L27.0659 43.4491L18.7335 48.2443C17.8957 48.7249 17.0349 49.0911 16.1512 49.3429ZM15.4969 36.8112V44.3989L14.969 44.5706C14.3148 44.7766 13.6492 44.8796 12.972 44.8796C10.5963 44.8796 8.38118 43.6207 7.21053 41.5836C5.66112 38.9056 6.20054 35.4608 8.49595 33.3894L8.90911 33.0117L15.4969 36.8112ZM2.9411 15.2957C4.99549 11.7479 8.82877 9.53921 12.9261 9.53921C13.6262 9.53921 14.3264 9.60786 15.015 9.73374L15.7494 9.87107L15.6346 10.6035C15.5428 11.2101 15.4969 11.8281 15.4969 12.4461V13.991L14.5674 13.785C13.2934 13.4989 11.9621 13.5562 10.7111 13.9453C8.90918 14.5061 7.39412 15.7078 6.453 17.3329C5.51188 18.958 5.225 20.8577 5.63818 22.7003C6.05135 24.5085 7.1072 26.0878 8.61069 27.1521L8.63367 27.1636C8.64515 27.175 8.64517 27.1751 8.65664 27.1865C8.8288 27.3009 9.0124 27.4268 9.19603 27.5298L13.5803 30.0476H13.5918H13.6032L15.5084 31.1463V35.827L7.17606 31.0318C6.37267 30.5626 5.62673 30.0132 4.94958 29.3724C1.09329 25.6872 0.266943 19.8964 2.9411 15.2957ZM8.89762 26.3282L8.48446 25.9505C6.18905 23.8676 5.64964 20.4229 7.19904 17.7563C8.38117 15.7192 10.5848 14.4603 12.9605 14.4603C13.6377 14.4603 14.3148 14.5633 14.9575 14.7693L15.4854 14.9409V22.5286L8.89762 26.3282ZM20.4206 26.3511V41.6064L16.3577 43.9412V28.6857L20.4206 26.3511ZM22.98 19.2097L27.0429 21.5559L13.7869 29.1893L9.72393 26.8432L22.98 19.2097ZM16.3462 12.4461C16.3462 11.5191 16.461 10.5921 16.6791 9.68799C17.953 4.52656 22.5668 0.932978 27.8922 0.932978C32.7699 0.932978 37.1427 4.00008 38.7609 8.57785L39.0134 9.27594L38.3248 9.55066C37.7509 9.77955 37.1886 10.0427 36.6492 10.3517L35.3063 11.1185L35.0194 10.2029C34.6292 8.96694 33.9062 7.83398 32.9536 6.95276C31.5649 5.68243 29.7744 4.98428 27.8922 4.98428C26.01 4.98428 24.208 5.68244 22.8193 6.96421C21.442 8.23454 20.5928 9.95117 20.4436 11.7937C20.4206 11.9997 20.4206 12.2172 20.4206 12.4346V19.6904L16.3577 22.025V12.4461H16.3462ZM27.8922 15.3988L21.2929 11.5992L21.4076 11.0499C22.0618 8.02855 24.7934 5.83123 27.8807 5.83123C30.9795 5.83123 33.6996 8.02855 34.3538 11.0499L34.4685 11.5992L27.8922 15.3988ZM21.2699 33.4809V25.859L27.8922 22.048L34.5145 25.859V33.4924L27.8922 37.3034L21.2699 33.4809ZM34.4915 47.7407L34.3768 48.29C33.7226 51.3114 30.991 53.5087 27.9037 53.5087C24.8049 53.5087 22.0848 51.3114 21.4306 48.29L21.3159 47.7407L27.9152 43.9412L34.4915 47.7407ZM21.2699 39.1459V34.4651L34.526 42.0985V46.7794L21.2699 39.1459ZM34.526 20.194V24.8747L23.2095 18.3628C23.198 18.3628 23.1981 18.3514 23.1866 18.3514L21.2699 17.2527V12.5719L34.526 20.194ZM35.3753 17.7334L39.438 15.3873V28.308L39.4265 28.3652C39.4151 28.3996 39.4151 28.4454 39.4265 28.4797L39.438 28.5369V30.6427L35.3753 32.9888V17.7334ZM40.2988 14.9409L40.8383 14.7693C41.4811 14.5633 42.1582 14.4603 42.8468 14.4603C45.2226 14.4603 47.4375 15.7192 48.6082 17.7563C50.1576 20.4343 49.6182 23.879 47.3228 25.9505L46.9096 26.3282L40.3103 22.5286V14.9409H40.2988ZM55.1157 36.4794C54.7714 34.1447 53.7614 31.9588 52.212 30.1735L51.7759 29.6699L52.212 29.1664C53.7614 27.381 54.7714 25.2066 55.1157 22.8605C55.5289 20.1138 54.9895 17.2756 53.5893 14.8723C53.509 14.7464 53.3712 14.6548 53.222 14.6548C53.1531 14.6548 53.0729 14.6777 53.0155 14.712C52.9122 14.7693 52.8433 14.8609 52.8203 14.9753C52.7859 15.0898 52.8089 15.2042 52.8663 15.2957C55.2994 19.5073 54.8173 24.8175 51.6611 28.514L51.1792 29.0749L50.5938 28.617C50.1118 28.2394 49.5952 27.8846 49.0558 27.5756L47.7131 26.8088L48.3557 26.1107C49.2395 25.1494 49.8593 23.9706 50.1462 22.7003C50.5594 20.8692 50.2724 18.958 49.3312 17.3329C48.3901 15.7078 46.8752 14.5061 45.0848 13.9453C44.3617 13.7164 43.6043 13.602 42.8468 13.602C41.768 13.602 40.7235 13.8308 39.7364 14.2771L39.6791 14.3001C39.6677 14.3001 39.6676 14.3001 39.6562 14.3115L39.6217 14.323C39.4381 14.4145 39.266 14.5061 39.1168 14.5862L32.8159 18.214L28.753 15.8794L37.0853 11.0842C37.9002 10.615 38.7609 10.2487 39.6447 9.99694C40.6776 9.69939 41.745 9.55066 42.8353 9.55066C44.9012 9.55066 46.9441 10.0999 48.7231 11.1414C48.7919 11.1757 48.8607 11.1986 48.9411 11.1986C49.0903 11.1986 49.2281 11.1185 49.3084 10.9926C49.3658 10.901 49.3772 10.7752 49.3542 10.6722C49.3313 10.5578 49.251 10.4662 49.1592 10.409C47.254 9.28744 45.0619 8.70372 42.8353 8.70372C42.0434 8.70372 41.2629 8.77239 40.494 8.92117L39.8398 9.04711L39.6217 8.41761C38.8413 6.18594 37.4525 4.229 35.6047 2.75267C33.4241 1.02456 30.6811 0.074646 27.9037 0.074646C25.1148 0.074646 22.3831 1.02456 20.2025 2.75267C18.3432 4.21756 16.9545 6.18594 16.1855 8.41761L15.9675 9.04711L15.3134 8.92117C14.5444 8.77239 13.7525 8.69233 12.972 8.69233C11.3882 8.69233 9.85028 8.98983 8.3927 9.56205C5.79888 10.5806 3.60676 12.469 2.21804 14.8723C0.829313 17.2756 0.278325 20.1138 0.691499 22.8605C1.03581 25.1951 2.04582 27.381 3.59523 29.1664L4.03136 29.6699L3.59523 30.1735C2.04582 31.9588 1.03581 34.1333 0.691499 36.4794C0.278325 39.226 0.817836 42.0642 2.21804 44.4676C3.60676 46.8709 5.81036 48.7592 8.3927 49.7778C9.85028 50.35 11.3997 50.6476 12.9835 50.6476C13.764 50.6476 14.5558 50.5674 15.3247 50.4187L15.979 50.2928L16.197 50.9222C16.9774 53.1539 18.3662 55.1109 20.214 56.5872C22.3946 58.3153 25.1262 59.2652 27.9152 59.2652C30.7041 59.2652 33.4356 58.3153 35.6162 56.5872C37.4755 55.1223 38.8642 53.1539 39.6332 50.9222L39.8512 50.2928L40.5055 50.4187C41.2744 50.5674 42.0664 50.6476 42.8468 50.6476C44.4307 50.6476 45.9686 50.3615 47.4262 49.7778C50.02 48.7592 52.2121 46.8709 53.6008 44.4676C54.9895 42.0642 55.5289 39.226 55.1157 36.4794Z" fill="white"/>
</svg>
