<svg width="50" height="56" viewBox="0 0 50 56" fill="none" xmlns="http://www.w3.org/2000/svg">
<path d="M29.0118 16.0338C32.2935 16.0338 34.9608 18.7011 34.9608 21.9828C34.9608 22.8894 34.7511 23.7959 34.354 24.6126L34.2641 24.7999H30.8475L31.0498 24.3354C31.1546 24.0881 31.2146 23.8334 31.2146 23.5712C31.2146 22.4473 30.2256 21.5332 29.0118 21.5332C28.3075 21.5332 27.7381 21.0312 27.7381 20.4169C27.7381 19.8025 28.3075 19.3005 29.0118 19.3005C29.7161 19.3005 30.2856 19.8025 30.2856 20.4169C30.2856 20.6716 30.4953 20.8814 30.7501 20.8814C31.0048 20.8814 31.2146 20.6716 31.2146 20.4169C31.2146 19.5402 30.6077 18.761 29.7086 18.4838L29.4839 18.4164L29.4764 18.1766C29.4689 17.9294 29.2666 17.727 29.0118 17.727C28.7646 17.727 28.5548 17.9294 28.5548 18.1766L28.5473 18.4164L28.3225 18.4838C27.4234 18.761 26.8165 19.5402 26.8165 20.4169C26.8165 21.5407 27.8055 22.4548 29.0193 22.4548C29.7236 22.4548 30.2931 22.9568 30.2931 23.5712C30.2931 24.1856 29.7236 24.6876 29.0193 24.6876C28.315 24.6876 27.7456 24.1856 27.7456 23.5712C27.7456 23.3165 27.5358 23.1067 27.2811 23.1067C27.0263 23.1067 26.8165 23.3165 26.8165 23.5712C26.8165 23.8334 26.869 24.0956 26.9813 24.3354L27.1837 24.7999H23.7671L23.6772 24.6126C23.2801 23.8034 23.0703 22.8894 23.0703 21.9828C23.0628 18.7086 25.7301 16.0338 29.0118 16.0338ZM22.5608 24.3504L22.7256 24.7999H17.8256C17.5708 24.7999 17.361 25.0022 17.361 25.2645C17.361 25.5192 17.5633 25.729 17.8256 25.729H40.2056C40.4603 25.729 40.6701 25.5192 40.6701 25.2645C40.6701 25.0097 40.4603 24.7999 40.2056 24.7999H35.313L35.4778 24.3504C35.7551 23.5862 35.8974 22.792 35.8974 21.9828C35.8974 18.1916 32.8105 15.1047 29.0193 15.1047C25.2281 15.1047 22.1412 18.1916 22.1412 21.9828C22.1412 22.792 22.2836 23.5862 22.5608 24.3504ZM29.0118 13.0143C29.2666 13.0143 29.4764 12.8045 29.4764 12.5498V11.2835C29.4764 11.0288 29.2666 10.819 29.0118 10.819C28.7571 10.819 28.5473 11.0288 28.5473 11.2835V12.5498C28.5548 12.812 28.7571 13.0143 29.0118 13.0143ZM21.7891 14.6551C22.0438 14.6551 22.2536 14.4453 22.2536 14.1906V11.276C22.2536 11.0213 22.0513 10.8115 21.7891 10.8115C21.5343 10.8115 21.3245 11.0213 21.3245 11.276V14.1906C21.3245 14.4528 21.5343 14.6551 21.7891 14.6551ZM22.1187 17.1726C22.2086 17.0902 22.2536 16.9703 22.2536 16.8429C22.2536 16.723 22.2086 16.6032 22.1187 16.5208C22.0288 16.4308 21.9164 16.3859 21.7891 16.3859C21.6692 16.3859 21.5493 16.4383 21.4669 16.5208C21.377 16.6107 21.332 16.7231 21.332 16.8504C21.332 16.9703 21.3845 17.0902 21.4669 17.1801C21.6392 17.3449 21.9464 17.3449 22.1187 17.1726ZM35.4254 15.5093C35.6801 15.5093 35.8899 15.2995 35.8899 15.0448V11.2835C35.8899 11.0288 35.6801 10.819 35.4254 10.819C35.1706 10.819 34.9608 11.0288 34.9608 11.2835V15.0448C34.9683 15.2995 35.1706 15.5093 35.4254 15.5093ZM25.9324 39.8149C25.3106 39.8149 24.8086 39.3129 24.8086 38.691C24.8086 38.0691 25.3106 37.5671 25.9324 37.5671C26.5543 37.5671 27.0563 38.0691 27.0563 38.691C27.0563 39.3054 26.5543 39.8149 25.9324 39.8149ZM34.6911 46.3932H31.1996V38.691C31.1996 38.4363 30.9898 38.2265 30.7351 38.2265H27.9404L27.8655 38.0017C27.5732 37.185 26.8016 36.6381 25.9324 36.6381C24.8011 36.6381 23.8794 37.5596 23.8794 38.691C23.8794 39.8224 24.8011 40.7439 25.9324 40.7439C26.7941 40.7439 27.5732 40.197 27.8655 39.3728L27.9404 39.148H30.2706V46.8578C30.2706 47.1125 30.4728 47.3223 30.7351 47.3223H34.6911C34.9459 47.3223 35.1557 47.1125 35.1557 46.8578C35.1557 46.5955 34.9459 46.3932 34.6911 46.3932ZM38.2276 46.3932C38.1077 46.3932 37.9878 46.4457 37.8979 46.5281C37.8155 46.6105 37.763 46.7304 37.763 46.8578C37.763 46.9777 37.8155 47.0975 37.8979 47.1799C38.0702 47.3523 38.3774 47.3523 38.5497 47.1799C38.6396 47.09 38.6846 46.9777 38.6846 46.8503C38.6846 46.7304 38.6321 46.6106 38.5497 46.5206C38.4673 46.4457 38.3474 46.3932 38.2276 46.3932ZM36.8564 39.4777C36.8564 39.5976 36.9089 39.7175 36.9913 39.8074C37.1636 39.9797 37.4708 39.9797 37.6432 39.8074C37.7256 39.725 37.778 39.5976 37.778 39.4777C37.778 39.3578 37.7256 39.2379 37.6432 39.148C37.5607 39.0656 37.4408 39.0132 37.3209 39.0132C37.2011 39.0132 37.0812 39.0656 36.9913 39.148C36.9014 39.2379 36.8564 39.3578 36.8564 39.4777ZM46.1696 36.4433V42.5046H37.2236C35.5528 42.5046 34.1891 41.141 34.1891 39.4702C34.1891 37.7994 35.5528 36.4358 37.2236 36.4358H46.1696V36.4433ZM29.8734 33.2665C29.8734 32.6446 30.3754 32.1426 30.9973 32.1426C31.6192 32.1426 32.1287 32.6446 32.1287 33.2665C32.1287 33.8883 31.6267 34.3903 30.9973 34.3903C30.3829 34.3903 29.8734 33.8808 29.8734 33.2665ZM16.2896 39.5377C16.2896 38.9158 16.7916 38.4138 17.4135 38.4138C18.0354 38.4138 18.5374 38.9158 18.5374 39.5377C18.5374 40.1595 18.0354 40.6615 17.4135 40.6615C16.7916 40.6615 16.2896 40.1595 16.2896 39.5377ZM23.4824 45.8838C23.4824 45.2619 23.9844 44.7599 24.6062 44.7599C25.2281 44.7599 25.7301 45.2619 25.7301 45.8838C25.7301 46.5056 25.2281 47.0076 24.6062 47.0076C23.9844 47.0151 23.4824 46.5056 23.4824 45.8838ZM46.1171 47.7119C45.8624 48.9707 44.746 49.8848 43.4573 49.8848H14.8735C13.2027 49.8848 11.8391 48.5286 11.8391 46.8578V43.2539H13.4649L16.4245 46.2134C16.5144 46.2958 16.6268 46.3483 16.7541 46.3483H22.5983L22.6732 46.5731C22.9654 47.3897 23.7371 47.9442 24.6062 47.9442C25.7376 47.9442 26.6592 47.0226 26.6592 45.8913C26.6592 44.7599 25.7376 43.8383 24.6062 43.8383C23.7446 43.8383 22.9654 44.3853 22.6732 45.2095L22.5983 45.4342H16.9415L13.9819 42.4747C13.892 42.3848 13.7796 42.3398 13.6523 42.3398H11.8391V39.9497H15.3905L15.4654 40.182C15.7426 41.0286 16.5219 41.5981 17.4135 41.5981C18.5449 41.5981 19.4664 40.6765 19.4664 39.5452C19.4664 38.4138 18.5449 37.4922 17.4135 37.4922C16.5743 37.4922 15.8026 38.0167 15.5029 38.8109L15.4205 39.0207H11.8391V36.8254H13.6523C13.7721 36.8254 13.892 36.7729 13.9819 36.6905L16.9415 33.731H28.9893L29.0643 33.9558C29.3565 34.7724 30.1282 35.3269 30.9973 35.3269C32.1287 35.3269 33.0503 34.4053 33.0503 33.2739C33.0503 32.1426 32.1287 31.221 30.9973 31.221C30.1357 31.221 29.3565 31.7679 29.0643 32.5846L28.9893 32.8094H16.7541C16.6343 32.8094 16.5144 32.8618 16.4245 32.9442L13.4649 35.9038H11.8391V27.8943L12.3785 28.3364C13.0903 28.9133 13.952 29.2205 14.8735 29.2205H43.1351C44.8059 29.2205 46.1696 30.5766 46.1696 32.2474V35.5217H37.2236C35.0433 35.5217 33.2675 37.2974 33.2675 39.4777C33.2675 41.658 35.0433 43.4337 37.2236 43.4337H46.1696V46.3932H41.5168C41.262 46.3932 41.0522 46.603 41.0522 46.8578C41.0522 47.1125 41.262 47.3223 41.5168 47.3223H46.1921L46.1171 47.7119ZM43.4573 21.301H38.4374C38.1826 21.301 37.9728 21.5107 37.9728 21.7655C37.9728 22.0202 38.1751 22.23 38.4374 22.23H43.4573C44.9558 22.23 46.1696 23.4438 46.1696 24.9423V29.6176L45.6301 29.1756C44.9258 28.6061 44.0417 28.2914 43.1426 28.2914H14.8735C13.2027 28.2914 11.8391 26.9353 11.8391 25.257C11.8391 23.5862 13.1952 22.2225 14.8735 22.2225H19.5938C19.8485 22.2225 20.0583 22.0127 20.0583 21.758C20.0583 21.5032 19.8485 21.2935 19.5938 21.2935H14.8735C12.6932 21.2935 10.9175 23.0692 10.9175 25.2495V46.8428C10.9175 49.0231 12.6932 50.7988 14.8735 50.7988H43.4573C45.4653 50.7988 47.0912 49.1655 47.0912 47.165V24.9348C47.0912 22.9343 45.4578 21.301 43.4573 21.301Z" fill="white"/>
<path opacity="0.1" d="M25.1634 7.46504C29.6496 7.46504 33.2959 11.1134 33.2959 15.6022C33.2959 16.8422 33.0091 18.0822 32.4662 19.1993L32.3433 19.4555H27.6728L27.9493 18.8201C28.0927 18.4819 28.1747 18.1335 28.1747 17.7748C28.1747 16.2376 26.8227 14.9872 25.1634 14.9872C24.2006 14.9872 23.4222 14.3006 23.4222 13.4603C23.4222 12.6199 24.2006 11.9333 25.1634 11.9333C26.1262 11.9333 26.9046 12.6199 26.9046 13.4603C26.9046 13.8087 27.1914 14.0956 27.5396 14.0956C27.8879 14.0956 28.1747 13.8087 28.1747 13.4603C28.1747 12.2612 27.345 11.1954 26.1159 10.8162L25.8087 10.724L25.7984 10.396C25.7882 10.0578 25.5116 9.7811 25.1634 9.7811C24.8254 9.7811 24.5386 10.0578 24.5386 10.396L24.5284 10.724L24.2211 10.8162C22.992 11.1954 22.1624 12.2612 22.1624 13.4603C22.1624 14.9975 23.5144 16.2478 25.1736 16.2478C26.1364 16.2478 26.9149 16.9345 26.9149 17.7748C26.9149 18.6152 26.1364 19.3018 25.1736 19.3018C24.2109 19.3018 23.4324 18.6152 23.4324 17.7748C23.4324 17.4264 23.1456 17.1394 22.7974 17.1394C22.4492 17.1394 22.1624 17.4264 22.1624 17.7748C22.1624 18.1335 22.234 18.4921 22.3877 18.8201L22.6642 19.4555H17.9937L17.8708 19.1993C17.328 18.0925 17.0412 16.8422 17.0412 15.6022C17.0309 11.1237 20.6772 7.46504 25.1634 7.46504ZM16.3447 18.8406L16.57 19.4555H9.8715C9.52326 19.4555 9.23648 19.7322 9.23648 20.0909C9.23648 20.4393 9.51302 20.7263 9.8715 20.7263H40.4655C40.8138 20.7263 41.1006 20.4393 41.1006 20.0909C41.1006 19.7424 40.8138 19.4555 40.4655 19.4555H33.7772L34.0026 18.8406C34.3816 17.7953 34.5762 16.709 34.5762 15.6022C34.5762 10.4165 30.3563 6.1942 25.1736 6.1942C19.991 6.1942 15.7711 10.4165 15.7711 15.6022C15.7711 16.709 15.9657 17.7953 16.3447 18.8406ZM25.1634 3.33496C25.5116 3.33496 25.7984 3.04801 25.7984 2.69957V0.967607C25.7984 0.619166 25.5116 0.332219 25.1634 0.332219C24.8152 0.332219 24.5284 0.619166 24.5284 0.967607V2.69957C24.5386 3.05826 24.8152 3.33496 25.1634 3.33496ZM15.2897 5.57933C15.6379 5.57933 15.9247 5.29239 15.9247 4.94394V0.957349C15.9247 0.608907 15.6482 0.32196 15.2897 0.32196C14.9415 0.32196 14.6547 0.608907 14.6547 0.957349V4.94394C14.6547 5.30263 14.9415 5.57933 15.2897 5.57933ZM15.7404 9.02274C15.8633 8.91001 15.9247 8.74603 15.9247 8.57181C15.9247 8.40784 15.8633 8.24387 15.7404 8.13114C15.6175 8.00816 15.4638 7.94668 15.2897 7.94668C15.1258 7.94668 14.962 8.01841 14.8493 8.13114C14.7264 8.25412 14.6649 8.40785 14.6649 8.58207C14.6649 8.74604 14.7366 8.91002 14.8493 9.033C15.0849 9.25846 15.5048 9.25845 15.7404 9.02274ZM33.9309 6.74765C34.2791 6.74765 34.5659 6.4607 34.5659 6.11226V0.967607C34.5659 0.619166 34.2791 0.332219 33.9309 0.332219C33.5826 0.332219 33.2959 0.619166 33.2959 0.967607V6.11226C33.3061 6.4607 33.5826 6.74765 33.9309 6.74765ZM20.9538 39.9931C20.1037 39.9931 19.4174 39.3064 19.4174 38.4558C19.4174 37.6052 20.1037 36.9186 20.9538 36.9186C21.8039 36.9186 22.4901 37.6052 22.4901 38.4558C22.4901 39.2962 21.8039 39.9931 20.9538 39.9931ZM32.9272 48.991H28.1542V38.4558C28.1542 38.1074 27.8674 37.8204 27.5191 37.8204H23.6987L23.5963 37.5129C23.1968 36.3959 22.1419 35.6478 20.9538 35.6478C19.4072 35.6478 18.1473 36.9083 18.1473 38.4558C18.1473 40.0033 19.4072 41.2638 20.9538 41.2638C22.1317 41.2638 23.1968 40.5157 23.5963 39.3884L23.6987 39.081H26.8841V49.6264C26.8841 49.9749 27.1606 50.2618 27.5191 50.2618H32.9272C33.2754 50.2618 33.5622 49.9749 33.5622 49.6264C33.5622 49.2677 33.2754 48.991 32.9272 48.991ZM37.7615 48.991C37.5977 48.991 37.4338 49.0628 37.3109 49.1755C37.1982 49.2882 37.1265 49.4522 37.1265 49.6264C37.1265 49.7904 37.1982 49.9543 37.3109 50.0671C37.5464 50.3028 37.9664 50.3028 38.2019 50.0671C38.3249 49.9441 38.3863 49.7904 38.3863 49.6162C38.3863 49.4522 38.3146 49.2883 38.2019 49.1653C38.0893 49.0628 37.9254 48.991 37.7615 48.991ZM35.8872 39.5319C35.8872 39.6959 35.9588 39.8598 36.0715 39.9828C36.3071 40.2185 36.7271 40.2185 36.9627 39.9828C37.0753 39.8701 37.147 39.6959 37.147 39.5319C37.147 39.3679 37.0753 39.2039 36.9627 39.081C36.85 38.9682 36.6861 38.8965 36.5222 38.8965C36.3583 38.8965 36.1944 38.9682 36.0715 39.081C35.9486 39.2039 35.8872 39.3679 35.8872 39.5319ZM48.6184 35.3813V43.6722H36.3891C34.105 43.6722 32.2409 41.807 32.2409 39.5216C32.2409 37.2363 34.105 35.3711 36.3891 35.3711H48.6184V35.3813ZM26.3412 31.0361C26.3412 30.1855 27.0275 29.4988 27.8776 29.4988C28.7277 29.4988 29.4242 30.1855 29.4242 31.0361C29.4242 31.8867 28.738 32.5733 27.8776 32.5733C27.0377 32.5733 26.3412 31.8764 26.3412 31.0361ZM7.77182 39.6139C7.77182 38.7633 8.45806 38.0766 9.30818 38.0766C10.1583 38.0766 10.8445 38.7633 10.8445 39.6139C10.8445 40.4645 10.1583 41.1511 9.30818 41.1511C8.45806 41.1511 7.77182 40.4645 7.77182 39.6139ZM17.6045 48.2941C17.6045 47.4435 18.2907 46.7569 19.1409 46.7569C19.991 46.7569 20.6772 47.4435 20.6772 48.2941C20.6772 49.1448 19.991 49.8314 19.1409 49.8314C18.2907 49.8416 17.6045 49.1448 17.6045 48.2941ZM48.5468 50.7947C48.1986 52.5164 46.6724 53.7668 44.9107 53.7668H5.83599C3.55194 53.7668 1.68784 51.9118 1.68784 49.6264V44.697H3.91042L7.95618 48.7451C8.07909 48.8578 8.23273 48.9295 8.40685 48.9295H16.3959L16.4983 49.237C16.8978 50.354 17.9527 51.1124 19.1409 51.1124C20.6875 51.1124 21.9473 49.8519 21.9473 48.3044C21.9473 46.7569 20.6875 45.4964 19.1409 45.4964C17.963 45.4964 16.8978 46.2445 16.4983 47.3718L16.3959 47.6793H8.66291L4.61715 43.6312C4.49424 43.5082 4.3406 43.4467 4.16648 43.4467H1.68784V40.1775H6.54272L6.64512 40.4952C7.02409 41.6533 8.08934 42.4322 9.30818 42.4322C10.8548 42.4322 12.1146 41.1716 12.1146 39.6241C12.1146 38.0767 10.8548 36.8161 9.30818 36.8161C8.16103 36.8161 7.10602 37.5335 6.69632 38.6198L6.58367 38.9068H1.68784V35.904H4.16648C4.33036 35.904 4.49424 35.8322 4.61715 35.7195L8.66291 31.6715H25.1326L25.2351 31.9789C25.6346 33.096 26.6895 33.8544 27.8776 33.8544C29.4242 33.8544 30.6841 32.5938 30.6841 31.0463C30.6841 29.4988 29.4242 28.2383 27.8776 28.2383C26.6997 28.2383 25.6346 28.9864 25.2351 30.1035L25.1326 30.4109H8.40685C8.24297 30.4109 8.07909 30.4826 7.95618 30.5954L3.91042 34.6434H1.68784V23.688L2.42526 24.2927C3.39829 25.0818 4.57618 25.502 5.83599 25.502H44.4703C46.7543 25.502 48.6184 27.3569 48.6184 29.6423V34.1208H36.3891C33.4085 34.1208 30.9811 36.5496 30.9811 39.5319C30.9811 42.5141 33.4085 44.9429 36.3891 44.9429H48.6184V48.991H42.258C41.9097 48.991 41.6229 49.278 41.6229 49.6264C41.6229 49.9749 41.9097 50.2618 42.258 50.2618H48.6492L48.5468 50.7947ZM44.9107 14.6695H38.0483C37.7001 14.6695 37.4133 14.9565 37.4133 15.3049C37.4133 15.6534 37.6899 15.9403 38.0483 15.9403H44.9107C46.9592 15.9403 48.6184 17.6005 48.6184 19.6502V26.0452L47.881 25.4405C46.9182 24.6616 45.7096 24.2312 44.4805 24.2312H5.83599C3.55194 24.2312 1.68784 22.3763 1.68784 20.0807C1.68784 17.7953 3.5417 15.9301 5.83599 15.9301H12.2887C12.6369 15.9301 12.9237 15.6431 12.9237 15.2947C12.9237 14.9462 12.6369 14.6593 12.2887 14.6593H5.83599C2.85546 14.6593 0.427979 17.0882 0.427979 20.0704V49.606C0.427979 52.5882 2.85546 55.017 5.83599 55.017H44.9107C47.6557 55.017 49.8783 52.7829 49.8783 50.0466V19.64C49.8783 16.9037 47.6454 14.6695 44.9107 14.6695Z" fill="white"/>
</svg>
