<svg width="1440" height="300" viewBox="0 0 1440 300" fill="none" xmlns="http://www.w3.org/2000/svg">
<mask id="mask0" mask-type="alpha" maskUnits="userSpaceOnUse" x="0" y="0" width="1440" height="300">
<path d="M0 0H1440V300H0V0Z" fill="#4174AA"/>
</mask>
<g mask="url(#mask0)">
<g opacity="0.3">
<path opacity="0.15" d="M720 1455.59C1164.59 1455.59 1525 1094.38 1525 648.797C1525 203.215 1164.59 -158 720 -158C275.411 -158 -85 203.215 -85 648.797C-85 1094.38 275.411 1455.59 720 1455.59Z" stroke="white" stroke-width="0.621" stroke-miterlimit="10"/>
<path opacity="0.3" d="M720.204 1322.23C1091.36 1322.23 1392.24 1020.68 1392.24 648.701C1392.24 276.722 1091.36 -24.8271 720.204 -24.8271C349.052 -24.8271 48.1729 276.722 48.1729 648.701C48.1729 1020.68 349.052 1322.23 720.204 1322.23Z" stroke="white" stroke-width="0.621" stroke-miterlimit="10"/>
<path opacity="0.6" d="M1300.64 652.378C1302.29 331.497 1043.51 70.031 722.626 68.3771C401.745 66.7231 140.279 325.508 138.625 646.389C136.971 967.27 395.755 1228.74 716.636 1230.39C1037.52 1232.04 1298.98 973.259 1300.64 652.378Z" stroke="white" stroke-width="0.621" stroke-miterlimit="10"/>
<path opacity="0.8" d="M722.843 1160.92C1004.85 1159.53 1232.34 929.777 1230.95 647.754C1229.57 365.73 999.824 138.231 717.812 139.62C435.801 141.01 208.311 370.761 209.701 652.784C211.09 934.808 440.831 1162.31 722.843 1160.92Z" stroke="white" stroke-width="0.621" stroke-miterlimit="10"/>
<path d="M1040.85 969.279C1217.74 792.387 1217.74 505.589 1040.85 328.697C863.956 151.805 577.158 151.805 400.266 328.697C223.374 505.589 223.374 792.387 400.266 969.279C577.158 1146.17 863.956 1146.17 1040.85 969.279Z" stroke="white" stroke-width="0.621" stroke-miterlimit="10"/>
<path d="M999.28 928.921C1153.88 774.318 1153.88 523.657 999.28 369.055C844.677 214.452 594.017 214.452 439.414 369.055C284.812 523.657 284.812 774.318 439.414 928.921C594.017 1083.52 844.677 1083.52 999.28 928.921Z" stroke="white" stroke-width="0.621" stroke-miterlimit="10"/>
<path d="M968.428 896.772C1105.28 759.925 1105.28 538.051 968.428 401.203C831.58 264.356 609.707 264.356 472.859 401.203C336.011 538.051 336.011 759.925 472.859 896.772C609.707 1033.62 831.58 1033.62 968.428 896.772Z" stroke="white" stroke-width="0.621" stroke-miterlimit="10"/>
</g>
</g>
</svg>
