{
  "app": "npx ts-node --prefer-ts-exts bin/cdk.ts",
  "context": {
    "@aws-cdk/aws-apigateway:usagePlanKeyOrderInsensitiveId": true,
    "@aws-cdk/core:enableStackNameDuplicates": "true",
    "aws-cdk:enableDiffNoFail": "true",
    "@aws-cdk/core:stackRelativeExports": "true",
    "@aws-cdk/aws-ecr-assets:dockerIgnoreSupport": true,
    "@aws-cdk/aws-secretsmanager:parseOwnedSecretName": true,
    "@aws-cdk/aws-kms:defaultKeyPolicies": true,
    "@aws-cdk/aws-s3:grantWriteWithoutAcl": true,
    "@aws-cdk/aws-ecs-patterns:removeDefaultDesiredCount": true,
    "@aws-cdk/aws-rds:lowercaseDbIdentifier": true,
    "@aws-cdk/aws-efs:defaultEncryptionAtRest": true,
    "@aws-cdk/aws-lambda:recognizeVersionProps": true,

    "default": {
      "region": "us-east-1",
      "account": "777963828030",
      "apiTarget": "https://im-api1.webpurify.com/services/rest/",
      "cfPublicKeyId": "K3PKQBSOBKGAIV",
      "cfKeyGroupId": "2b244c4f-59ba-4509-ab03-ee769616f386",
      "cfSecretsName": "cf-dist-secrets"
    }
  }
}
