^D:\جديد\خوارزميات 2\خوارزميات 2\DEBUG\خوارزميات 2.EXE.INTERMEDIATE.MANIFEST
C:\WINDOWS\MICROSOFT.NET\FRAMEWORK\V2.0.50727\MSCORWKS.DLL
C:\WINDOWS\MICROSOFT.NET\FRAMEWORK\V4.0.30319\CLR.DLL
C:\PROGRAM FILES (X86)\MICROSOFT SDKS\WINDOWS\V7.0A\BIN\MT.EXE.CONFIG
D:\جديد\خوارزميات 2\DEBUG\خوارزميات 2.EXE
^D:\جامعة\!SECOND YEAR\فصل ثاني\اساسية\خوارزميات 2\عملي\PROJECT\المسألة الثانية الطريقة الثانية رسول\خوارزميات 2\DEBUG\خوارزميات 2.EXE.INTERMEDIATE.MANIFEST
C:\WINDOWS\MICROSOFT.NET\FRAMEWORK\V2.0.50727\MSCORWKS.DLL
C:\WINDOWS\MICROSOFT.NET\FRAMEWORK\V4.0.30319\CLR.DLL
C:\PROGRAM FILES (X86)\MICROSOFT SDKS\WINDOWS\V7.0A\BIN\MT.EXE.CONFIG
D:\جامعة\!SECOND YEAR\فصل ثاني\اساسية\خوارزميات 2\عملي\PROJECT\المسألة الثانية الطريقة الثانية رسول\DEBUG\خوارزميات 2.EXE
