{
    "useBalanser": false,
    "useExternalMic": true,
    "forwardParams": {
        "local_port": 2000,
        "cam_port": 2000
    },
    "dynStitchIsEnabled": true,
    "balanserParams": {
        "host": "192.168.7.19",
        "chunk_size": 188,
        "port": "2050",
        "fec_interval": 5,
        "interfaces": [
            "192.168.7.83"
        ],
        "max_payload_size": 1409
    },
    "profileXmlParams": {
        "pathToProfileXml": "C:/Users/human/Downloads/prorfile100.xml",
        "on": false
    },
    "needForwardPort": false,
    "rtmpUrl": "rtmp://vsms.splinex-team.com/hls/ISLAND-3985",
    "vsms_service": "http://127.0.0.1:8084",
    "useAdaptiveBitrate": false,
    "soundParams": {
        "isMonoSound": true,
        "sound_delay": 0,
        "mic_name": "Line"
    },
    "isSoundEnabled": true,
    "waitAccelerometerData": false,
    "cameraUrl": "tcp://[fe80::2d0:caff:fef1:f3b4]:2000",
    "gopSize": 50,
    "sharpenerParams": {
        "weightBeta": -2,
        "weightAlpha": 3,
        "kernelSize": 5,
        "on": false
    },
    "streams": [
        {
            "width": 2560,
            "cur_bitrate": 1700000,
            "max_bitrate": 1700000,
            "id": "hq",
            "min_bitrate": 1700000,
            "height": 1440
        }
    ]
}