{
    "data": [
        {
            "_id": {
                "$oid": "65f0343e8d0f238cd6bebe26"
            },
            "topic": "Naming Conventions",
            "createDate": "2024-01-10T12:30:00Z",
            "modifiedDate": "2024-01-10T12:30:00Z",
            "modifiedBy": "JohnDoe",
            "isActive": false
        },
        {
            "_id": {
                "$oid": "65f0343e8d0f238cd6bebe27"
            },
            "topic": "Indentation and Formatting",
            "createDate": "2024-02-20T08:45:00Z",
            "modifiedDate": "2024-02-20T08:45:00Z",
            "modifiedBy": "AliceSmith",
            "isActive": false
        },
        {
            "_id": {
                "$oid": "65f0343e8d0f238cd6bebe28"
            },
            "topic": "Code Documentation",
            "createDate": "2024-03-05T15:20:00Z",
            "modifiedDate": "2024-03-05T15:20:00Z",
            "modifiedBy": "BobJohnson",
            "isActive": true
        },
        {
            "_id": {
                "$oid": "65f0343e8d0f238cd6bebe29"
            },
            "topic": "Error Handling and Comments",
            "createDate": "2024-02-05T10:00:00Z",
            "modifiedDate": "2024-02-05T10:00:00Z",
            "modifiedBy": "EmilyBrown",
            "isActive": true
        },
        {
            "_id": {
                "$oid": "65f0343e8d0f238cd6bebe2a"
            },
            "topic": "Code Readability and Maintainability",
            "createDate": "2024-01-25T14:15:00Z",
            "modifiedDate": "2024-01-25T14:15:00Z",
            "modifiedBy": "MichaelWilson",
            "isActive": true
        }
    ]
}