<svg width="18" height="16" viewBox="0 0 18 16" fill="none" xmlns="http://www.w3.org/2000/svg">
<path d="M14.8334 3.41664H13.7667L13.5 2.58331C13.3271 2.09434 13.0065 1.67123 12.5824 1.37261C12.1584 1.07399 11.652 0.914645 11.1334 0.916645H6.86669C6.34298 0.917624 5.8328 1.08305 5.40816 1.38957C4.98352 1.69608 4.66586 2.12822 4.50002 2.62498L4.23335 3.45831H3.16669C2.50365 3.45831 1.86776 3.7217 1.39892 4.19054C0.930079 4.65939 0.666687 5.29527 0.666687 5.95831V12.625C0.666687 13.288 0.930079 13.9239 1.39892 14.3927C1.86776 14.8616 2.50365 15.125 3.16669 15.125H14.8334C15.4964 15.125 16.1323 14.8616 16.6011 14.3927C17.07 13.9239 17.3334 13.288 17.3334 12.625V5.95831C17.3389 5.62652 17.2783 5.29694 17.1551 4.9888C17.032 4.68066 16.8487 4.40013 16.616 4.16355C16.3833 3.92697 16.1058 3.73909 15.7998 3.61085C15.4937 3.48262 15.1652 3.4166 14.8334 3.41664ZM15.6667 12.5833C15.6667 12.8043 15.5789 13.0163 15.4226 13.1726C15.2663 13.3288 15.0544 13.4166 14.8334 13.4166H3.16669C2.94567 13.4166 2.73371 13.3288 2.57743 13.1726C2.42115 13.0163 2.33335 12.8043 2.33335 12.5833V5.91665C2.33335 5.69563 2.42115 5.48367 2.57743 5.32739C2.73371 5.17111 2.94567 5.08331 3.16669 5.08331H4.83335C5.01508 5.0928 5.19491 5.04254 5.34538 4.94022C5.49586 4.83789 5.6087 4.68913 5.66669 4.51664L6.11669 3.14998C6.17259 2.98446 6.2791 2.8407 6.42116 2.73901C6.56322 2.63733 6.73365 2.58286 6.90835 2.58331H11.175C11.3497 2.58286 11.5201 2.63733 11.6622 2.73901C11.8043 2.8407 11.9108 2.98446 11.9667 3.14998L12.4167 4.51664C12.4702 4.6756 12.5704 4.81472 12.7042 4.91582C12.838 5.01692 12.9992 5.07529 13.1667 5.08331H14.8334C15.0544 5.08331 15.2663 5.17111 15.4226 5.32739C15.5789 5.48367 15.6667 5.69563 15.6667 5.91665V12.5833ZM9.00002 5.08331C8.34075 5.08331 7.69628 5.27881 7.14812 5.64508C6.59996 6.01135 6.17271 6.53195 5.92042 7.14103C5.66813 7.75012 5.60212 8.42034 5.73074 9.06695C5.85935 9.71355 6.17682 10.3075 6.643 10.7737C7.10917 11.2398 7.70312 11.5573 8.34972 11.6859C8.99632 11.8145 9.66654 11.7485 10.2756 11.4962C10.8847 11.244 11.4053 10.8167 11.7716 10.2685C12.1379 9.72038 12.3334 9.07592 12.3334 8.41664C12.3334 7.53259 11.9822 6.68474 11.357 6.05962C10.7319 5.4345 9.88408 5.08331 9.00002 5.08331ZM9.00002 10.0833C8.67038 10.0833 8.34815 9.98556 8.07407 9.80243C7.79999 9.61929 7.58637 9.35899 7.46022 9.05445C7.33407 8.74991 7.30107 8.4148 7.36538 8.09149C7.42969 7.76819 7.58842 7.47122 7.82151 7.23813C8.0546 7.00505 8.35157 6.84631 8.67487 6.782C8.99817 6.71769 9.33328 6.7507 9.63783 6.87685C9.94237 7.00299 10.2027 7.21661 10.3858 7.49069C10.5689 7.76478 10.6667 8.08701 10.6667 8.41664C10.6667 8.85867 10.4911 9.28259 10.1785 9.59516C9.86597 9.90772 9.44205 10.0833 9.00002 10.0833Z" fill="white"/>
</svg>
