<svg width="292" height="131" viewBox="0 0 292 131" fill="none" xmlns="http://www.w3.org/2000/svg">
<path d="M0 20C0 8.9543 8.9543 0 20 0H292V111C292 122.046 283.046 131 272 131H0V20Z" fill="#519ED5"/>
<path d="M258.696 123.974H30.3042C30.2237 123.974 30.1465 123.942 30.0897 123.885C30.0329 123.829 30.001 123.752 30.001 123.673C30.001 123.593 30.0329 123.516 30.0897 123.46C30.1465 123.403 30.2237 123.371 30.3042 123.371H258.696C258.776 123.371 258.854 123.403 258.91 123.46C258.967 123.516 258.999 123.593 258.999 123.673C258.999 123.752 258.967 123.829 258.91 123.885C258.854 123.942 258.776 123.974 258.696 123.974Z" fill="#3F3D56"/>
<path d="M101.599 21.5396C102.511 21.5396 103.25 20.8068 103.25 19.9029C103.25 18.9989 102.511 18.2661 101.599 18.2661C100.687 18.2661 99.9473 18.9989 99.9473 19.9029C99.9473 20.8068 100.687 21.5396 101.599 21.5396Z" fill="#F2F2F2"/>
<path d="M95.0172 21.5396C95.9292 21.5396 96.6682 20.8068 96.6682 19.9029C96.6682 18.9989 95.9292 18.2661 95.0172 18.2661C94.1052 18.2661 93.3652 18.9989 93.3652 19.9029C93.3652 20.8068 94.1052 21.5396 95.0172 21.5396Z" fill="#F2F2F2"/>
<path d="M88.4342 21.5396C89.3472 21.5396 90.0862 20.8068 90.0862 19.9029C90.0862 18.9989 89.3472 18.2661 88.4342 18.2661C87.5222 18.2661 86.7832 18.9989 86.7832 19.9029C86.7832 20.8068 87.5222 21.5396 88.4342 21.5396Z" fill="#F2F2F2"/>
<path d="M81.8522 21.5396C82.7642 21.5396 83.5042 20.8068 83.5042 19.9029C83.5042 18.9989 82.7642 18.2661 81.8522 18.2661C80.9402 18.2661 80.2012 18.9989 80.2012 19.9029C80.2012 20.8068 80.9402 21.5396 81.8522 21.5396Z" fill="#F2F2F2"/>
<path d="M101.599 28.3734C102.511 28.3734 103.25 27.6406 103.25 26.7366C103.25 25.8327 102.511 25.0999 101.599 25.0999C100.687 25.0999 99.9473 25.8327 99.9473 26.7366C99.9473 27.6406 100.687 28.3734 101.599 28.3734Z" fill="#F2F2F2"/>
<path d="M95.0172 28.3734C95.9292 28.3734 96.6682 27.6406 96.6682 26.7366C96.6682 25.8327 95.9292 25.0999 95.0172 25.0999C94.1052 25.0999 93.3652 25.8327 93.3652 26.7366C93.3652 27.6406 94.1052 28.3734 95.0172 28.3734Z" fill="#F2F2F2"/>
<path d="M88.4342 28.3734C89.3472 28.3734 90.0862 27.6406 90.0862 26.7366C90.0862 25.8327 89.3472 25.0999 88.4342 25.0999C87.5222 25.0999 86.7832 25.8327 86.7832 26.7366C86.7832 27.6406 87.5222 28.3734 88.4342 28.3734Z" fill="#F2F2F2"/>
<path d="M81.8522 28.3734C82.7642 28.3734 83.5042 27.6406 83.5042 26.7366C83.5042 25.8327 82.7642 25.0999 81.8522 25.0999C80.9402 25.0999 80.2012 25.8327 80.2012 26.7366C80.2012 27.6406 80.9402 28.3734 81.8522 28.3734Z" fill="#F2F2F2"/>
<path d="M101.599 35.2071C102.511 35.2071 103.25 34.4743 103.25 33.5704C103.25 32.6664 102.511 31.9336 101.599 31.9336C100.687 31.9336 99.9473 32.6664 99.9473 33.5704C99.9473 34.4743 100.687 35.2071 101.599 35.2071Z" fill="#F2F2F2"/>
<path d="M95.0172 35.2071C95.9292 35.2071 96.6682 34.4743 96.6682 33.5704C96.6682 32.6664 95.9292 31.9336 95.0172 31.9336C94.1052 31.9336 93.3652 32.6664 93.3652 33.5704C93.3652 34.4743 94.1052 35.2071 95.0172 35.2071Z" fill="#F2F2F2"/>
<path d="M88.4342 35.2071C89.3472 35.2071 90.0862 34.4743 90.0862 33.5704C90.0862 32.6664 89.3472 31.9336 88.4342 31.9336C87.5222 31.9336 86.7832 32.6664 86.7832 33.5704C86.7832 34.4743 87.5222 35.2071 88.4342 35.2071Z" fill="#F2F2F2"/>
<path d="M81.8522 35.2071C82.7642 35.2071 83.5042 34.4743 83.5042 33.5704C83.5042 32.6664 82.7642 31.9336 81.8522 31.9336C80.9402 31.9336 80.2012 32.6664 80.2012 33.5704C80.2012 34.4743 80.9402 35.2071 81.8522 35.2071Z" fill="#F2F2F2"/>
<path d="M101.599 42.0406C102.511 42.0406 103.25 41.3078 103.25 40.4039C103.25 39.4999 102.511 38.7671 101.599 38.7671C100.687 38.7671 99.9473 39.4999 99.9473 40.4039C99.9473 41.3078 100.687 42.0406 101.599 42.0406Z" fill="#F2F2F2"/>
<path d="M95.0172 42.0406C95.9292 42.0406 96.6682 41.3078 96.6682 40.4039C96.6682 39.4999 95.9292 38.7671 95.0172 38.7671C94.1052 38.7671 93.3652 39.4999 93.3652 40.4039C93.3652 41.3078 94.1052 42.0406 95.0172 42.0406Z" fill="#F2F2F2"/>
<path d="M88.4342 42.0406C89.3472 42.0406 90.0862 41.3078 90.0862 40.4039C90.0862 39.4999 89.3472 38.7671 88.4342 38.7671C87.5222 38.7671 86.7832 39.4999 86.7832 40.4039C86.7832 41.3078 87.5222 42.0406 88.4342 42.0406Z" fill="#F2F2F2"/>
<path d="M81.8522 42.0406C82.7642 42.0406 83.5042 41.3078 83.5042 40.4039C83.5042 39.4999 82.7642 38.7671 81.8522 38.7671C80.9402 38.7671 80.2012 39.4999 80.2012 40.4039C80.2012 41.3078 80.9402 42.0406 81.8522 42.0406Z" fill="#F2F2F2"/>
<path d="M101.599 48.8743C102.511 48.8743 103.25 48.1415 103.25 47.2376C103.25 46.3336 102.511 45.6008 101.599 45.6008C100.687 45.6008 99.9473 46.3336 99.9473 47.2376C99.9473 48.1415 100.687 48.8743 101.599 48.8743Z" fill="#F2F2F2"/>
<path d="M95.0172 48.8743C95.9292 48.8743 96.6682 48.1415 96.6682 47.2376C96.6682 46.3336 95.9292 45.6008 95.0172 45.6008C94.1052 45.6008 93.3652 46.3336 93.3652 47.2376C93.3652 48.1415 94.1052 48.8743 95.0172 48.8743Z" fill="#F2F2F2"/>
<path d="M88.4342 48.8743C89.3472 48.8743 90.0862 48.1415 90.0862 47.2376C90.0862 46.3336 89.3472 45.6008 88.4342 45.6008C87.5222 45.6008 86.7832 46.3336 86.7832 47.2376C86.7832 48.1415 87.5222 48.8743 88.4342 48.8743Z" fill="#F2F2F2"/>
<path d="M81.8522 48.8743C82.7642 48.8743 83.5042 48.1415 83.5042 47.2376C83.5042 46.3336 82.7642 45.6008 81.8522 45.6008C80.9402 45.6008 80.2012 46.3336 80.2012 47.2376C80.2012 48.1415 80.9402 48.8743 81.8522 48.8743Z" fill="#F2F2F2"/>
<path d="M101.599 55.7079C102.511 55.7079 103.25 54.9751 103.25 54.0711C103.25 53.1671 102.511 52.4343 101.599 52.4343C100.687 52.4343 99.9473 53.1671 99.9473 54.0711C99.9473 54.9751 100.687 55.7079 101.599 55.7079Z" fill="#F2F2F2"/>
<path d="M95.0172 55.7079C95.9292 55.7079 96.6682 54.9751 96.6682 54.0711C96.6682 53.1671 95.9292 52.4343 95.0172 52.4343C94.1052 52.4343 93.3652 53.1671 93.3652 54.0711C93.3652 54.9751 94.1052 55.7079 95.0172 55.7079Z" fill="#F2F2F2"/>
<path d="M88.4342 55.7079C89.3472 55.7079 90.0862 54.9751 90.0862 54.0711C90.0862 53.1671 89.3472 52.4343 88.4342 52.4343C87.5222 52.4343 86.7832 53.1671 86.7832 54.0711C86.7832 54.9751 87.5222 55.7079 88.4342 55.7079Z" fill="#F2F2F2"/>
<path d="M81.8522 55.7079C82.7642 55.7079 83.5042 54.9751 83.5042 54.0711C83.5042 53.1671 82.7642 52.4343 81.8522 52.4343C80.9402 52.4343 80.2012 53.1671 80.2012 54.0711C80.2012 54.9751 80.9402 55.7079 81.8522 55.7079Z" fill="#F2F2F2"/>
<path d="M87.0859 98.7226V99.2288C87.0869 100.068 87.4239 100.872 88.0219 101.465C88.6209 102.058 89.4319 102.392 90.2789 102.392H113.264C114.11 102.392 114.922 102.059 115.521 101.466C116.119 100.872 116.456 100.068 116.456 99.2288V98.7226C116.458 97.9822 116.195 97.2651 115.715 96.6978C115.556 96.5094 115.375 96.3396 115.176 96.1916C115.176 96.1916 102.54 95.9081 102.54 95.5588H90.2789C89.4319 95.56 88.6209 95.8937 88.0229 96.4868C87.4239 97.0798 87.0879 97.8838 87.0859 98.7226Z" fill="#CCCCCC"/>
<path d="M103.616 102.267H100.296V123.527H103.616V102.267Z" fill="#CCCCCC"/>
<path d="M113.065 123.412C113.065 123.767 108.034 123.549 101.828 123.549C95.6218 123.549 90.5908 123.767 90.5908 123.412C90.5908 123.056 95.6218 120.237 101.828 120.237C108.034 120.237 113.065 123.056 113.065 123.412Z" fill="#CCCCCC"/>
<path d="M108.501 98.2933C108.74 97.9746 108.907 97.6077 108.988 97.2184C109.069 96.8291 109.063 96.4269 108.97 96.0402C108.877 95.6535 108.7 95.2916 108.451 94.9801C108.202 94.6685 107.887 94.4149 107.528 94.237L100.492 70.4749L95.1338 73.0756L103.735 95.6152C103.474 96.2322 103.45 96.9229 103.668 97.5563C103.885 98.1897 104.33 98.7219 104.918 99.052C105.505 99.3821 106.194 99.4872 106.855 99.3474C107.515 99.2076 108.101 98.8325 108.501 98.2933Z" fill="#A0616A"/>
<path d="M102.086 74.4431L96.0891 76.052C95.9181 76.0978 95.7401 76.1066 95.5651 76.0778C95.3911 76.049 95.2251 75.9833 95.0781 75.8851C94.9321 75.787 94.8081 75.6588 94.7171 75.5091C94.6251 75.3595 94.5661 75.1919 94.5461 75.018L93.8211 68.9215C93.5891 68.055 93.7141 67.1329 94.1681 66.3574C94.6211 65.582 95.3671 65.0164 96.2411 64.7847C97.1141 64.5531 98.0451 64.6742 98.8291 65.1215C99.6121 65.5689 100.185 66.306 100.421 67.1712L102.892 72.7788C102.963 72.9394 102.998 73.1132 102.994 73.2883C102.991 73.4635 102.95 73.6359 102.874 73.7939C102.797 73.9518 102.687 74.0916 102.551 74.2036C102.415 74.3156 102.257 74.3973 102.086 74.4431Z" fill="#519ED5"/>
<path d="M110.068 120.92L113.199 120.919L114.689 112.872H110.068V120.92Z" fill="#A0616A"/>
<path d="M109.269 119.906H115.435H115.436C115.952 119.906 116.463 120.007 116.939 120.203C117.416 120.398 117.849 120.685 118.214 121.047C118.579 121.408 118.869 121.838 119.066 122.31C119.264 122.783 119.365 123.289 119.365 123.8V123.927H109.27L109.269 119.906Z" fill="#2F2E41"/>
<path d="M113.702 116.604C113.666 116.604 113.629 116.602 113.593 116.599L109.26 116.286C109.084 116.27 108.915 116.214 108.765 116.123C108.615 116.032 108.488 115.908 108.394 115.761C108.3 115.613 108.242 115.446 108.223 115.273C108.204 115.099 108.226 114.924 108.287 114.76L114.086 101.849C114.127 101.733 114.144 101.611 114.135 101.489C114.127 101.367 114.093 101.248 114.036 101.14C113.978 101.031 113.899 100.934 113.801 100.858C113.704 100.781 113.591 100.725 113.471 100.695C110.744 99.9885 103.748 98.1076 97.6913 95.9068C95.0973 94.9639 93.4623 93.6012 92.8343 91.8567C92.0063 89.5569 93.2313 87.4594 93.2843 87.3714L93.3253 87.3025L99.0243 87.8158L105.202 88.3366L118.741 95.5316C119.875 96.1396 120.737 97.1488 121.154 98.3582C121.572 99.5676 121.514 100.888 120.993 102.057L114.751 115.929C114.661 116.13 114.514 116.301 114.328 116.42C114.142 116.54 113.924 116.604 113.702 116.604Z" fill="#2F2E41"/>
<path d="M100.015 62.2706C103.479 62.2706 106.287 59.4874 106.287 56.0543C106.287 52.6211 103.479 49.8379 100.015 49.8379C96.5502 49.8379 93.7422 52.6211 93.7422 56.0543C93.7422 59.4874 96.5502 62.2706 100.015 62.2706Z" fill="#A0616A"/>
<path d="M108.28 120.667L111.411 120.666L112.901 112.619H108.28V120.667Z" fill="#A0616A"/>
<path d="M107.482 119.653H113.648C114.164 119.653 114.675 119.754 115.152 119.95C115.629 120.145 116.062 120.432 116.427 120.794C116.791 121.155 117.081 121.585 117.278 122.057C117.476 122.53 117.578 123.036 117.578 123.547V123.674H107.482V119.653Z" fill="#2F2E41"/>
<path d="M111.915 117.363C111.878 117.363 111.842 117.362 111.805 117.358L107.472 117.046C107.297 117.029 107.127 116.974 106.977 116.883C106.827 116.791 106.7 116.667 106.606 116.52C106.512 116.372 106.454 116.206 106.435 116.032C106.417 115.859 106.438 115.683 106.499 115.52L112.298 102.608C112.339 102.493 112.356 102.37 112.348 102.248C112.339 102.127 112.305 102.008 112.248 101.899C112.191 101.79 112.111 101.694 112.014 101.617C111.916 101.54 111.804 101.485 111.683 101.454C108.956 100.748 101.96 98.8667 95.9041 96.6659C93.3091 95.723 91.6751 94.3603 91.0461 92.6158C90.2181 90.3159 91.4441 88.2185 91.4961 88.1305L91.5371 88.0615L97.2361 88.5749L103.414 89.0957L116.953 96.2907C118.088 96.8987 118.949 97.9079 119.367 99.1173C119.784 100.327 119.726 101.648 119.205 102.817L112.963 116.688C112.873 116.889 112.726 117.06 112.54 117.18C112.354 117.3 112.137 117.363 111.915 117.363Z" fill="#2F2E41"/>
<path d="M101.949 65.7957L95.3094 63.5178C95.3094 63.5178 91.1414 66.6917 93.1434 74.5652C94.1894 78.6282 93.8844 82.917 92.2754 86.7949C92.0814 87.2747 91.8584 87.7423 91.6064 88.1949C91.6064 88.1949 99.0124 97.0533 105.908 90.4728L103.226 77.6913C103.226 77.6913 107.44 69.2125 101.949 65.7957Z" fill="#2F2E41"/>
<path d="M100.793 62.4823C99.9008 61.158 99.1958 59.3217 100.179 58.0617C101.149 56.8179 103.063 57.0012 104.549 56.4508C106.619 55.6843 107.819 53.2746 107.444 51.1166C107.07 48.9586 105.322 47.1697 103.24 46.4378C101.157 45.7058 98.8088 45.9438 96.7698 46.7867C94.2598 47.8244 92.1058 49.8316 91.2028 52.3742C90.2998 54.9168 90.7828 57.9697 92.6558 59.924C94.6648 62.0192 97.8168 62.5776 100.732 62.5437" fill="#2F2E41"/>
<path d="M94.9589 51.1856C93.8339 52.0932 92.1169 51.6901 90.9099 50.8936C89.7019 50.0971 88.7219 48.9629 87.4159 48.3384C85.1119 47.2374 82.3279 47.9693 80.0859 49.1888C77.8439 50.4084 75.8566 52.0931 73.4887 53.0501C71.1207 54.0072 68.099 54.0545 66.3059 52.2474C65.8647 53.5144 65.8286 54.8854 66.2026 56.1734C66.5767 57.4615 67.3426 58.6038 68.3959 59.4445C69.4492 60.2852 70.7385 60.7834 72.0881 60.8711C73.4376 60.9587 74.7816 60.6316 75.9366 59.9344C78.5309 58.3681 79.9639 55.0841 82.8749 54.2196C84.4849 53.7412 86.2139 54.1265 87.8419 54.5438C89.4689 54.9611 91.1659 55.4121 92.8089 55.0568C94.4509 54.7015 95.9879 53.2388 95.7789 51.5856L94.9589 51.1856Z" fill="#2F2E41"/>
<path d="M115.378 109.759C114.714 105.484 114.714 101.133 115.378 96.8577C115.42 96.6032 115.552 96.3718 115.75 96.2047C115.948 96.0376 116.2 95.9456 116.46 95.9451H126.643C126.808 95.9446 126.971 95.9814 127.119 96.0527C127.268 96.124 127.398 96.228 127.5 96.3567C127.604 96.4871 127.676 96.6394 127.712 96.8019C127.748 96.9643 127.746 97.1328 127.706 97.2943C126.753 101.248 126.753 105.369 127.706 109.323C127.746 109.484 127.748 109.653 127.712 109.815C127.676 109.978 127.604 110.13 127.5 110.26C127.398 110.389 127.268 110.493 127.119 110.564C126.971 110.636 126.808 110.673 126.643 110.672H116.46C116.2 110.672 115.948 110.579 115.75 110.412C115.552 110.245 115.42 110.014 115.378 109.759Z" fill="#519ED5"/>
<path d="M123.509 102.191H118.166C117.962 102.19 117.768 102.11 117.624 101.968C117.48 101.826 117.4 101.633 117.399 101.431V101.135C117.4 100.933 117.48 100.74 117.624 100.598C117.768 100.456 117.962 100.376 118.166 100.375H123.509C123.712 100.376 123.907 100.456 124.051 100.598C124.194 100.74 124.275 100.933 124.275 101.135V101.431C124.275 101.633 124.194 101.826 124.051 101.968C123.907 102.11 123.712 102.19 123.509 102.191Z" fill="white"/>
<path d="M123.509 105.315H118.166C117.962 105.315 117.768 105.235 117.624 105.092C117.48 104.95 117.4 104.757 117.399 104.556V104.259C117.4 104.058 117.48 103.865 117.624 103.722C117.768 103.58 117.962 103.5 118.166 103.5H123.509C123.712 103.5 123.907 103.58 124.051 103.722C124.194 103.865 124.275 104.058 124.275 104.259V104.556C124.275 104.757 124.194 104.95 124.051 105.092C123.907 105.235 123.712 105.315 123.509 105.315Z" fill="white"/>
<path d="M118.056 97.1547C118.207 96.7867 118.276 96.3903 118.256 95.9932C118.237 95.5962 118.129 95.2083 117.942 94.8568C117.755 94.5053 117.492 94.1987 117.172 93.9587C116.853 93.7187 116.484 93.5511 116.092 93.4677L103.288 72.2014L98.7549 76.0464L112.766 95.7415C112.668 96.4036 112.819 97.0783 113.19 97.6377C113.561 98.1971 114.126 98.6023 114.778 98.7765C115.43 98.9507 116.123 98.8818 116.728 98.5829C117.332 98.284 117.804 97.7758 118.056 97.1547Z" fill="#A0616A"/>
<path d="M105.832 75.6492L100.43 78.6919C100.277 78.7785 100.106 78.8312 99.93 78.8465C99.754 78.8618 99.576 78.8393 99.41 78.7806C99.243 78.7218 99.091 78.6282 98.965 78.506C98.838 78.3839 98.739 78.2361 98.675 78.0728L96.437 72.3491C95.994 71.5673 95.883 70.6436 96.126 69.7805C96.37 68.9173 96.949 68.1852 97.737 67.7445C98.524 67.3039 99.456 67.1907 100.328 67.4298C101.199 67.6689 101.94 68.2408 102.387 69.0201L106.193 73.8381C106.301 73.9761 106.379 74.1357 106.42 74.3061C106.461 74.4765 106.465 74.6537 106.431 74.8255C106.396 74.9974 106.325 75.1599 106.222 75.3021C106.118 75.4442 105.985 75.5626 105.832 75.6492Z" fill="#2F2E41"/>
<path d="M163.304 83.1191H59.6162C59.1759 83.1191 58.7537 83.2925 58.4424 83.601C58.131 83.9095 57.9561 84.328 57.9561 84.7643C57.9561 85.2006 58.131 85.619 58.4424 85.9276C58.7537 86.2361 59.1759 86.4094 59.6162 86.4094H62.5531V122.223C62.5531 122.659 62.728 123.078 63.0393 123.386C63.3506 123.695 63.7729 123.868 64.2131 123.868C64.6534 123.868 65.0757 123.695 65.387 123.386C65.6983 123.078 65.8732 122.659 65.8732 122.223V89.5706L84.4836 122.999C84.7046 123.376 85.0666 123.651 85.4916 123.763C85.9166 123.876 86.3686 123.816 86.7496 123.599C87.1306 123.381 87.4086 123.022 87.5226 122.601C87.6366 122.18 87.5776 121.732 87.3586 121.354L67.9044 86.4094H156.792V86.4307L137.349 121.354C137.129 121.732 137.069 122.181 137.183 122.602C137.297 123.024 137.576 123.383 137.957 123.601C138.338 123.82 138.791 123.879 139.216 123.766C139.642 123.653 140.004 123.377 140.224 122.999L156.792 93.2405V122.223C156.792 122.659 156.967 123.078 157.278 123.386C157.589 123.695 158.011 123.868 158.452 123.868C158.892 123.868 159.314 123.695 159.626 123.386C159.937 123.078 160.112 122.659 160.112 122.223V87.2769L160.595 86.4094H163.304C163.744 86.4094 164.167 86.2361 164.478 85.9276C164.789 85.619 164.964 85.2006 164.964 84.7643C164.964 84.328 164.789 83.9095 164.478 83.601C164.167 83.2925 163.744 83.1191 163.304 83.1191Z" fill="#3F3D56"/>
<path d="M120.399 82.1067H100.223C99.7301 82.1067 99.3291 82.5033 99.3291 82.9925C99.3291 83.4818 99.7301 83.8784 100.223 83.8784H120.399C120.893 83.8784 121.293 83.4818 121.293 82.9925C121.293 82.5033 120.893 82.1067 120.399 82.1067Z" fill="#CCCCCC"/>
<path d="M133.934 83.8786H111.205C110.765 83.8781 110.343 83.7046 110.032 83.3962C109.72 83.0878 109.545 82.6696 109.545 82.2334V69.8316C109.545 69.3955 109.72 68.9773 110.032 68.6689C110.343 68.3605 110.765 68.187 111.205 68.1865H133.934C134.375 68.187 134.797 68.3605 135.108 68.6689C135.419 68.9773 135.594 69.3955 135.594 69.8316V82.2334C135.594 82.6696 135.419 83.0878 135.108 83.3962C134.797 83.7046 134.375 83.8781 133.934 83.8786Z" fill="#CCCCCC"/>
<path d="M122.57 77.5511C123.416 77.5511 124.102 76.8712 124.102 76.0325C124.102 75.1938 123.416 74.5139 122.57 74.5139C121.723 74.5139 121.037 75.1938 121.037 76.0325C121.037 76.8712 121.723 77.5511 122.57 77.5511Z" fill="white"/>
<path d="M151.281 53.3223V8.90366C151.281 8.39895 151.484 7.91508 151.844 7.5582C152.204 7.20132 152.692 7.00057 153.202 7H188.631C189.14 7.00057 189.629 7.20132 189.989 7.5582C190.349 7.91508 190.551 8.39895 190.552 8.90366V53.3223C190.551 53.827 190.349 54.3109 189.989 54.6678C189.629 55.0247 189.14 55.2254 188.631 55.226H153.202C152.692 55.2254 152.204 55.0247 151.844 54.6678C151.484 54.3109 151.281 53.827 151.281 53.3223ZM153.202 7.42304C152.805 7.42348 152.426 7.57961 152.146 7.85719C151.865 8.13476 151.708 8.51111 151.707 8.90366V53.3223C151.708 53.7149 151.865 54.0912 152.146 54.3688C152.426 54.6464 152.805 54.8025 153.202 54.803H188.631C189.027 54.8025 189.407 54.6464 189.687 54.3688C189.967 54.0912 190.125 53.7149 190.125 53.3223V8.90366C190.125 8.51111 189.967 8.13476 189.687 7.85719C189.407 7.57961 189.027 7.42348 188.631 7.42304H153.202Z" fill="#E6E6E6"/>
<path d="M172.903 27.3993V18.2787C172.903 18.0264 173.005 17.7844 173.185 17.606C173.365 17.4275 173.609 17.3272 173.864 17.3269H181.662C181.917 17.3272 182.161 17.4275 182.341 17.606C182.521 17.7844 182.622 18.0264 182.623 18.2787V27.3993C182.622 27.6516 182.521 27.8936 182.341 28.072C182.161 28.2504 181.917 28.3508 181.662 28.3511H173.864C173.609 28.3508 173.365 28.2504 173.185 28.072C173.005 27.8936 172.903 27.6516 172.903 27.3993Z" fill="#519ED5"/>
<path d="M157.749 31.6293V22.5087C157.75 22.2564 157.851 22.0144 158.031 21.836C158.211 21.6576 158.455 21.5572 158.71 21.5569H166.509C166.763 21.5572 167.007 21.6576 167.187 21.836C167.367 22.0144 167.469 22.2564 167.469 22.5087V31.6293C167.469 31.8817 167.367 32.1236 167.187 32.302C167.007 32.4805 166.763 32.5808 166.509 32.5811H158.71C158.455 32.5808 158.211 32.4805 158.031 32.302C157.851 32.1236 157.75 31.8817 157.749 31.6293Z" fill="#CCCCCC"/>
<path d="M169.915 44.5321V35.4115C169.915 35.1592 170.017 34.9172 170.197 34.7388C170.377 34.5603 170.621 34.46 170.875 34.4597H178.674C178.929 34.46 179.173 34.5603 179.353 34.7388C179.533 34.9172 179.634 35.1592 179.635 35.4115V44.5321C179.634 44.7844 179.533 45.0264 179.353 45.2048C179.173 45.3833 178.929 45.4836 178.674 45.4839H170.875C170.621 45.4836 170.377 45.3833 170.197 45.2048C170.017 45.0264 169.915 44.7844 169.915 44.5321Z" fill="#FF6584"/>
<path d="M229.392 11.6285C230.304 11.6285 231.043 10.8957 231.043 9.99174C231.043 9.08778 230.304 8.35498 229.392 8.35498C228.48 8.35498 227.74 9.08778 227.74 9.99174C227.74 10.8957 228.48 11.6285 229.392 11.6285Z" fill="#F2F2F2"/>
<path d="M229.392 18.1517C230.304 18.1517 231.043 17.4189 231.043 16.5149C231.043 15.611 230.304 14.8782 229.392 14.8782C228.48 14.8782 227.74 15.611 227.74 16.5149C227.74 17.4189 228.48 18.1517 229.392 18.1517Z" fill="#F2F2F2"/>
<path d="M229.392 24.6747C230.304 24.6747 231.043 23.9419 231.043 23.0379C231.043 22.1339 230.304 21.4011 229.392 21.4011C228.48 21.4011 227.74 22.1339 227.74 23.0379C227.74 23.9419 228.48 24.6747 229.392 24.6747Z" fill="#F2F2F2"/>
<path d="M229.392 31.1979C230.304 31.1979 231.043 30.4651 231.043 29.5611C231.043 28.6571 230.304 27.9243 229.392 27.9243C228.48 27.9243 227.74 28.6571 227.74 29.5611C227.74 30.4651 228.48 31.1979 229.392 31.1979Z" fill="#F2F2F2"/>
<path d="M222.496 11.6285C223.408 11.6285 224.148 10.8957 224.148 9.99174C224.148 9.08778 223.408 8.35498 222.496 8.35498C221.584 8.35498 220.845 9.08778 220.845 9.99174C220.845 10.8957 221.584 11.6285 222.496 11.6285Z" fill="#F2F2F2"/>
<path d="M222.496 18.1517C223.408 18.1517 224.148 17.4189 224.148 16.5149C224.148 15.611 223.408 14.8782 222.496 14.8782C221.584 14.8782 220.845 15.611 220.845 16.5149C220.845 17.4189 221.584 18.1517 222.496 18.1517Z" fill="#F2F2F2"/>
<path d="M222.496 24.6747C223.408 24.6747 224.148 23.9419 224.148 23.0379C224.148 22.1339 223.408 21.4011 222.496 21.4011C221.584 21.4011 220.845 22.1339 220.845 23.0379C220.845 23.9419 221.584 24.6747 222.496 24.6747Z" fill="#F2F2F2"/>
<path d="M222.496 31.1979C223.408 31.1979 224.148 30.4651 224.148 29.5611C224.148 28.6571 223.408 27.9243 222.496 27.9243C221.584 27.9243 220.845 28.6571 220.845 29.5611C220.845 30.4651 221.584 31.1979 222.496 31.1979Z" fill="#F2F2F2"/>
<path d="M215.601 11.6285C216.513 11.6285 217.252 10.8957 217.252 9.99174C217.252 9.08778 216.513 8.35498 215.601 8.35498C214.689 8.35498 213.949 9.08778 213.949 9.99174C213.949 10.8957 214.689 11.6285 215.601 11.6285Z" fill="#F2F2F2"/>
<path d="M215.601 18.1517C216.513 18.1517 217.252 17.4189 217.252 16.5149C217.252 15.611 216.513 14.8782 215.601 14.8782C214.689 14.8782 213.949 15.611 213.949 16.5149C213.949 17.4189 214.689 18.1517 215.601 18.1517Z" fill="#F2F2F2"/>
<path d="M215.601 24.6747C216.513 24.6747 217.252 23.9419 217.252 23.0379C217.252 22.1339 216.513 21.4011 215.601 21.4011C214.689 21.4011 213.949 22.1339 213.949 23.0379C213.949 23.9419 214.689 24.6747 215.601 24.6747Z" fill="#F2F2F2"/>
<path d="M215.601 31.1979C216.513 31.1979 217.252 30.4651 217.252 29.5611C217.252 28.6571 216.513 27.9243 215.601 27.9243C214.689 27.9243 213.949 28.6571 213.949 29.5611C213.949 30.4651 214.689 31.1979 215.601 31.1979Z" fill="#F2F2F2"/>
<path d="M208.705 11.6285C209.618 11.6285 210.357 10.8957 210.357 9.99174C210.357 9.08778 209.618 8.35498 208.705 8.35498C207.793 8.35498 207.054 9.08778 207.054 9.99174C207.054 10.8957 207.793 11.6285 208.705 11.6285Z" fill="#F2F2F2"/>
<path d="M208.705 18.1517C209.618 18.1517 210.357 17.4189 210.357 16.5149C210.357 15.611 209.618 14.8782 208.705 14.8782C207.793 14.8782 207.054 15.611 207.054 16.5149C207.054 17.4189 207.793 18.1517 208.705 18.1517Z" fill="#F2F2F2"/>
<path d="M208.705 24.6747C209.618 24.6747 210.357 23.9419 210.357 23.0379C210.357 22.1339 209.618 21.4011 208.705 21.4011C207.793 21.4011 207.054 22.1339 207.054 23.0379C207.054 23.9419 207.793 24.6747 208.705 24.6747Z" fill="#F2F2F2"/>
<path d="M208.705 31.1979C209.618 31.1979 210.357 30.4651 210.357 29.5611C210.357 28.6571 209.618 27.9243 208.705 27.9243C207.793 27.9243 207.054 28.6571 207.054 29.5611C207.054 30.4651 207.793 31.1979 208.705 31.1979Z" fill="#F2F2F2"/>
<path d="M201.81 11.6285C202.722 11.6285 203.461 10.8957 203.461 9.99174C203.461 9.08778 202.722 8.35498 201.81 8.35498C200.898 8.35498 200.158 9.08778 200.158 9.99174C200.158 10.8957 200.898 11.6285 201.81 11.6285Z" fill="#F2F2F2"/>
<path d="M201.81 18.1517C202.722 18.1517 203.461 17.4189 203.461 16.5149C203.461 15.611 202.722 14.8782 201.81 14.8782C200.898 14.8782 200.158 15.611 200.158 16.5149C200.158 17.4189 200.898 18.1517 201.81 18.1517Z" fill="#F2F2F2"/>
<path d="M201.81 24.6747C202.722 24.6747 203.461 23.9419 203.461 23.0379C203.461 22.1339 202.722 21.4011 201.81 21.4011C200.898 21.4011 200.158 22.1339 200.158 23.0379C200.158 23.9419 200.898 24.6747 201.81 24.6747Z" fill="#F2F2F2"/>
<path d="M201.81 31.1979C202.722 31.1979 203.461 30.4651 203.461 29.5611C203.461 28.6571 202.722 27.9243 201.81 27.9243C200.898 27.9243 200.158 28.6571 200.158 29.5611C200.158 30.4651 200.898 31.1979 201.81 31.1979Z" fill="#F2F2F2"/>
<path d="M194.914 11.6285C195.827 11.6285 196.566 10.8957 196.566 9.99174C196.566 9.08778 195.827 8.35498 194.914 8.35498C194.002 8.35498 193.263 9.08778 193.263 9.99174C193.263 10.8957 194.002 11.6285 194.914 11.6285Z" fill="#F2F2F2"/>
<path d="M194.914 18.1517C195.827 18.1517 196.566 17.4189 196.566 16.5149C196.566 15.611 195.827 14.8782 194.914 14.8782C194.002 14.8782 193.263 15.611 193.263 16.5149C193.263 17.4189 194.002 18.1517 194.914 18.1517Z" fill="#F2F2F2"/>
<path d="M194.914 24.6747C195.827 24.6747 196.566 23.9419 196.566 23.0379C196.566 22.1339 195.827 21.4011 194.914 21.4011C194.002 21.4011 193.263 22.1339 193.263 23.0379C193.263 23.9419 194.002 24.6747 194.914 24.6747Z" fill="#F2F2F2"/>
<path d="M194.914 31.1979C195.827 31.1979 196.566 30.4651 196.566 29.5611C196.566 28.6571 195.827 27.9243 194.914 27.9243C194.002 27.9243 193.263 28.6571 193.263 29.5611C193.263 30.4651 194.002 31.1979 194.914 31.1979Z" fill="#F2F2F2"/>
<path d="M201.568 68.0604C201.433 67.6918 201.378 67.2989 201.406 66.9076C201.434 66.5163 201.546 66.1354 201.733 65.7898C201.92 65.4441 202.179 65.1416 202.493 64.9021C202.806 64.6625 203.167 64.4913 203.552 64.3996C203.674 64.3712 203.798 64.3512 203.923 64.3398L210.129 53.5582L208.562 50.8899L212.463 47.9072L215.448 52.0155C215.804 52.5094 215.99 53.1038 215.978 53.7106C215.966 54.3174 215.757 54.9042 215.382 55.3839L206.861 66.1947C206.892 66.2805 206.918 66.368 206.94 66.4565C207.032 66.838 207.042 67.2346 206.969 67.6202C206.896 68.0058 206.742 68.3718 206.516 68.6941C206.29 69.0165 205.999 69.288 205.66 69.4907C205.321 69.6935 204.942 69.823 204.549 69.8707C204.435 69.885 204.321 69.8922 204.206 69.8921C203.63 69.8903 203.068 69.7138 202.597 69.3863C202.126 69.0588 201.767 68.5961 201.568 68.0604Z" fill="#FFB8B8"/>
<path d="M189.459 121.119H186.328L184.839 109.15H189.46L189.459 121.119Z" fill="#FFB8B8"/>
<path d="M184.092 120.232H190.13V124H180.29C180.29 123.505 180.388 123.015 180.579 122.558C180.77 122.101 181.05 121.685 181.403 121.336C181.756 120.986 182.175 120.708 182.637 120.519C183.098 120.329 183.592 120.232 184.092 120.232Z" fill="#2F2E41"/>
<path d="M215.253 121.119H212.122L210.633 109.15H215.254L215.253 121.119Z" fill="#FFB8B8"/>
<path d="M209.886 120.232H215.924V124H206.084C206.084 123.505 206.182 123.015 206.373 122.558C206.564 122.101 206.844 121.685 207.197 121.336C207.55 120.986 207.97 120.708 208.431 120.519C208.892 120.329 209.387 120.232 209.886 120.232Z" fill="#2F2E41"/>
<path d="M213.331 48.4902L206.302 51.1375L204.586 46.413C204.358 45.7856 204.361 45.0987 204.595 44.4734C204.829 43.8482 205.278 43.325 205.863 42.9963C206.455 42.6638 207.148 42.552 207.816 42.6813C208.484 42.8105 209.083 43.1722 209.506 43.701L213.331 48.4902Z" fill="#519ED5"/>
<path d="M189.729 111.425L183.834 110.093C183.52 110.021 183.246 109.835 183.065 109.571C182.884 109.307 182.811 108.986 182.86 108.671C185.226 93.8113 187.502 85.1094 193.367 74.0588C193.449 73.8527 194.365 69.6706 194.962 66.8998C194.956 66.5946 195.061 66.2973 195.259 66.0633C195.457 65.8294 195.734 65.6748 196.039 65.6283L207.032 63.9516C207.197 63.8946 207.372 63.8685 207.548 63.8747L207.658 63.8953L207.656 64.0024C207.655 64.1132 207.544 64.1301 207.502 64.1365L207.356 64.1588C207.523 64.2357 207.676 64.3388 207.809 64.4641C212.626 70.2053 215.13 89.0247 218.311 109.815C218.329 109.984 218.308 110.155 218.251 110.314C218.193 110.474 218.1 110.619 217.978 110.739C217.863 110.863 217.724 110.963 217.569 111.033C217.413 111.103 217.245 111.14 217.075 111.144L210.051 111.313C209.743 111.32 209.442 111.216 209.206 111.019C208.969 110.823 208.813 110.548 208.766 110.246L204.035 83.1519C204.002 82.9402 203.902 82.7444 203.75 82.5929C203.597 82.4414 203.4 82.3421 203.186 82.3095C202.973 82.2769 202.754 82.3126 202.563 82.4115C202.371 82.5104 202.216 82.6673 202.121 82.8593C198.304 90.5623 194.745 97.2239 191.24 110.514C191.17 110.784 191.012 111.023 190.791 111.194C190.569 111.364 190.296 111.457 190.016 111.457C189.919 111.457 189.823 111.447 189.729 111.425Z" fill="#2F2E41"/>
<path d="M195.452 67.2092C195.304 67.1055 195.18 66.9717 195.088 66.8169C194.997 66.662 194.939 66.4895 194.92 66.311C194.019 57.9816 194.647 51.4632 196.837 46.3833C197.222 45.5072 197.804 44.7291 198.536 44.1075C199.269 43.4859 200.135 43.037 201.068 42.7945L206.75 42.5103L206.779 42.5243C208.062 43.1468 209.107 44.1621 209.761 45.4199C210.416 46.6776 210.643 48.1108 210.411 49.5069C208.583 54.2812 207.053 59.2519 208.22 63.2618C208.269 63.4295 208.283 63.6052 208.262 63.7784C208.241 63.9517 208.184 64.1189 208.096 64.27C208.011 64.4161 207.896 64.5433 207.76 64.6438C207.623 64.7444 207.467 64.816 207.301 64.8544L196.478 67.4059C196.302 67.4473 196.12 67.4511 195.943 67.4172C195.767 67.3832 195.599 67.3123 195.452 67.2092Z" fill="#CCCCCC"/>
<path d="M193.006 55.2561L182.107 46.7353C182.021 46.7655 181.932 46.7914 181.843 46.8126C181.458 46.9018 181.059 46.9098 180.671 46.836C180.283 46.7623 179.915 46.6085 179.591 46.3846C179.265 46.1605 178.991 45.87 178.787 45.5324C178.583 45.1949 178.454 44.8181 178.409 44.4272C178.336 43.8025 178.478 43.1716 178.813 42.6369C179.147 42.1022 179.653 41.6951 180.25 41.4816C180.623 41.3492 181.02 41.2963 181.414 41.3263C181.809 41.3563 182.193 41.4687 182.541 41.6559C182.889 41.8432 183.193 42.1012 183.433 42.413C183.673 42.7248 183.844 43.0834 183.935 43.4653C183.963 43.5863 183.982 43.7091 183.993 43.8328L194.843 50.0356L197.542 48.4951L200.533 52.3756L196.341 55.3367C195.851 55.6804 195.261 55.8583 194.66 55.8438C194.059 55.8292 193.479 55.6232 193.006 55.2561Z" fill="#FFB8B8"/>
<path d="M201.863 53.5841L195.645 49.3934L198.567 45.2915C198.955 44.7468 199.525 44.3556 200.176 44.187C200.827 44.0185 201.517 44.0833 202.124 44.3702C202.739 44.6604 203.228 45.1588 203.504 45.7753C203.78 46.3918 203.825 47.0858 203.63 47.732L201.863 53.5841Z" fill="#519ED5"/>
<path d="M204.854 40.4071C208.318 40.4071 211.126 37.6239 211.126 34.1907C211.126 30.7575 208.318 27.9744 204.854 27.9744C201.389 27.9744 198.581 30.7575 198.581 34.1907C198.581 37.6239 201.389 40.4071 204.854 40.4071Z" fill="#FFB8B8"/>
<path d="M202.554 33.2649C200.942 34.3584 198.825 35.4825 197.178 34.318C196.097 33.5533 195.756 32.1374 196.195 30.8948C196.983 28.6604 199.15 27.6766 201.221 26.9226C203.914 25.9423 206.846 25.1625 209.626 25.8645C212.406 26.5665 214.863 29.234 214.361 32.0332C213.958 34.2843 211.815 36.1574 212.119 38.4238C212.425 40.7048 215.014 41.9054 217.299 42.3131C219.584 42.7208 222.141 42.8517 223.783 44.4784C225.878 46.5535 225.355 50.2625 223.384 52.4534C221.413 54.6443 218.438 55.6374 215.555 56.3125C211.736 57.207 207.605 57.6771 203.978 56.1926C200.351 54.7081 197.528 50.7119 198.579 46.9647C199.023 45.3819 200.068 44.0442 201.079 42.7419C202.089 41.4396 203.112 40.0778 203.498 38.48C203.819 37.1485 203.581 35.6026 202.69 34.6039C202.528 34.4291 202.426 34.2078 202.399 33.972C202.372 33.7362 202.42 33.4978 202.538 33.2912L202.554 33.2649Z" fill="#2F2E41"/>
</svg>
