<svg width="341" height="196" viewBox="0 0 341 196" fill="none" xmlns="http://www.w3.org/2000/svg">
<path d="M25 20C25 8.9543 33.9543 0 45 0H317V111C317 122.046 308.046 131 297 131H25V20Z" fill="#519ED5"/>
<path d="M3.4086 148.867H8.49454C10.8539 148.867 12.557 149.211 13.6039 149.898C14.6586 150.586 15.1859 151.672 15.1859 153.156C15.1859 154.156 14.9281 154.988 14.4125 155.652C13.8969 156.316 13.1547 156.734 12.1859 156.906V157.023C13.3891 157.25 14.2719 157.699 14.8344 158.371C15.4047 159.035 15.6898 159.938 15.6898 161.078C15.6898 162.617 15.1508 163.824 14.0727 164.699C13.0023 165.566 11.5102 166 9.5961 166H3.4086V148.867ZM6.20938 155.945H8.90469C10.0766 155.945 10.932 155.762 11.4711 155.395C12.0102 155.02 12.2797 154.387 12.2797 153.496C12.2797 152.691 11.9867 152.109 11.4008 151.75C10.8227 151.391 9.90079 151.211 8.63516 151.211H6.20938V155.945ZM6.20938 158.219V163.645H9.18594C10.3578 163.645 11.2406 163.422 11.8344 162.977C12.4359 162.523 12.7367 161.812 12.7367 160.844C12.7367 159.953 12.432 159.293 11.8227 158.863C11.2133 158.434 10.2875 158.219 9.04532 158.219H6.20938ZM24.7195 166.234C22.7039 166.234 21.1258 165.648 19.9852 164.477C18.8524 163.297 18.2859 161.676 18.2859 159.613C18.2859 157.496 18.8133 155.832 19.868 154.621C20.9227 153.41 22.3719 152.805 24.2156 152.805C25.9266 152.805 27.2781 153.324 28.2703 154.363C29.2625 155.402 29.7586 156.832 29.7586 158.652V160.141H21.1219C21.1609 161.398 21.5008 162.367 22.1414 163.047C22.782 163.719 23.6844 164.055 24.8484 164.055C25.6141 164.055 26.325 163.984 26.9813 163.844C27.6453 163.695 28.3563 163.453 29.1141 163.117V165.355C28.4422 165.676 27.7625 165.902 27.075 166.035C26.3875 166.168 25.6024 166.234 24.7195 166.234ZM24.2156 154.891C23.3406 154.891 22.6375 155.168 22.1063 155.723C21.5828 156.277 21.2703 157.086 21.1688 158.148H27.0516C27.0359 157.078 26.7781 156.27 26.2781 155.723C25.7781 155.168 25.0906 154.891 24.2156 154.891ZM38.2141 166.234C36.2531 166.234 34.7609 165.664 33.7375 164.523C32.7219 163.375 32.2141 161.73 32.2141 159.59C32.2141 157.41 32.7453 155.734 33.8078 154.562C34.8781 153.391 36.4211 152.805 38.4367 152.805C39.8039 152.805 41.0344 153.059 42.1281 153.566L41.2961 155.781C40.132 155.328 39.1711 155.102 38.4133 155.102C36.1711 155.102 35.05 156.59 35.05 159.566C35.05 161.02 35.3274 162.113 35.882 162.848C36.4445 163.574 37.2649 163.938 38.343 163.938C39.5695 163.938 40.7297 163.633 41.8234 163.023V165.426C41.3313 165.715 40.8039 165.922 40.2414 166.047C39.6867 166.172 39.0109 166.234 38.2141 166.234ZM56.4664 159.496C56.4664 161.613 55.9234 163.266 54.8375 164.453C53.7516 165.641 52.2398 166.234 50.3023 166.234C49.0914 166.234 48.0211 165.961 47.0914 165.414C46.1617 164.867 45.4469 164.082 44.9469 163.059C44.4469 162.035 44.1969 160.848 44.1969 159.496C44.1969 157.395 44.7359 155.754 45.8141 154.574C46.8922 153.395 48.4117 152.805 50.3727 152.805C52.2477 152.805 53.732 153.41 54.8258 154.621C55.9195 155.824 56.4664 157.449 56.4664 159.496ZM47.0328 159.496C47.0328 162.488 48.1383 163.984 50.3492 163.984C52.5367 163.984 53.6305 162.488 53.6305 159.496C53.6305 156.535 52.5289 155.055 50.3258 155.055C49.1695 155.055 48.3297 155.438 47.8063 156.203C47.2906 156.969 47.0328 158.066 47.0328 159.496ZM70.6641 166H67.8984V158.008C67.8984 157.016 67.7109 156.277 67.3359 155.793C66.9609 155.301 66.375 155.055 65.5781 155.055C64.5156 155.055 63.7344 155.402 63.2344 156.098C62.7422 156.785 62.4961 157.934 62.4961 159.543V166H59.7422V153.039H61.8984L62.2852 154.738H62.4258C62.7852 154.121 63.3047 153.645 63.9844 153.309C64.6719 152.973 65.4258 152.805 66.2461 152.805C68.2383 152.805 69.5586 153.484 70.207 154.844H70.3945C70.7774 154.203 71.3164 153.703 72.0117 153.344C72.707 152.984 73.5039 152.805 74.4024 152.805C75.9492 152.805 77.0742 153.195 77.7774 153.977C78.4883 154.758 78.8438 155.949 78.8438 157.551V166H76.0899V158.008C76.0899 157.016 75.8984 156.277 75.5156 155.793C75.1406 155.301 74.5547 155.055 73.7578 155.055C72.6875 155.055 71.9024 155.391 71.4024 156.062C70.9102 156.727 70.6641 157.75 70.6641 159.133V166ZM88.4477 166.234C86.432 166.234 84.8539 165.648 83.7133 164.477C82.5805 163.297 82.0141 161.676 82.0141 159.613C82.0141 157.496 82.5414 155.832 83.5961 154.621C84.6508 153.41 86.1 152.805 87.9438 152.805C89.6547 152.805 91.0063 153.324 91.9984 154.363C92.9906 155.402 93.4867 156.832 93.4867 158.652V160.141H84.85C84.8891 161.398 85.2289 162.367 85.8695 163.047C86.5102 163.719 87.4125 164.055 88.5766 164.055C89.3422 164.055 90.0531 163.984 90.7094 163.844C91.3734 163.695 92.0844 163.453 92.8422 163.117V165.355C92.1703 165.676 91.4906 165.902 90.8031 166.035C90.1156 166.168 89.3305 166.234 88.4477 166.234ZM87.9438 154.891C87.0688 154.891 86.3656 155.168 85.8344 155.723C85.3109 156.277 84.9984 157.086 84.8969 158.148H90.7797C90.7641 157.078 90.5063 156.27 90.0063 155.723C89.5063 155.168 88.8188 154.891 87.9438 154.891ZM111.159 166L110.609 164.195H110.515C109.89 164.984 109.261 165.523 108.628 165.812C107.995 166.094 107.183 166.234 106.191 166.234C104.917 166.234 103.921 165.891 103.202 165.203C102.491 164.516 102.136 163.543 102.136 162.285C102.136 160.949 102.632 159.941 103.624 159.262C104.616 158.582 106.128 158.211 108.159 158.148L110.398 158.078V157.387C110.398 156.559 110.202 155.941 109.812 155.535C109.429 155.121 108.831 154.914 108.019 154.914C107.355 154.914 106.718 155.012 106.109 155.207C105.499 155.402 104.913 155.633 104.351 155.898L103.46 153.93C104.163 153.562 104.933 153.285 105.769 153.098C106.605 152.902 107.394 152.805 108.136 152.805C109.784 152.805 111.027 153.164 111.863 153.883C112.706 154.602 113.128 155.73 113.128 157.27V166H111.159ZM107.058 164.125C108.058 164.125 108.859 163.848 109.46 163.293C110.07 162.73 110.374 161.945 110.374 160.938V159.812L108.71 159.883C107.413 159.93 106.468 160.148 105.874 160.539C105.288 160.922 104.995 161.512 104.995 162.309C104.995 162.887 105.167 163.336 105.511 163.656C105.855 163.969 106.37 164.125 107.058 164.125ZM137.633 157.27C137.633 160.098 136.848 162.262 135.277 163.762C133.707 165.254 131.445 166 128.492 166H123.699V148.867H128.996C131.723 148.867 133.844 149.602 135.359 151.07C136.875 152.539 137.633 154.605 137.633 157.27ZM134.68 157.363C134.68 153.262 132.762 151.211 128.926 151.211H126.5V163.645H128.492C132.617 163.645 134.68 161.551 134.68 157.363ZM149.241 166L148.69 164.195H148.596C147.971 164.984 147.342 165.523 146.709 165.812C146.077 166.094 145.264 166.234 144.272 166.234C142.998 166.234 142.002 165.891 141.284 165.203C140.573 164.516 140.217 163.543 140.217 162.285C140.217 160.949 140.713 159.941 141.705 159.262C142.698 158.582 144.209 158.211 146.241 158.148L148.479 158.078V157.387C148.479 156.559 148.284 155.941 147.893 155.535C147.51 155.121 146.913 154.914 146.1 154.914C145.436 154.914 144.799 155.012 144.19 155.207C143.58 155.402 142.995 155.633 142.432 155.898L141.541 153.93C142.245 153.562 143.014 153.285 143.85 153.098C144.686 152.902 145.475 152.805 146.217 152.805C147.866 152.805 149.108 153.164 149.944 153.883C150.788 154.602 151.209 155.73 151.209 157.27V166H149.241ZM145.139 164.125C146.139 164.125 146.94 163.848 147.541 163.293C148.151 162.73 148.455 161.945 148.455 160.938V159.812L146.791 159.883C145.495 159.93 144.549 160.148 143.955 160.539C143.37 160.922 143.077 161.512 143.077 162.309C143.077 162.887 143.248 163.336 143.592 163.656C143.936 163.969 144.452 164.125 145.139 164.125ZM159.981 164.008C160.653 164.008 161.325 163.902 161.997 163.691V165.766C161.692 165.898 161.298 166.008 160.813 166.094C160.337 166.188 159.841 166.234 159.325 166.234C156.716 166.234 155.411 164.859 155.411 162.109V155.125H153.641V153.906L155.54 152.898L156.477 150.156H158.177V153.039H161.868V155.125H158.177V162.062C158.177 162.727 158.341 163.219 158.669 163.539C159.005 163.852 159.442 164.008 159.981 164.008ZM172.808 166L172.257 164.195H172.163C171.538 164.984 170.909 165.523 170.277 165.812C169.644 166.094 168.831 166.234 167.839 166.234C166.566 166.234 165.57 165.891 164.851 165.203C164.14 164.516 163.784 163.543 163.784 162.285C163.784 160.949 164.28 159.941 165.273 159.262C166.265 158.582 167.777 158.211 169.808 158.148L172.046 158.078V157.387C172.046 156.559 171.851 155.941 171.46 155.535C171.077 155.121 170.48 154.914 169.667 154.914C169.003 154.914 168.366 155.012 167.757 155.207C167.148 155.402 166.562 155.633 165.999 155.898L165.109 153.93C165.812 153.562 166.581 153.285 167.417 153.098C168.253 152.902 169.042 152.805 169.784 152.805C171.433 152.805 172.675 153.164 173.511 153.883C174.355 154.602 174.777 155.73 174.777 157.27V166H172.808ZM168.706 164.125C169.706 164.125 170.507 163.848 171.109 163.293C171.718 162.73 172.023 161.945 172.023 160.938V159.812L170.359 159.883C169.062 159.93 168.116 160.148 167.523 160.539C166.937 160.922 166.644 161.512 166.644 162.309C166.644 162.887 166.816 163.336 167.159 163.656C167.503 163.969 168.019 164.125 168.706 164.125ZM195.227 161.348C195.227 162.871 194.676 164.066 193.574 164.934C192.473 165.801 190.953 166.234 189.016 166.234C187.078 166.234 185.492 165.934 184.258 165.332V162.684C185.039 163.051 185.867 163.34 186.742 163.551C187.625 163.762 188.445 163.867 189.203 163.867C190.312 163.867 191.129 163.656 191.652 163.234C192.184 162.812 192.449 162.246 192.449 161.535C192.449 160.895 192.207 160.352 191.723 159.906C191.238 159.461 190.238 158.934 188.723 158.324C187.16 157.691 186.059 156.969 185.418 156.156C184.777 155.344 184.457 154.367 184.457 153.227C184.457 151.797 184.965 150.672 185.98 149.852C186.996 149.031 188.359 148.621 190.07 148.621C191.711 148.621 193.344 148.98 194.969 149.699L194.078 151.984C192.555 151.344 191.195 151.023 190 151.023C189.094 151.023 188.406 151.223 187.938 151.621C187.469 152.012 187.234 152.531 187.234 153.18C187.234 153.625 187.328 154.008 187.516 154.328C187.703 154.641 188.012 154.938 188.441 155.219C188.871 155.5 189.645 155.871 190.762 156.332C192.02 156.855 192.941 157.344 193.527 157.797C194.113 158.25 194.543 158.762 194.816 159.332C195.09 159.902 195.227 160.574 195.227 161.348ZM203.577 166.234C201.616 166.234 200.123 165.664 199.1 164.523C198.084 163.375 197.577 161.73 197.577 159.59C197.577 157.41 198.108 155.734 199.17 154.562C200.241 153.391 201.784 152.805 203.799 152.805C205.166 152.805 206.397 153.059 207.491 153.566L206.659 155.781C205.495 155.328 204.534 155.102 203.776 155.102C201.534 155.102 200.413 156.59 200.413 159.566C200.413 161.02 200.69 162.113 201.245 162.848C201.807 163.574 202.627 163.938 203.705 163.938C204.932 163.938 206.092 163.633 207.186 163.023V165.426C206.694 165.715 206.166 165.922 205.604 166.047C205.049 166.172 204.373 166.234 203.577 166.234ZM213.087 166H210.333V153.039H213.087V166ZM210.169 149.605C210.169 149.113 210.302 148.734 210.567 148.469C210.841 148.203 211.227 148.07 211.727 148.07C212.212 148.07 212.587 148.203 212.852 148.469C213.126 148.734 213.263 149.113 213.263 149.605C213.263 150.074 213.126 150.445 212.852 150.719C212.587 150.984 212.212 151.117 211.727 151.117C211.227 151.117 210.841 150.984 210.567 150.719C210.302 150.445 210.169 150.074 210.169 149.605ZM222.796 166.234C220.78 166.234 219.202 165.648 218.062 164.477C216.929 163.297 216.363 161.676 216.363 159.613C216.363 157.496 216.89 155.832 217.945 154.621C218.999 153.41 220.448 152.805 222.292 152.805C224.003 152.805 225.355 153.324 226.347 154.363C227.339 155.402 227.835 156.832 227.835 158.652V160.141H219.198C219.238 161.398 219.577 162.367 220.218 163.047C220.859 163.719 221.761 164.055 222.925 164.055C223.691 164.055 224.402 163.984 225.058 163.844C225.722 163.695 226.433 163.453 227.191 163.117V165.355C226.519 165.676 225.839 165.902 225.152 166.035C224.464 166.168 223.679 166.234 222.796 166.234ZM222.292 154.891C221.417 154.891 220.714 155.168 220.183 155.723C219.659 156.277 219.347 157.086 219.245 158.148H225.128C225.113 157.078 224.855 156.27 224.355 155.723C223.855 155.168 223.167 154.891 222.292 154.891ZM242.466 166H239.701V158.031C239.701 157.031 239.498 156.285 239.091 155.793C238.693 155.301 238.056 155.055 237.181 155.055C236.017 155.055 235.166 155.398 234.627 156.086C234.088 156.773 233.818 157.926 233.818 159.543V166H231.064V153.039H233.22L233.607 154.738H233.748C234.138 154.121 234.693 153.645 235.412 153.309C236.13 152.973 236.927 152.805 237.802 152.805C240.912 152.805 242.466 154.387 242.466 157.551V166ZM251.227 164.008C251.898 164.008 252.57 163.902 253.242 163.691V165.766C252.938 165.898 252.543 166.008 252.059 166.094C251.582 166.188 251.086 166.234 250.57 166.234C247.961 166.234 246.656 164.859 246.656 162.109V155.125H244.887V153.906L246.785 152.898L247.723 150.156H249.422V153.039H253.113V155.125H249.422V162.062C249.422 162.727 249.586 163.219 249.914 163.539C250.25 163.852 250.688 164.008 251.227 164.008ZM258.698 166H255.944V153.039H258.698V166ZM255.78 149.605C255.78 149.113 255.913 148.734 256.178 148.469C256.452 148.203 256.838 148.07 257.338 148.07C257.823 148.07 258.198 148.203 258.463 148.469C258.737 148.734 258.873 149.113 258.873 149.605C258.873 150.074 258.737 150.445 258.463 150.719C258.198 150.984 257.823 151.117 257.338 151.117C256.838 151.117 256.452 150.984 256.178 150.719C255.913 150.445 255.78 150.074 255.78 149.605ZM271.454 162.309C271.454 163.574 270.993 164.547 270.071 165.227C269.149 165.898 267.829 166.234 266.11 166.234C264.384 166.234 262.997 165.973 261.95 165.449V163.07C263.473 163.773 264.891 164.125 266.204 164.125C267.899 164.125 268.747 163.613 268.747 162.59C268.747 162.262 268.653 161.988 268.466 161.77C268.278 161.551 267.97 161.324 267.54 161.09C267.11 160.855 266.513 160.59 265.747 160.293C264.255 159.715 263.243 159.137 262.712 158.559C262.188 157.98 261.927 157.23 261.927 156.309C261.927 155.199 262.372 154.34 263.263 153.73C264.161 153.113 265.38 152.805 266.919 152.805C268.442 152.805 269.884 153.113 271.243 153.73L270.352 155.805C268.954 155.227 267.778 154.938 266.825 154.938C265.372 154.938 264.645 155.352 264.645 156.18C264.645 156.586 264.833 156.93 265.208 157.211C265.591 157.492 266.419 157.879 267.692 158.371C268.763 158.785 269.54 159.164 270.024 159.508C270.509 159.852 270.868 160.25 271.102 160.703C271.337 161.148 271.454 161.684 271.454 162.309ZM279.37 164.008C280.042 164.008 280.714 163.902 281.386 163.691V165.766C281.081 165.898 280.687 166.008 280.202 166.094C279.726 166.188 279.23 166.234 278.714 166.234C276.105 166.234 274.8 164.859 274.8 162.109V155.125H273.03V153.906L274.929 152.898L275.866 150.156H277.566V153.039H281.257V155.125H277.566V162.062C277.566 162.727 277.73 163.219 278.058 163.539C278.394 163.852 278.831 164.008 279.37 164.008ZM301.051 166L299.375 159.953C299.172 159.312 298.805 157.824 298.273 155.488H298.168C297.715 157.598 297.355 159.094 297.09 159.977L295.367 166H292.32L288.688 153.039H291.5L293.152 159.426C293.527 161.004 293.793 162.355 293.949 163.48H294.02C294.098 162.91 294.215 162.258 294.371 161.523C294.535 160.781 294.676 160.227 294.793 159.859L296.762 153.039H299.785L301.695 159.859C301.812 160.242 301.957 160.828 302.129 161.617C302.309 162.406 302.414 163.02 302.445 163.457H302.539C302.656 162.496 302.93 161.152 303.359 159.426L305.035 153.039H307.801L304.145 166H301.051ZM312.893 166H310.139V153.039H312.893V166ZM309.975 149.605C309.975 149.113 310.108 148.734 310.373 148.469C310.647 148.203 311.034 148.07 311.534 148.07C312.018 148.07 312.393 148.203 312.659 148.469C312.932 148.734 313.069 149.113 313.069 149.605C313.069 150.074 312.932 150.445 312.659 150.719C312.393 150.984 312.018 151.117 311.534 151.117C311.034 151.117 310.647 150.984 310.373 150.719C310.108 150.445 309.975 150.074 309.975 149.605ZM321.77 164.008C322.442 164.008 323.114 163.902 323.786 163.691V165.766C323.481 165.898 323.087 166.008 322.602 166.094C322.126 166.188 321.63 166.234 321.114 166.234C318.505 166.234 317.2 164.859 317.2 162.109V155.125H315.43V153.906L317.329 152.898L318.266 150.156H319.966V153.039H323.657V155.125H319.966V162.062C319.966 162.727 320.13 163.219 320.458 163.539C320.794 163.852 321.231 164.008 321.77 164.008ZM337.89 166H335.124V158.031C335.124 157.031 334.921 156.285 334.515 155.793C334.116 155.301 333.48 155.055 332.605 155.055C331.448 155.055 330.597 155.402 330.05 156.098C329.511 156.785 329.241 157.941 329.241 159.566V166H326.488V147.766H329.241V152.395C329.241 153.137 329.195 153.93 329.101 154.773H329.277C329.652 154.148 330.171 153.664 330.835 153.32C331.507 152.977 332.288 152.805 333.179 152.805C336.32 152.805 337.89 154.387 337.89 157.551V166ZM31.3266 180.836H33.2719C34.5766 180.836 35.5219 180.594 36.1078 180.109C36.6938 179.625 36.9867 178.906 36.9867 177.953C36.9867 176.984 36.6703 176.289 36.0375 175.867C35.4047 175.445 34.4516 175.234 33.1781 175.234H31.3266V180.836ZM31.3266 183.156V190H28.5258V172.867H33.3656C35.5766 172.867 37.2133 173.281 38.2758 174.109C39.3383 174.938 39.8695 176.188 39.8695 177.859C39.8695 179.992 38.7602 181.512 36.5414 182.418L41.3813 190H38.1938L34.0922 183.156H31.3266ZM49.3445 190.234C47.3289 190.234 45.7508 189.648 44.6102 188.477C43.4773 187.297 42.9109 185.676 42.9109 183.613C42.9109 181.496 43.4383 179.832 44.493 178.621C45.5477 177.41 46.9969 176.805 48.8406 176.805C50.5516 176.805 51.9031 177.324 52.8953 178.363C53.8875 179.402 54.3836 180.832 54.3836 182.652V184.141H45.7469C45.7859 185.398 46.1258 186.367 46.7664 187.047C47.407 187.719 48.3094 188.055 49.4734 188.055C50.2391 188.055 50.95 187.984 51.6063 187.844C52.2703 187.695 52.9813 187.453 53.7391 187.117V189.355C53.0672 189.676 52.3875 189.902 51.7 190.035C51.0125 190.168 50.2273 190.234 49.3445 190.234ZM48.8406 178.891C47.9656 178.891 47.2625 179.168 46.7313 179.723C46.2078 180.277 45.8953 181.086 45.7938 182.148H51.6766C51.6609 181.078 51.4031 180.27 50.9031 179.723C50.4031 179.168 49.7156 178.891 48.8406 178.891ZM65.7219 190L65.1711 188.195H65.0774C64.4524 188.984 63.8234 189.523 63.1906 189.812C62.5578 190.094 61.7453 190.234 60.7531 190.234C59.4797 190.234 58.4836 189.891 57.7649 189.203C57.0539 188.516 56.6984 187.543 56.6984 186.285C56.6984 184.949 57.1945 183.941 58.1867 183.262C59.1789 182.582 60.6906 182.211 62.7219 182.148L64.9602 182.078V181.387C64.9602 180.559 64.7649 179.941 64.3742 179.535C63.9914 179.121 63.3938 178.914 62.5813 178.914C61.9172 178.914 61.2805 179.012 60.6711 179.207C60.0617 179.402 59.4758 179.633 58.9133 179.898L58.0227 177.93C58.7258 177.562 59.4953 177.285 60.3313 177.098C61.1672 176.902 61.9563 176.805 62.6984 176.805C64.3469 176.805 65.5891 177.164 66.425 177.883C67.2688 178.602 67.6906 179.73 67.6906 181.27V190H65.7219ZM61.6203 188.125C62.6203 188.125 63.4211 187.848 64.0227 187.293C64.632 186.73 64.9367 185.945 64.9367 184.938V183.812L63.2727 183.883C61.9758 183.93 61.0305 184.148 60.4367 184.539C59.8508 184.922 59.5578 185.512 59.5578 186.309C59.5578 186.887 59.7297 187.336 60.0734 187.656C60.4172 187.969 60.9328 188.125 61.6203 188.125ZM74.3883 190H71.6344V171.766H74.3883V190ZM100.873 190H97.8266L94.9203 179.781C94.7953 179.336 94.6391 178.695 94.4516 177.859C94.2641 177.016 94.1508 176.43 94.1117 176.102C94.0336 176.602 93.9047 177.25 93.725 178.047C93.5531 178.844 93.4086 179.438 93.2914 179.828L90.4555 190H87.4086L85.1938 181.422L82.9438 172.867H85.8031L88.2523 182.852C88.6352 184.453 88.9086 185.867 89.0727 187.094C89.1586 186.43 89.2875 185.688 89.4594 184.867C89.6313 184.047 89.7875 183.383 89.9281 182.875L92.7172 172.867H95.4945L98.3539 182.922C98.6273 183.852 98.9164 185.242 99.2211 187.094C99.3383 185.977 99.6195 184.555 100.065 182.828L102.502 172.867H105.338L100.873 190ZM119.079 183.496C119.079 185.613 118.536 187.266 117.45 188.453C116.364 189.641 114.852 190.234 112.915 190.234C111.704 190.234 110.634 189.961 109.704 189.414C108.774 188.867 108.059 188.082 107.559 187.059C107.059 186.035 106.809 184.848 106.809 183.496C106.809 181.395 107.348 179.754 108.427 178.574C109.505 177.395 111.024 176.805 112.985 176.805C114.86 176.805 116.345 177.41 117.438 178.621C118.532 179.824 119.079 181.449 119.079 183.496ZM109.645 183.496C109.645 186.488 110.751 187.984 112.962 187.984C115.149 187.984 116.243 186.488 116.243 183.496C116.243 180.535 115.141 179.055 112.938 179.055C111.782 179.055 110.942 179.438 110.419 180.203C109.903 180.969 109.645 182.066 109.645 183.496ZM128.929 176.805C129.484 176.805 129.941 176.844 130.3 176.922L130.03 179.488C129.64 179.395 129.234 179.348 128.812 179.348C127.71 179.348 126.816 179.707 126.128 180.426C125.448 181.145 125.109 182.078 125.109 183.227V190H122.355V177.039H124.511L124.874 179.324H125.015C125.445 178.551 126.003 177.938 126.691 177.484C127.386 177.031 128.132 176.805 128.929 176.805ZM135.568 190H132.814V171.766H135.568V190ZM143.988 190.234C142.371 190.234 141.109 189.648 140.203 188.477C139.297 187.305 138.844 185.66 138.844 183.543C138.844 181.418 139.301 179.766 140.215 178.586C141.137 177.398 142.41 176.805 144.035 176.805C145.738 176.805 147.035 177.434 147.926 178.691H148.066C147.934 177.762 147.867 177.027 147.867 176.488V171.766H150.633V190H148.477L147.996 188.301H147.867C146.984 189.59 145.691 190.234 143.988 190.234ZM144.727 188.008C145.859 188.008 146.684 187.691 147.199 187.059C147.715 186.418 147.98 185.383 147.996 183.953V183.566C147.996 181.934 147.73 180.773 147.199 180.086C146.668 179.398 145.836 179.055 144.703 179.055C143.734 179.055 142.988 179.449 142.465 180.238C141.941 181.02 141.68 182.137 141.68 183.59C141.68 185.027 141.934 186.125 142.441 186.883C142.949 187.633 143.711 188.008 144.727 188.008ZM175.231 181.27C175.231 184.098 174.446 186.262 172.876 187.762C171.305 189.254 169.044 190 166.091 190H161.298V172.867H166.595C169.321 172.867 171.442 173.602 172.958 175.07C174.473 176.539 175.231 178.605 175.231 181.27ZM172.278 181.363C172.278 177.262 170.36 175.211 166.524 175.211H164.098V187.645H166.091C170.216 187.645 172.278 185.551 172.278 181.363ZM186.839 190L186.288 188.195H186.195C185.57 188.984 184.941 189.523 184.308 189.812C183.675 190.094 182.863 190.234 181.87 190.234C180.597 190.234 179.601 189.891 178.882 189.203C178.171 188.516 177.816 187.543 177.816 186.285C177.816 184.949 178.312 183.941 179.304 183.262C180.296 182.582 181.808 182.211 183.839 182.148L186.077 182.078V181.387C186.077 180.559 185.882 179.941 185.491 179.535C185.109 179.121 184.511 178.914 183.698 178.914C183.034 178.914 182.398 179.012 181.788 179.207C181.179 179.402 180.593 179.633 180.03 179.898L179.14 177.93C179.843 177.562 180.613 177.285 181.448 177.098C182.284 176.902 183.073 176.805 183.816 176.805C185.464 176.805 186.706 177.164 187.542 177.883C188.386 178.602 188.808 179.73 188.808 181.27V190H186.839ZM182.738 188.125C183.738 188.125 184.538 187.848 185.14 187.293C185.749 186.73 186.054 185.945 186.054 184.938V183.812L184.39 183.883C183.093 183.93 182.148 184.148 181.554 184.539C180.968 184.922 180.675 185.512 180.675 186.309C180.675 186.887 180.847 187.336 181.191 187.656C181.534 187.969 182.05 188.125 182.738 188.125ZM197.58 188.008C198.252 188.008 198.923 187.902 199.595 187.691V189.766C199.291 189.898 198.896 190.008 198.412 190.094C197.935 190.188 197.439 190.234 196.923 190.234C194.314 190.234 193.009 188.859 193.009 186.109V179.125H191.24V177.906L193.138 176.898L194.076 174.156H195.775V177.039H199.466V179.125H195.775V186.062C195.775 186.727 195.939 187.219 196.267 187.539C196.603 187.852 197.041 188.008 197.58 188.008ZM210.406 190L209.855 188.195H209.762C209.137 188.984 208.508 189.523 207.875 189.812C207.242 190.094 206.43 190.234 205.438 190.234C204.164 190.234 203.168 189.891 202.449 189.203C201.738 188.516 201.383 187.543 201.383 186.285C201.383 184.949 201.879 183.941 202.871 183.262C203.863 182.582 205.375 182.211 207.406 182.148L209.645 182.078V181.387C209.645 180.559 209.449 179.941 209.059 179.535C208.676 179.121 208.078 178.914 207.266 178.914C206.602 178.914 205.965 179.012 205.355 179.207C204.746 179.402 204.16 179.633 203.598 179.898L202.707 177.93C203.41 177.562 204.18 177.285 205.016 177.098C205.852 176.902 206.641 176.805 207.383 176.805C209.031 176.805 210.273 177.164 211.109 177.883C211.953 178.602 212.375 179.73 212.375 181.27V190H210.406ZM206.305 188.125C207.305 188.125 208.105 187.848 208.707 187.293C209.316 186.73 209.621 185.945 209.621 184.938V183.812L207.957 183.883C206.66 183.93 205.715 184.148 205.121 184.539C204.535 184.922 204.242 185.512 204.242 186.309C204.242 186.887 204.414 187.336 204.758 187.656C205.102 187.969 205.617 188.125 206.305 188.125ZM234.29 178.047C234.29 179.836 233.704 181.207 232.532 182.16C231.36 183.113 229.692 183.59 227.528 183.59H225.747V190H222.946V172.867H227.88C230.02 172.867 231.622 173.305 232.684 174.18C233.755 175.055 234.29 176.344 234.29 178.047ZM225.747 181.234H227.235C228.673 181.234 229.727 180.984 230.399 180.484C231.071 179.984 231.407 179.203 231.407 178.141C231.407 177.156 231.106 176.422 230.505 175.938C229.903 175.453 228.966 175.211 227.692 175.211H225.747V181.234ZM244.093 176.805C244.648 176.805 245.105 176.844 245.464 176.922L245.195 179.488C244.804 179.395 244.398 179.348 243.976 179.348C242.874 179.348 241.98 179.707 241.292 180.426C240.613 181.145 240.273 182.078 240.273 183.227V190H237.519V177.039H239.675L240.038 179.324H240.179C240.609 178.551 241.167 177.938 241.855 177.484C242.55 177.031 243.296 176.805 244.093 176.805ZM259.474 183.496C259.474 185.613 258.931 187.266 257.845 188.453C256.759 189.641 255.248 190.234 253.31 190.234C252.099 190.234 251.029 189.961 250.099 189.414C249.17 188.867 248.455 188.082 247.955 187.059C247.455 186.035 247.205 184.848 247.205 183.496C247.205 181.395 247.744 179.754 248.822 178.574C249.9 177.395 251.42 176.805 253.38 176.805C255.255 176.805 256.74 177.41 257.834 178.621C258.927 179.824 259.474 181.449 259.474 183.496ZM250.041 183.496C250.041 186.488 251.146 187.984 253.357 187.984C255.545 187.984 256.638 186.488 256.638 183.496C256.638 180.535 255.537 179.055 253.334 179.055C252.177 179.055 251.338 179.438 250.814 180.203C250.298 180.969 250.041 182.066 250.041 183.496ZM261.426 195.766C260.598 195.766 259.91 195.668 259.363 195.473V193.293C259.895 193.434 260.438 193.504 260.992 193.504C262.164 193.504 262.75 192.84 262.75 191.512V177.039H265.504V191.699C265.504 193.035 265.152 194.047 264.449 194.734C263.754 195.422 262.746 195.766 261.426 195.766ZM262.586 173.605C262.586 173.113 262.719 172.734 262.984 172.469C263.258 172.203 263.645 172.07 264.145 172.07C264.629 172.07 265.004 172.203 265.27 172.469C265.543 172.734 265.68 173.113 265.68 173.605C265.68 174.074 265.543 174.445 265.27 174.719C265.004 174.984 264.629 175.117 264.145 175.117C263.645 175.117 263.258 174.984 262.984 174.719C262.719 174.445 262.586 174.074 262.586 173.605ZM275.213 190.234C273.198 190.234 271.62 189.648 270.479 188.477C269.346 187.297 268.78 185.676 268.78 183.613C268.78 181.496 269.307 179.832 270.362 178.621C271.416 177.41 272.866 176.805 274.709 176.805C276.42 176.805 277.772 177.324 278.764 178.363C279.756 179.402 280.252 180.832 280.252 182.652V184.141H271.616C271.655 185.398 271.995 186.367 272.635 187.047C273.276 187.719 274.178 188.055 275.342 188.055C276.108 188.055 276.819 187.984 277.475 187.844C278.139 187.695 278.85 187.453 279.608 187.117V189.355C278.936 189.676 278.256 189.902 277.569 190.035C276.881 190.168 276.096 190.234 275.213 190.234ZM274.709 178.891C273.834 178.891 273.131 179.168 272.6 179.723C272.077 180.277 271.764 181.086 271.663 182.148H277.545C277.53 181.078 277.272 180.27 276.772 179.723C276.272 179.168 275.584 178.891 274.709 178.891ZM288.708 190.234C286.747 190.234 285.255 189.664 284.231 188.523C283.216 187.375 282.708 185.73 282.708 183.59C282.708 181.41 283.239 179.734 284.302 178.562C285.372 177.391 286.915 176.805 288.93 176.805C290.298 176.805 291.528 177.059 292.622 177.566L291.79 179.781C290.626 179.328 289.665 179.102 288.907 179.102C286.665 179.102 285.544 180.59 285.544 183.566C285.544 185.02 285.821 186.113 286.376 186.848C286.938 187.574 287.759 187.938 288.837 187.938C290.063 187.938 291.223 187.633 292.317 187.023V189.426C291.825 189.715 291.298 189.922 290.735 190.047C290.18 190.172 289.505 190.234 288.708 190.234ZM300.292 188.008C300.964 188.008 301.636 187.902 302.308 187.691V189.766C302.003 189.898 301.609 190.008 301.124 190.094C300.648 190.188 300.152 190.234 299.636 190.234C297.027 190.234 295.722 188.859 295.722 186.109V179.125H293.952V177.906L295.851 176.898L296.788 174.156H298.488V177.039H302.179V179.125H298.488V186.062C298.488 186.727 298.652 187.219 298.98 187.539C299.316 187.852 299.753 188.008 300.292 188.008ZM313.716 186.309C313.716 187.574 313.255 188.547 312.334 189.227C311.412 189.898 310.091 190.234 308.373 190.234C306.646 190.234 305.259 189.973 304.212 189.449V187.07C305.736 187.773 307.154 188.125 308.466 188.125C310.162 188.125 311.009 187.613 311.009 186.59C311.009 186.262 310.916 185.988 310.728 185.77C310.541 185.551 310.232 185.324 309.802 185.09C309.373 184.855 308.775 184.59 308.009 184.293C306.517 183.715 305.505 183.137 304.974 182.559C304.451 181.98 304.189 181.23 304.189 180.309C304.189 179.199 304.634 178.34 305.525 177.73C306.423 177.113 307.642 176.805 309.181 176.805C310.705 176.805 312.146 177.113 313.505 177.73L312.615 179.805C311.216 179.227 310.041 178.938 309.087 178.938C307.634 178.938 306.908 179.352 306.908 180.18C306.908 180.586 307.095 180.93 307.47 181.211C307.853 181.492 308.681 181.879 309.955 182.371C311.025 182.785 311.802 183.164 312.287 183.508C312.771 183.852 313.13 184.25 313.365 184.703C313.599 185.148 313.716 185.684 313.716 186.309Z" fill="#4E4E4E"/>
<g clip-path="url(#clip0)">
<path d="M228.881 117.26L226.287 117.26L225.054 107.209L228.881 107.21L228.881 117.26Z" fill="#FFB8B8"/>
<path d="M229.542 119.786L221.18 119.785V119.679C221.18 118.812 221.523 117.98 222.134 117.367C222.744 116.754 223.572 116.409 224.435 116.409H224.435L229.542 116.409L229.542 119.786Z" fill="#2F2E41"/>
<path d="M240.325 110.854L238.642 112.836L230.233 107.256L232.717 104.33L240.325 110.854Z" fill="#FFB8B8"/>
<path d="M242.667 111.988L237.239 118.379L237.159 118.31C236.502 117.747 236.095 116.945 236.027 116.081C235.959 115.216 236.235 114.36 236.796 113.7L236.796 113.7L240.111 109.796L242.667 111.988Z" fill="#2F2E41"/>
<path d="M210.468 67.8348L209.661 75.3149L242.291 74.8472L228.061 51.549L216.442 51.1296L210.468 67.8348Z" fill="#2F2E41"/>
<path opacity="0.28" d="M210.468 67.8348L209.661 75.3149L242.291 74.8472L228.061 51.549L216.442 51.1296L210.468 67.8348Z" fill="black"/>
<path d="M216.885 69.1191L215.733 75.9633V82.0811L225.021 85.1273C225.021 85.1273 223.933 108.89 225.383 110.403L225.347 114.057L229.399 114.242L229.432 111.671L231.15 92.4512L232.162 78.3403L230.521 67.6418L216.885 69.1191Z" fill="#2F2E41"/>
<path d="M224.08 75.0107L215.733 82.0812C215.733 82.0812 215.244 94.8376 216.485 96.3336C217.55 97.6185 231.41 108.702 231.41 108.702C231.41 108.702 233.873 110.972 235.253 111.008C236.634 111.044 238.239 108.135 238.239 108.135L235.042 105.694C235.042 105.694 226.76 97.9263 224.301 94.8376C223.309 93.591 223.309 93.4663 223.309 93.4663L223.648 88.282L227.059 78.6605L224.08 75.0107Z" fill="#2F2E41"/>
<path d="M215.218 41.1433L211.618 40.8091L208.354 41.3557L201.441 41.358L200.852 46.3923L207.16 47.8108L208.698 47.0537L215.106 49.5071L215.218 41.1433Z" fill="#2F2E41"/>
<path d="M219.516 41.1277C219.516 41.1277 227.155 40.4085 228.892 41.7798C230.629 43.1512 234.351 70.3283 234.351 70.3283L219.516 71.1695L216.857 69.331L217.612 55.7631L219.516 41.1277Z" fill="#CCCCCC"/>
<path d="M221.848 40.9583L213.422 41.1441L205.567 76.8107L211.77 78.1822L221.848 40.9583Z" fill="#2F2E41"/>
<path d="M227.838 40.657L234.475 42.7443L234.098 57.3986L242.291 74.9189L232.659 75.9384L225.046 57.0197L227.838 40.657Z" fill="#2F2E41"/>
<path d="M238.782 76.6984C239.015 76.4926 239.2 76.238 239.324 75.9526C239.448 75.6672 239.509 75.3579 239.501 75.0465C239.493 74.7351 239.418 74.4292 239.28 74.1503C239.142 73.8714 238.944 73.6263 238.702 73.4323L240.037 68.7519L237.404 67.2429L235.611 73.8791C235.314 74.3101 235.184 74.8357 235.247 75.3564C235.309 75.877 235.56 76.3565 235.95 76.704C236.341 77.0516 236.845 77.2429 237.367 77.2419C237.889 77.2409 238.393 77.0475 238.782 76.6984Z" fill="#FFB8B8"/>
<path d="M230.629 43.1511L234.556 42.8088C234.556 42.8088 238.082 46.514 238.884 49.3829C239.686 52.2517 240.554 61.2277 240.554 61.2277L240.192 74.3586L235.601 71.2262L235.293 59.9319L230.629 43.1511Z" fill="#2F2E41"/>
<path d="M229.681 36.5512C231.156 33.8404 230.165 30.4417 227.467 28.9599C224.769 27.478 221.387 28.4743 219.912 31.185C218.437 33.8958 219.429 37.2945 222.126 38.7763C224.824 40.2582 228.207 39.2619 229.681 36.5512Z" fill="#FFB8B8"/>
<path d="M224.176 31.5329C223.445 31.3633 222.687 31.5512 221.947 31.673C221.208 31.7948 220.392 31.835 219.767 31.4202C219.304 31.1139 219.02 30.6072 218.754 30.1198C218.642 29.9457 218.568 29.7504 218.536 29.546C218.504 29.1855 218.732 28.8566 218.975 28.589C220.1 27.3457 221.745 26.6652 223.404 26.449C224.772 26.2441 226.17 26.4156 227.449 26.9453C228.708 27.5003 229.791 28.5166 230.286 29.8056C230.514 30.4654 230.656 31.1519 230.71 31.8482C230.784 32.3606 230.794 32.8804 230.738 33.3952C230.672 33.7768 230.572 34.1518 230.44 34.5159L229.62 37.0042C229.561 37.2393 229.451 37.4584 229.297 37.6456C229.218 37.7373 229.112 37.8009 228.994 37.8268C228.877 37.8527 228.754 37.8396 228.644 37.7894C228.71 37.5192 228.72 37.2383 228.673 36.964C228.648 36.8273 228.582 36.7014 228.484 36.6026C228.387 36.5039 228.262 36.4367 228.126 36.4097C227.824 36.3775 227.566 36.6129 227.279 36.7144C227.148 36.7534 227.01 36.7662 226.874 36.7518C226.738 36.7375 226.606 36.6963 226.486 36.6307C226.365 36.5651 226.259 36.4763 226.173 36.3695C226.087 36.2626 226.022 36.1397 225.983 36.0079C225.976 35.9813 225.969 35.9544 225.963 35.9273C225.918 35.6428 225.994 35.3382 225.887 35.0711C225.761 34.7581 225.427 34.5941 225.177 34.3692C224.948 34.1572 224.785 33.8841 224.705 33.582C224.626 33.2798 224.634 32.9612 224.729 32.6635C224.796 32.4564 224.985 32.3623 224.947 32.1244C224.898 31.8123 224.44 31.5941 224.176 31.5329Z" fill="#2F2E41"/>
<path d="M162.283 55.1783H92V11H162.283V55.1783Z" fill="white"/>
<path d="M162.283 55.1783H92V11H162.283V55.1783ZM92.3209 54.8559H161.962V11.3225H92.3209V54.8559Z" fill="#3F3D56"/>
<path d="M153.699 116.367H113.583V72.1887H153.699V116.367Z" fill="white"/>
<path d="M153.699 116.367H113.583V72.1887H153.699V116.367ZM113.903 116.045H153.378V72.5112H113.903V116.045Z" fill="#3F3D56"/>
<path d="M148.243 112.195H139.899V112.534H148.243V112.195Z" fill="#3F3D56"/>
<path d="M148.243 113.214H139.899V113.554H148.243V113.214Z" fill="#3F3D56"/>
<path d="M148.243 114.234H139.899V114.574H148.243V114.234Z" fill="#3F3D56"/>
<path d="M133.641 80.0891V83.6363C135.735 83.6363 137.783 84.2604 139.524 85.4297C141.266 86.599 142.623 88.261 143.425 90.2054C144.227 92.1499 144.436 94.2896 144.028 96.3538C143.619 98.4181 142.61 100.314 141.129 101.802L143.625 104.311C145.6 102.326 146.945 99.7982 147.49 97.0458C148.035 94.2935 147.755 91.4406 146.686 88.848C145.618 86.2554 143.808 84.0394 141.486 82.4803C139.163 80.9213 136.433 80.0891 133.641 80.0891Z" fill="#E6E6E6"/>
<path d="M143.625 104.311L141.129 101.802C139.319 103.622 136.913 104.721 134.358 104.895C131.803 105.069 129.272 104.307 127.233 102.749L125.096 105.574C127.815 107.65 131.19 108.666 134.597 108.434C138.003 108.202 141.211 106.737 143.625 104.311Z" fill="#575A89"/>
<path d="M123.05 94.2778C123.05 92.8803 123.324 91.4965 123.856 90.2054C124.388 88.9144 125.168 87.7412 126.152 86.7531C127.135 85.7649 128.303 84.9811 129.588 84.4463C130.873 83.9115 132.25 83.6363 133.641 83.6363V80.0891C130.684 80.0891 127.803 81.0212 125.402 82.7541C123.001 84.487 121.202 86.9332 120.259 89.748C119.315 92.5628 119.274 95.6042 120.142 98.4436C121.01 101.283 122.743 103.777 125.096 105.574L127.233 102.749C125.932 101.758 124.877 100.477 124.152 99.007C123.426 97.5372 123.049 95.9185 123.05 94.2778Z" fill="#519ED5"/>
<path d="M213.07 88.9572H172.954V44.7788H213.07V88.9572Z" fill="white"/>
<path d="M213.07 88.9572H172.954V44.7788H213.07V88.9572ZM173.275 88.6348H212.75V45.1013H173.275V88.6348Z" fill="#3F3D56"/>
<path d="M185.952 71.7856H178.731V83.3946H185.952V71.7856Z" fill="#575A89"/>
<path d="M196.382 63.885H189.161V83.3944H196.382V63.885Z" fill="#E6E6E6"/>
<path d="M206.812 54.6946H199.591V83.3944H206.812V54.6946Z" fill="#519ED5"/>
<path d="M209.219 83.717H176.806V50.0188H177.126V83.3945H209.219V83.717Z" fill="#3F3D56"/>
<path d="M201.404 45.9548C202.625 45.9548 203.615 44.9606 203.615 43.7341C203.615 42.5077 202.625 41.5134 201.404 41.5134C200.184 41.5134 199.194 42.5077 199.194 43.7341C199.194 44.9606 200.184 45.9548 201.404 45.9548Z" fill="#FFB8B8"/>
<path d="M246.816 120H212.375C212.326 120 212.279 119.981 212.245 119.946C212.21 119.911 212.191 119.864 212.191 119.815C212.191 119.766 212.21 119.719 212.245 119.684C212.279 119.649 212.326 119.63 212.375 119.63H246.816C246.865 119.63 246.912 119.649 246.946 119.684C246.981 119.719 247 119.766 247 119.815C247 119.864 246.981 119.911 246.946 119.946C246.912 119.981 246.865 120 246.816 120Z" fill="#CCCCCC"/>
<path d="M152.523 45.9389H101.761C101.719 45.9389 101.678 45.9221 101.648 45.8922C101.619 45.8622 101.602 45.8216 101.602 45.7793V21.3322C101.602 21.2899 101.619 21.2493 101.648 21.2194C101.678 21.1894 101.719 21.1726 101.761 21.1726C101.803 21.1726 101.843 21.1894 101.873 21.2194C101.903 21.2493 101.92 21.2899 101.92 21.3322V45.6197H152.523C152.544 45.6196 152.564 45.6237 152.584 45.6317C152.603 45.6397 152.621 45.6514 152.635 45.6662C152.65 45.6811 152.662 45.6987 152.67 45.7181C152.678 45.7375 152.682 45.7583 152.682 45.7793C152.682 45.8003 152.678 45.8211 152.67 45.8405C152.662 45.8599 152.65 45.8775 152.635 45.8924C152.621 45.9072 152.603 45.9189 152.584 45.9269C152.564 45.9349 152.544 45.939 152.523 45.9389Z" fill="#3F3D56"/>
<path d="M112.606 44.1831H107.989C107.864 44.1829 107.744 44.133 107.656 44.0441C107.568 43.9553 107.518 43.8349 107.518 43.7093V37.3141C107.518 37.1885 107.568 37.0681 107.656 36.9793C107.744 36.8904 107.864 36.8405 107.989 36.8403H112.606C112.731 36.8405 112.851 36.8904 112.94 36.9793C113.028 37.0681 113.078 37.1885 113.078 37.3141V43.7093C113.078 43.8349 113.028 43.9553 112.94 44.0441C112.851 44.133 112.731 44.1829 112.606 44.1831Z" fill="#519ED5"/>
<path d="M121.026 44.1831H116.409C116.284 44.183 116.164 44.133 116.076 44.0442C115.987 43.9554 115.938 43.835 115.937 43.7093V31.2485C115.938 31.1228 115.987 31.0024 116.076 30.9136C116.164 30.8248 116.284 30.7748 116.409 30.7747H121.026C121.151 30.7748 121.271 30.8248 121.359 30.9136C121.448 31.0024 121.497 31.1228 121.498 31.2485V43.7093C121.497 43.835 121.448 43.9554 121.359 44.0442C121.271 44.133 121.151 44.183 121.026 44.1831Z" fill="#519ED5"/>
<path d="M129.446 44.1831H124.829C124.704 44.1829 124.584 44.133 124.495 44.0441C124.407 43.9553 124.357 43.8349 124.357 43.7093V37.3141C124.357 37.1885 124.407 37.0681 124.495 36.9793C124.584 36.8904 124.704 36.8405 124.829 36.8403H129.446C129.571 36.8405 129.691 36.8904 129.779 36.9793C129.867 37.0681 129.917 37.1885 129.917 37.3141V43.7093C129.917 43.8349 129.867 43.9553 129.779 44.0441C129.691 44.133 129.571 44.1829 129.446 44.1831Z" fill="#519ED5"/>
<path d="M137.865 44.1831H133.248C133.126 44.1857 133.008 44.1396 132.92 44.0548C132.831 43.97 132.78 43.8535 132.777 43.7307V28.8326C132.78 28.7098 132.831 28.5933 132.92 28.5085C133.008 28.4237 133.126 28.3776 133.248 28.3802H137.865C137.987 28.3776 138.106 28.4237 138.194 28.5085C138.283 28.5933 138.334 28.7098 138.337 28.8326V43.7307C138.334 43.8535 138.283 43.97 138.194 44.0548C138.106 44.1396 137.987 44.1857 137.865 44.1831Z" fill="#519ED5"/>
<path d="M146.285 44.183H141.668C141.543 44.1829 141.423 44.1329 141.335 44.0441C141.246 43.9553 141.197 43.8348 141.196 43.7092V24.5441C141.197 24.4185 141.246 24.2981 141.335 24.2092C141.423 24.1204 141.543 24.0705 141.668 24.0703H146.285C146.41 24.0705 146.53 24.1204 146.618 24.2092C146.707 24.2981 146.756 24.4185 146.757 24.5441V43.7092C146.756 43.8348 146.707 43.9553 146.618 44.0441C146.53 44.1329 146.41 44.1829 146.285 44.183Z" fill="#519ED5"/>
<path d="M110.298 34.9248C110.824 34.9248 111.251 34.496 111.251 33.967C111.251 33.4381 110.824 33.0093 110.298 33.0093C109.771 33.0093 109.345 33.4381 109.345 33.967C109.345 34.496 109.771 34.9248 110.298 34.9248Z" fill="#3F3D56"/>
<path d="M118.717 28.6994C119.244 28.6994 119.671 28.2706 119.671 27.7417C119.671 27.2127 119.244 26.7839 118.717 26.7839C118.191 26.7839 117.764 27.2127 117.764 27.7417C117.764 28.2706 118.191 28.6994 118.717 28.6994Z" fill="#3F3D56"/>
<path d="M127.137 34.9248C127.664 34.9248 128.09 34.496 128.09 33.967C128.09 33.4381 127.664 33.0093 127.137 33.0093C126.611 33.0093 126.184 33.4381 126.184 33.967C126.184 34.496 126.611 34.9248 127.137 34.9248Z" fill="#3F3D56"/>
<path d="M135.557 25.6667C136.083 25.6667 136.51 25.2379 136.51 24.709C136.51 24.18 136.083 23.7512 135.557 23.7512C135.03 23.7512 134.604 24.18 134.604 24.709C134.604 25.2379 135.03 25.6667 135.557 25.6667Z" fill="#3F3D56"/>
<path d="M143.977 22.1548C144.503 22.1548 144.93 21.726 144.93 21.197C144.93 20.6681 144.503 20.2393 143.977 20.2393C143.45 20.2393 143.023 20.6681 143.023 21.197C143.023 21.726 143.45 22.1548 143.977 22.1548Z" fill="#3F3D56"/>
<path d="M127.157 34.1818L118.718 27.83L110.393 34.095L110.203 33.8394L118.718 27.431L127.117 33.7526L135.464 24.5746L135.498 24.5609L143.917 21.1521L144.036 21.4484L135.65 24.8435L127.157 34.1818Z" fill="#3F3D56"/>
</g>
<defs>
<clipPath id="clip0">
<rect width="155" height="109" fill="white" transform="translate(92 11)"/>
</clipPath>
</defs>
</svg>
