<svg width="341" height="196" viewBox="0 0 341 196" fill="none" xmlns="http://www.w3.org/2000/svg">
<path d="M16 20C16 8.9543 24.9543 0 36 0H308V111C308 122.046 299.046 131 288 131H16V20Z" fill="#519ED5"/>
<path d="M30.0578 166V148.867H32.8586V163.598H40.1125V166H30.0578ZM45.6266 166H42.8727V153.039H45.6266V166ZM42.7086 149.605C42.7086 149.113 42.8414 148.734 43.107 148.469C43.3805 148.203 43.7672 148.07 44.2672 148.07C44.7516 148.07 45.1266 148.203 45.3922 148.469C45.6656 148.734 45.8023 149.113 45.8023 149.605C45.8023 150.074 45.6656 150.445 45.3922 150.719C45.1266 150.984 44.7516 151.117 44.2672 151.117C43.7672 151.117 43.3805 150.984 43.107 150.719C42.8414 150.445 42.7086 150.074 42.7086 149.605ZM52.6289 166L47.707 153.039H50.6133L53.25 160.574C53.7031 161.84 53.9766 162.863 54.0703 163.645H54.1641C54.2344 163.082 54.5078 162.059 54.9844 160.574L57.6211 153.039H60.5508L55.6055 166H52.6289ZM68.2797 166.234C66.2641 166.234 64.6859 165.648 63.5453 164.477C62.4125 163.297 61.8461 161.676 61.8461 159.613C61.8461 157.496 62.3734 155.832 63.4281 154.621C64.4828 153.41 65.932 152.805 67.7758 152.805C69.4867 152.805 70.8383 153.324 71.8305 154.363C72.8227 155.402 73.3188 156.832 73.3188 158.652V160.141H64.682C64.7211 161.398 65.0609 162.367 65.7016 163.047C66.3422 163.719 67.2445 164.055 68.4086 164.055C69.1742 164.055 69.8852 163.984 70.5414 163.844C71.2055 163.695 71.9164 163.453 72.6742 163.117V165.355C72.0023 165.676 71.3227 165.902 70.6352 166.035C69.9477 166.168 69.1625 166.234 68.2797 166.234ZM67.7758 154.891C66.9008 154.891 66.1977 155.168 65.6664 155.723C65.143 156.277 64.8305 157.086 64.7289 158.148H70.6117C70.5961 157.078 70.3383 156.27 69.8383 155.723C69.3383 155.168 68.6508 154.891 67.7758 154.891ZM98.3859 157.41C98.3859 160.199 97.6867 162.367 96.2883 163.914C94.8977 165.461 92.925 166.234 90.3703 166.234C87.7844 166.234 85.7961 165.469 84.4055 163.938C83.0227 162.398 82.3313 160.215 82.3313 157.387C82.3313 154.559 83.0266 152.387 84.4172 150.871C85.8156 149.355 87.8078 148.598 90.3938 148.598C92.9406 148.598 94.9094 149.367 96.3 150.906C97.6906 152.445 98.3859 154.613 98.3859 157.41ZM85.3078 157.41C85.3078 159.52 85.7336 161.121 86.5852 162.215C87.4367 163.301 88.6984 163.844 90.3703 163.844C92.0344 163.844 93.2883 163.305 94.132 162.227C94.9836 161.148 95.4094 159.543 95.4094 157.41C95.4094 155.309 94.9875 153.715 94.1438 152.629C93.3078 151.543 92.0578 151 90.3938 151C88.7141 151 87.4445 151.543 86.5852 152.629C85.7336 153.715 85.3078 155.309 85.3078 157.41ZM113.275 166H110.509V158.031C110.509 157.031 110.306 156.285 109.9 155.793C109.502 155.301 108.865 155.055 107.99 155.055C106.826 155.055 105.974 155.398 105.435 156.086C104.896 156.773 104.627 157.926 104.627 159.543V166H101.873V153.039H104.029L104.416 154.738H104.556C104.947 154.121 105.502 153.645 106.22 153.309C106.939 152.973 107.736 152.805 108.611 152.805C111.72 152.805 113.275 154.387 113.275 157.551V166ZM119.961 166H117.207V147.766H119.961V166ZM126.764 166H124.01V153.039H126.764V166ZM123.846 149.605C123.846 149.113 123.979 148.734 124.245 148.469C124.518 148.203 124.905 148.07 125.405 148.07C125.889 148.07 126.264 148.203 126.53 148.469C126.803 148.734 126.94 149.113 126.94 149.605C126.94 150.074 126.803 150.445 126.53 150.719C126.264 150.984 125.889 151.117 125.405 151.117C124.905 151.117 124.518 150.984 124.245 150.719C123.979 150.445 123.846 150.074 123.846 149.605ZM142.216 166H139.45V158.031C139.45 157.031 139.247 156.285 138.841 155.793C138.442 155.301 137.805 155.055 136.93 155.055C135.766 155.055 134.915 155.398 134.376 156.086C133.837 156.773 133.567 157.926 133.567 159.543V166H130.813V153.039H132.97L133.356 154.738H133.497C133.888 154.121 134.442 153.645 135.161 153.309C135.88 152.973 136.677 152.805 137.552 152.805C140.661 152.805 142.216 154.387 142.216 157.551V166ZM151.808 166.234C149.792 166.234 148.214 165.648 147.073 164.477C145.941 163.297 145.374 161.676 145.374 159.613C145.374 157.496 145.902 155.832 146.956 154.621C148.011 153.41 149.46 152.805 151.304 152.805C153.015 152.805 154.366 153.324 155.359 154.363C156.351 155.402 156.847 156.832 156.847 158.652V160.141H148.21C148.249 161.398 148.589 162.367 149.23 163.047C149.87 163.719 150.773 164.055 151.937 164.055C152.702 164.055 153.413 163.984 154.07 163.844C154.734 163.695 155.445 163.453 156.202 163.117V165.355C155.53 165.676 154.851 165.902 154.163 166.035C153.476 166.168 152.691 166.234 151.808 166.234ZM151.304 154.891C150.429 154.891 149.726 155.168 149.195 155.723C148.671 156.277 148.359 157.086 148.257 158.148H154.14C154.124 157.078 153.866 156.27 153.366 155.723C152.866 155.168 152.179 154.891 151.304 154.891ZM175.117 162.309C175.117 163.574 174.656 164.547 173.734 165.227C172.812 165.898 171.492 166.234 169.773 166.234C168.047 166.234 166.66 165.973 165.613 165.449V163.07C167.137 163.773 168.555 164.125 169.867 164.125C171.562 164.125 172.41 163.613 172.41 162.59C172.41 162.262 172.316 161.988 172.129 161.77C171.941 161.551 171.633 161.324 171.203 161.09C170.773 160.855 170.176 160.59 169.41 160.293C167.918 159.715 166.906 159.137 166.375 158.559C165.852 157.98 165.59 157.23 165.59 156.309C165.59 155.199 166.035 154.34 166.926 153.73C167.824 153.113 169.043 152.805 170.582 152.805C172.105 152.805 173.547 153.113 174.906 153.73L174.016 155.805C172.617 155.227 171.441 154.938 170.488 154.938C169.035 154.938 168.309 155.352 168.309 156.18C168.309 156.586 168.496 156.93 168.871 157.211C169.254 157.492 170.082 157.879 171.355 158.371C172.426 158.785 173.203 159.164 173.688 159.508C174.172 159.852 174.531 160.25 174.766 160.703C175 161.148 175.117 161.684 175.117 162.309ZM183.866 166.234C181.85 166.234 180.272 165.648 179.131 164.477C177.998 163.297 177.432 161.676 177.432 159.613C177.432 157.496 177.959 155.832 179.014 154.621C180.069 153.41 181.518 152.805 183.362 152.805C185.073 152.805 186.424 153.324 187.416 154.363C188.409 155.402 188.905 156.832 188.905 158.652V160.141H180.268C180.307 161.398 180.647 162.367 181.288 163.047C181.928 163.719 182.83 164.055 183.995 164.055C184.76 164.055 185.471 163.984 186.127 163.844C186.791 163.695 187.502 163.453 188.26 163.117V165.355C187.588 165.676 186.909 165.902 186.221 166.035C185.534 166.168 184.748 166.234 183.866 166.234ZM183.362 154.891C182.487 154.891 181.784 155.168 181.252 155.723C180.729 156.277 180.416 157.086 180.315 158.148H186.198C186.182 157.078 185.924 156.27 185.424 155.723C184.924 155.168 184.237 154.891 183.362 154.891ZM200.841 162.309C200.841 163.574 200.38 164.547 199.458 165.227C198.536 165.898 197.216 166.234 195.497 166.234C193.77 166.234 192.384 165.973 191.337 165.449V163.07C192.86 163.773 194.278 164.125 195.591 164.125C197.286 164.125 198.134 163.613 198.134 162.59C198.134 162.262 198.04 161.988 197.852 161.77C197.665 161.551 197.356 161.324 196.927 161.09C196.497 160.855 195.899 160.59 195.134 160.293C193.641 159.715 192.63 159.137 192.098 158.559C191.575 157.98 191.313 157.23 191.313 156.309C191.313 155.199 191.759 154.34 192.649 153.73C193.548 153.113 194.766 152.805 196.305 152.805C197.829 152.805 199.27 153.113 200.63 153.73L199.739 155.805C198.341 155.227 197.165 154.938 196.212 154.938C194.759 154.938 194.032 155.352 194.032 156.18C194.032 156.586 194.22 156.93 194.595 157.211C194.977 157.492 195.805 157.879 197.079 158.371C198.149 158.785 198.927 159.164 199.411 159.508C199.895 159.852 200.255 160.25 200.489 160.703C200.723 161.148 200.841 161.684 200.841 162.309ZM212.636 162.309C212.636 163.574 212.175 164.547 211.253 165.227C210.331 165.898 209.011 166.234 207.292 166.234C205.566 166.234 204.179 165.973 203.132 165.449V163.07C204.655 163.773 206.073 164.125 207.386 164.125C209.081 164.125 209.929 163.613 209.929 162.59C209.929 162.262 209.835 161.988 209.648 161.77C209.46 161.551 209.152 161.324 208.722 161.09C208.292 160.855 207.695 160.59 206.929 160.293C205.437 159.715 204.425 159.137 203.894 158.559C203.37 157.98 203.109 157.23 203.109 156.309C203.109 155.199 203.554 154.34 204.445 153.73C205.343 153.113 206.562 152.805 208.101 152.805C209.624 152.805 211.066 153.113 212.425 153.73L211.534 155.805C210.136 155.227 208.96 154.938 208.007 154.938C206.554 154.938 205.827 155.352 205.827 156.18C205.827 156.586 206.015 156.93 206.39 157.211C206.773 157.492 207.601 157.879 208.874 158.371C209.945 158.785 210.722 159.164 211.206 159.508C211.691 159.852 212.05 160.25 212.284 160.703C212.519 161.148 212.636 161.684 212.636 162.309ZM218.478 166H215.724V153.039H218.478V166ZM215.56 149.605C215.56 149.113 215.693 148.734 215.959 148.469C216.232 148.203 216.619 148.07 217.119 148.07C217.603 148.07 217.978 148.203 218.244 148.469C218.517 148.734 218.654 149.113 218.654 149.605C218.654 150.074 218.517 150.445 218.244 150.719C217.978 150.984 217.603 151.117 217.119 151.117C216.619 151.117 216.232 150.984 215.959 150.719C215.693 150.445 215.56 150.074 215.56 149.605ZM234.023 159.496C234.023 161.613 233.48 163.266 232.395 164.453C231.309 165.641 229.797 166.234 227.859 166.234C226.648 166.234 225.578 165.961 224.648 165.414C223.719 164.867 223.004 164.082 222.504 163.059C222.004 162.035 221.754 160.848 221.754 159.496C221.754 157.395 222.293 155.754 223.371 154.574C224.449 153.395 225.969 152.805 227.93 152.805C229.805 152.805 231.289 153.41 232.383 154.621C233.477 155.824 234.023 157.449 234.023 159.496ZM224.59 159.496C224.59 162.488 225.695 163.984 227.906 163.984C230.094 163.984 231.188 162.488 231.188 159.496C231.188 156.535 230.086 155.055 227.883 155.055C226.727 155.055 225.887 155.438 225.363 156.203C224.848 156.969 224.59 158.066 224.59 159.496ZM248.702 166H245.936V158.031C245.936 157.031 245.733 156.285 245.327 155.793C244.928 155.301 244.291 155.055 243.416 155.055C242.252 155.055 241.401 155.398 240.862 156.086C240.323 156.773 240.053 157.926 240.053 159.543V166H237.299V153.039H239.455L239.842 154.738H239.983C240.373 154.121 240.928 153.645 241.647 153.309C242.366 152.973 243.163 152.805 244.038 152.805C247.147 152.805 248.702 154.387 248.702 157.551V166ZM261.341 162.309C261.341 163.574 260.88 164.547 259.958 165.227C259.036 165.898 257.716 166.234 255.997 166.234C254.27 166.234 252.884 165.973 251.837 165.449V163.07C253.36 163.773 254.778 164.125 256.091 164.125C257.786 164.125 258.634 163.613 258.634 162.59C258.634 162.262 258.54 161.988 258.352 161.77C258.165 161.551 257.856 161.324 257.427 161.09C256.997 160.855 256.399 160.59 255.634 160.293C254.141 159.715 253.13 159.137 252.598 158.559C252.075 157.98 251.813 157.23 251.813 156.309C251.813 155.199 252.259 154.34 253.149 153.73C254.048 153.113 255.266 152.805 256.805 152.805C258.329 152.805 259.77 153.113 261.13 153.73L260.239 155.805C258.841 155.227 257.665 154.938 256.712 154.938C255.259 154.938 254.532 155.352 254.532 156.18C254.532 156.586 254.72 156.93 255.095 157.211C255.477 157.492 256.305 157.879 257.579 158.371C258.649 158.785 259.427 159.164 259.911 159.508C260.395 159.852 260.755 160.25 260.989 160.703C261.223 161.148 261.341 161.684 261.341 162.309ZM278.873 166L278.322 164.195H278.228C277.603 164.984 276.974 165.523 276.341 165.812C275.709 166.094 274.896 166.234 273.904 166.234C272.63 166.234 271.634 165.891 270.916 165.203C270.205 164.516 269.849 163.543 269.849 162.285C269.849 160.949 270.345 159.941 271.338 159.262C272.33 158.582 273.841 158.211 275.873 158.148L278.111 158.078V157.387C278.111 156.559 277.916 155.941 277.525 155.535C277.142 155.121 276.545 154.914 275.732 154.914C275.068 154.914 274.431 155.012 273.822 155.207C273.213 155.402 272.627 155.633 272.064 155.898L271.173 153.93C271.877 153.562 272.646 153.285 273.482 153.098C274.318 152.902 275.107 152.805 275.849 152.805C277.498 152.805 278.74 153.164 279.576 153.883C280.42 154.602 280.841 155.73 280.841 157.27V166H278.873ZM274.771 164.125C275.771 164.125 276.572 163.848 277.173 163.293C277.783 162.73 278.088 161.945 278.088 160.938V159.812L276.423 159.883C275.127 159.93 274.181 160.148 273.588 160.539C273.002 160.922 272.709 161.512 272.709 162.309C272.709 162.887 272.88 163.336 273.224 163.656C273.568 163.969 274.084 164.125 274.771 164.125ZM296.188 166H293.422V158.031C293.422 157.031 293.219 156.285 292.812 155.793C292.414 155.301 291.777 155.055 290.902 155.055C289.738 155.055 288.887 155.398 288.348 156.086C287.809 156.773 287.539 157.926 287.539 159.543V166H284.785V153.039H286.941L287.328 154.738H287.469C287.859 154.121 288.414 153.645 289.133 153.309C289.852 152.973 290.648 152.805 291.523 152.805C294.633 152.805 296.188 154.387 296.188 157.551V166ZM304.491 166.234C302.873 166.234 301.612 165.648 300.705 164.477C299.799 163.305 299.346 161.66 299.346 159.543C299.346 157.418 299.803 155.766 300.717 154.586C301.639 153.398 302.912 152.805 304.537 152.805C306.241 152.805 307.537 153.434 308.428 154.691H308.569C308.436 153.762 308.37 153.027 308.37 152.488V147.766H311.135V166H308.979L308.498 164.301H308.37C307.487 165.59 306.194 166.234 304.491 166.234ZM305.229 164.008C306.362 164.008 307.186 163.691 307.702 163.059C308.217 162.418 308.483 161.383 308.498 159.953V159.566C308.498 157.934 308.233 156.773 307.702 156.086C307.17 155.398 306.338 155.055 305.205 155.055C304.237 155.055 303.491 155.449 302.967 156.238C302.444 157.02 302.182 158.137 302.182 159.59C302.182 161.027 302.436 162.125 302.944 162.883C303.452 163.633 304.213 164.008 305.229 164.008ZM46.7547 186.309C46.7547 187.574 46.2937 188.547 45.3719 189.227C44.45 189.898 43.1297 190.234 41.4109 190.234C39.6844 190.234 38.2977 189.973 37.2508 189.449V187.07C38.7742 187.773 40.1922 188.125 41.5047 188.125C43.2 188.125 44.0477 187.613 44.0477 186.59C44.0477 186.262 43.9539 185.988 43.7664 185.77C43.5789 185.551 43.2703 185.324 42.8406 185.09C42.4109 184.855 41.8133 184.59 41.0477 184.293C39.5555 183.715 38.5437 183.137 38.0125 182.559C37.4891 181.98 37.2273 181.23 37.2273 180.309C37.2273 179.199 37.6727 178.34 38.5633 177.73C39.4617 177.113 40.6805 176.805 42.2195 176.805C43.743 176.805 45.1844 177.113 46.5437 177.73L45.6531 179.805C44.2547 179.227 43.0789 178.938 42.1258 178.938C40.6727 178.938 39.9461 179.352 39.9461 180.18C39.9461 180.586 40.1336 180.93 40.5086 181.211C40.8914 181.492 41.7195 181.879 42.993 182.371C44.0633 182.785 44.8406 183.164 45.325 183.508C45.8094 183.852 46.1687 184.25 46.4031 184.703C46.6375 185.148 46.7547 185.684 46.7547 186.309ZM55.5031 190.234C53.4875 190.234 51.9094 189.648 50.7687 188.477C49.6359 187.297 49.0695 185.676 49.0695 183.613C49.0695 181.496 49.5969 179.832 50.6516 178.621C51.7062 177.41 53.1555 176.805 54.9992 176.805C56.7102 176.805 58.0617 177.324 59.0539 178.363C60.0461 179.402 60.5422 180.832 60.5422 182.652V184.141H51.9055C51.9445 185.398 52.2844 186.367 52.925 187.047C53.5656 187.719 54.468 188.055 55.632 188.055C56.3977 188.055 57.1086 187.984 57.7648 187.844C58.4289 187.695 59.1398 187.453 59.8977 187.117V189.355C59.2258 189.676 58.5461 189.902 57.8586 190.035C57.1711 190.168 56.3859 190.234 55.5031 190.234ZM54.9992 178.891C54.1242 178.891 53.4211 179.168 52.8898 179.723C52.3664 180.277 52.0539 181.086 51.9523 182.148H57.8352C57.8195 181.078 57.5617 180.27 57.0617 179.723C56.5617 179.168 55.8742 178.891 54.9992 178.891ZM66.525 190H63.7711V171.766H66.525V190ZM77.0781 179.125H73.9141V190H71.1484V179.125H69.0156V177.836L71.1484 176.992V176.148C71.1484 174.617 71.5078 173.484 72.2266 172.75C72.9453 172.008 74.043 171.637 75.5195 171.637C76.4883 171.637 77.4414 171.797 78.3789 172.117L77.6523 174.203C76.9727 173.984 76.3242 173.875 75.707 173.875C75.082 173.875 74.625 174.07 74.3359 174.461C74.0547 174.844 73.9141 175.422 73.9141 176.195V177.039H77.0781V179.125ZM78.268 184.738V182.395H84.2914V184.738H78.268ZM93.8016 190.234C92.1609 190.234 90.8875 189.645 89.9812 188.465H89.8172C89.9266 189.559 89.9812 190.223 89.9812 190.457V195.766H87.2273V177.039H89.4539C89.5164 177.281 89.6453 177.859 89.8406 178.773H89.9812C90.8406 177.461 92.1297 176.805 93.8484 176.805C95.4656 176.805 96.7234 177.391 97.6219 178.562C98.5281 179.734 98.9812 181.379 98.9812 183.496C98.9812 185.613 98.5203 187.266 97.5984 188.453C96.6844 189.641 95.4187 190.234 93.8016 190.234ZM93.1336 179.055C92.0398 179.055 91.2391 179.375 90.7312 180.016C90.2312 180.656 89.9812 181.68 89.9812 183.086V183.496C89.9812 185.074 90.2312 186.219 90.7312 186.93C91.2312 187.633 92.0477 187.984 93.1805 187.984C94.1336 187.984 94.868 187.594 95.3836 186.812C95.8992 186.031 96.157 184.918 96.157 183.473C96.157 182.02 95.8992 180.922 95.3836 180.18C94.8758 179.43 94.1258 179.055 93.1336 179.055ZM110.39 190L109.839 188.195H109.745C109.12 188.984 108.491 189.523 107.859 189.812C107.226 190.094 106.413 190.234 105.421 190.234C104.148 190.234 103.152 189.891 102.433 189.203C101.722 188.516 101.366 187.543 101.366 186.285C101.366 184.949 101.862 183.941 102.855 183.262C103.847 182.582 105.359 182.211 107.39 182.148L109.628 182.078V181.387C109.628 180.559 109.433 179.941 109.042 179.535C108.659 179.121 108.062 178.914 107.249 178.914C106.585 178.914 105.948 179.012 105.339 179.207C104.73 179.402 104.144 179.633 103.581 179.898L102.691 177.93C103.394 177.562 104.163 177.285 104.999 177.098C105.835 176.902 106.624 176.805 107.366 176.805C109.015 176.805 110.257 177.164 111.093 177.883C111.937 178.602 112.359 179.73 112.359 181.27V190H110.39ZM106.288 188.125C107.288 188.125 108.089 187.848 108.691 187.293C109.3 186.73 109.605 185.945 109.605 184.938V183.812L107.941 183.883C106.644 183.93 105.698 184.148 105.105 184.539C104.519 184.922 104.226 185.512 104.226 186.309C104.226 186.887 104.398 187.336 104.741 187.656C105.085 187.969 105.601 188.125 106.288 188.125ZM121.529 190.234C119.568 190.234 118.076 189.664 117.052 188.523C116.037 187.375 115.529 185.73 115.529 183.59C115.529 181.41 116.06 179.734 117.123 178.562C118.193 177.391 119.736 176.805 121.752 176.805C123.119 176.805 124.349 177.059 125.443 177.566L124.611 179.781C123.447 179.328 122.486 179.102 121.728 179.102C119.486 179.102 118.365 180.59 118.365 183.566C118.365 185.02 118.642 186.113 119.197 186.848C119.759 187.574 120.58 187.938 121.658 187.938C122.884 187.938 124.045 187.633 125.138 187.023V189.426C124.646 189.715 124.119 189.922 123.556 190.047C123.002 190.172 122.326 190.234 121.529 190.234ZM133.945 190.234C131.93 190.234 130.352 189.648 129.211 188.477C128.078 187.297 127.512 185.676 127.512 183.613C127.512 181.496 128.039 179.832 129.094 178.621C130.148 177.41 131.598 176.805 133.441 176.805C135.152 176.805 136.504 177.324 137.496 178.363C138.488 179.402 138.984 180.832 138.984 182.652V184.141H130.348C130.387 185.398 130.727 186.367 131.367 187.047C132.008 187.719 132.91 188.055 134.074 188.055C134.84 188.055 135.551 187.984 136.207 187.844C136.871 187.695 137.582 187.453 138.34 187.117V189.355C137.668 189.676 136.988 189.902 136.301 190.035C135.613 190.168 134.828 190.234 133.945 190.234ZM133.441 178.891C132.566 178.891 131.863 179.168 131.332 179.723C130.809 180.277 130.496 181.086 130.395 182.148H136.277C136.262 181.078 136.004 180.27 135.504 179.723C135.004 179.168 134.316 178.891 133.441 178.891ZM146.584 190.234C144.967 190.234 143.705 189.648 142.799 188.477C141.893 187.305 141.44 185.66 141.44 183.543C141.44 181.418 141.897 179.766 142.811 178.586C143.733 177.398 145.006 176.805 146.631 176.805C148.334 176.805 149.631 177.434 150.522 178.691H150.663C150.53 177.762 150.463 177.027 150.463 176.488V171.766H153.229V190H151.073L150.592 188.301H150.463C149.58 189.59 148.288 190.234 146.584 190.234ZM147.323 188.008C148.455 188.008 149.28 187.691 149.795 187.059C150.311 186.418 150.577 185.383 150.592 183.953V183.566C150.592 181.934 150.327 180.773 149.795 180.086C149.264 179.398 148.432 179.055 147.299 179.055C146.33 179.055 145.584 179.449 145.061 180.238C144.538 181.02 144.276 182.137 144.276 183.59C144.276 185.027 144.53 186.125 145.038 186.883C145.545 187.633 146.307 188.008 147.323 188.008ZM168.827 190.234C166.866 190.234 165.374 189.664 164.351 188.523C163.335 187.375 162.827 185.73 162.827 183.59C162.827 181.41 163.359 179.734 164.421 178.562C165.491 177.391 167.034 176.805 169.05 176.805C170.417 176.805 171.648 177.059 172.741 177.566L171.909 179.781C170.745 179.328 169.784 179.102 169.027 179.102C166.784 179.102 165.663 180.59 165.663 183.566C165.663 185.02 165.941 186.113 166.495 186.848C167.058 187.574 167.878 187.938 168.956 187.938C170.183 187.938 171.343 187.633 172.437 187.023V189.426C171.945 189.715 171.417 189.922 170.855 190.047C170.3 190.172 169.624 190.234 168.827 190.234ZM187.08 183.496C187.08 185.613 186.537 187.266 185.451 188.453C184.365 189.641 182.853 190.234 180.916 190.234C179.705 190.234 178.634 189.961 177.705 189.414C176.775 188.867 176.06 188.082 175.56 187.059C175.06 186.035 174.81 184.848 174.81 183.496C174.81 181.395 175.349 179.754 176.427 178.574C177.505 177.395 179.025 176.805 180.986 176.805C182.861 176.805 184.345 177.41 185.439 178.621C186.533 179.824 187.08 181.449 187.08 183.496ZM177.646 183.496C177.646 186.488 178.752 187.984 180.962 187.984C183.15 187.984 184.244 186.488 184.244 183.496C184.244 180.535 183.142 179.055 180.939 179.055C179.783 179.055 178.943 179.438 178.42 180.203C177.904 180.969 177.646 182.066 177.646 183.496ZM199.496 190L199.109 188.301H198.969C198.586 188.902 198.039 189.375 197.328 189.719C196.625 190.062 195.82 190.234 194.914 190.234C193.344 190.234 192.172 189.844 191.398 189.062C190.625 188.281 190.238 187.098 190.238 185.512V177.039H193.016V185.031C193.016 186.023 193.219 186.77 193.625 187.27C194.031 187.762 194.668 188.008 195.535 188.008C196.691 188.008 197.539 187.664 198.078 186.977C198.625 186.281 198.898 185.121 198.898 183.496V177.039H201.664V190H199.496ZM212.264 176.805C212.819 176.805 213.276 176.844 213.635 176.922L213.366 179.488C212.975 179.395 212.569 179.348 212.147 179.348C211.045 179.348 210.151 179.707 209.463 180.426C208.784 181.145 208.444 182.078 208.444 183.227V190H205.69V177.039H207.846L208.209 179.324H208.35C208.78 178.551 209.338 177.938 210.026 177.484C210.721 177.031 211.467 176.805 212.264 176.805ZM224.856 186.309C224.856 187.574 224.395 188.547 223.473 189.227C222.552 189.898 221.231 190.234 219.512 190.234C217.786 190.234 216.399 189.973 215.352 189.449V187.07C216.876 187.773 218.294 188.125 219.606 188.125C221.302 188.125 222.149 187.613 222.149 186.59C222.149 186.262 222.055 185.988 221.868 185.77C221.68 185.551 221.372 185.324 220.942 185.09C220.512 184.855 219.915 184.59 219.149 184.293C217.657 183.715 216.645 183.137 216.114 182.559C215.591 181.98 215.329 181.23 215.329 180.309C215.329 179.199 215.774 178.34 216.665 177.73C217.563 177.113 218.782 176.805 220.321 176.805C221.845 176.805 223.286 177.113 224.645 177.73L223.755 179.805C222.356 179.227 221.18 178.938 220.227 178.938C218.774 178.938 218.048 179.352 218.048 180.18C218.048 180.586 218.235 180.93 218.61 181.211C218.993 181.492 219.821 181.879 221.095 182.371C222.165 182.785 222.942 183.164 223.427 183.508C223.911 183.852 224.27 184.25 224.505 184.703C224.739 185.148 224.856 185.684 224.856 186.309ZM233.605 190.234C231.589 190.234 230.011 189.648 228.87 188.477C227.738 187.297 227.171 185.676 227.171 183.613C227.171 181.496 227.698 179.832 228.753 178.621C229.808 177.41 231.257 176.805 233.101 176.805C234.812 176.805 236.163 177.324 237.155 178.363C238.148 179.402 238.644 180.832 238.644 182.652V184.141H230.007C230.046 185.398 230.386 186.367 231.027 187.047C231.667 187.719 232.57 188.055 233.734 188.055C234.499 188.055 235.21 187.984 235.866 187.844C236.53 187.695 237.241 187.453 237.999 187.117V189.355C237.327 189.676 236.648 189.902 235.96 190.035C235.273 190.168 234.488 190.234 233.605 190.234ZM233.101 178.891C232.226 178.891 231.523 179.168 230.991 179.723C230.468 180.277 230.155 181.086 230.054 182.148H235.937C235.921 181.078 235.663 180.27 235.163 179.723C234.663 179.168 233.976 178.891 233.101 178.891ZM258.836 190L257.16 183.953C256.957 183.312 256.59 181.824 256.059 179.488H255.953C255.5 181.598 255.141 183.094 254.875 183.977L253.152 190H250.105L246.473 177.039H249.285L250.938 183.426C251.312 185.004 251.578 186.355 251.734 187.48H251.805C251.883 186.91 252 186.258 252.156 185.523C252.32 184.781 252.461 184.227 252.578 183.859L254.547 177.039H257.57L259.48 183.859C259.598 184.242 259.742 184.828 259.914 185.617C260.094 186.406 260.199 187.02 260.23 187.457H260.324C260.441 186.496 260.715 185.152 261.145 183.426L262.82 177.039H265.586L261.93 190H258.836ZM279.42 183.496C279.42 185.613 278.877 187.266 277.791 188.453C276.705 189.641 275.194 190.234 273.256 190.234C272.045 190.234 270.975 189.961 270.045 189.414C269.116 188.867 268.401 188.082 267.901 187.059C267.401 186.035 267.151 184.848 267.151 183.496C267.151 181.395 267.69 179.754 268.768 178.574C269.846 177.395 271.366 176.805 273.327 176.805C275.202 176.805 276.686 177.41 277.78 178.621C278.873 179.824 279.42 181.449 279.42 183.496ZM269.987 183.496C269.987 186.488 271.092 187.984 273.303 187.984C275.491 187.984 276.584 186.488 276.584 183.496C276.584 180.535 275.483 179.055 273.28 179.055C272.123 179.055 271.284 179.438 270.76 180.203C270.245 180.969 269.987 182.066 269.987 183.496ZM289.27 176.805C289.825 176.805 290.282 176.844 290.641 176.922L290.372 179.488C289.981 179.395 289.575 179.348 289.153 179.348C288.052 179.348 287.157 179.707 286.47 180.426C285.79 181.145 285.45 182.078 285.45 183.227V190H282.696V177.039H284.852L285.216 179.324H285.356C285.786 178.551 286.345 177.938 287.032 177.484C287.727 177.031 288.473 176.805 289.27 176.805ZM295.816 183.156L297.374 181.211L301.288 177.039H304.464L299.249 182.605L304.792 190H301.558L297.398 184.316L295.886 185.559V190H293.155V171.766H295.886V180.66L295.745 183.156H295.816Z" fill="#4E4E4E"/>
<path d="M90.5092 104.99C86.068 108.303 84.8093 114.131 84.8093 114.131C84.8093 114.131 90.7512 114.588 95.1924 111.276C99.6336 107.964 100.892 102.136 100.892 102.136C100.892 102.136 94.9504 101.678 90.5092 104.99Z" fill="#F1F1F1"/>
<path d="M92.3592 106.546C90.2248 111.66 84.879 114.295 84.879 114.295C84.879 114.295 82.9939 108.639 85.1284 103.525C87.2629 98.4104 92.6086 95.7749 92.6086 95.7749C92.6086 95.7749 94.4937 101.431 92.3592 106.546Z" fill="#F1F1F1"/>
<path d="M220.136 91.761C219.664 88.5807 219.54 85.3585 219.764 82.1513L220.136 76.8433C218.088 80.9218 218.551 86.2898 220.136 91.761V91.761Z" fill="#CACACA"/>
<path d="M221.734 92.6489C221.506 90.7511 221.447 88.8371 221.555 86.9288L221.734 83.7693C220.748 86.197 220.971 89.3922 221.734 92.6489Z" fill="#CACACA"/>
<path d="M228.835 96.5565V98.3324C228.834 98.4735 228.778 98.6086 228.678 98.7083C228.578 98.8081 228.443 98.8644 228.302 98.8652H227.415C227.391 98.8651 227.368 98.8696 227.347 98.8785C227.325 98.8874 227.305 98.9005 227.289 98.917C227.272 98.9335 227.259 98.9531 227.25 98.9747C227.241 98.9963 227.237 99.0194 227.237 99.0428V113.605C227.236 113.746 227.18 113.881 227.08 113.981C226.981 114.081 226.846 114.137 226.705 114.138H215.877C215.736 114.138 215.6 114.082 215.501 113.982C215.401 113.882 215.345 113.747 215.344 113.605V99.0428C215.344 98.9957 215.326 98.9506 215.292 98.9173C215.259 98.8841 215.214 98.8653 215.167 98.8652H214.102C213.961 98.8651 213.825 98.8089 213.726 98.709C213.626 98.6091 213.57 98.4737 213.569 98.3324V96.5565C213.569 96.4865 213.583 96.4172 213.61 96.3525C213.637 96.2878 213.676 96.229 213.725 96.1795C213.775 96.13 213.833 96.0908 213.898 96.064C213.963 96.0373 214.032 96.0236 214.102 96.0237H228.302C228.443 96.0241 228.578 96.0804 228.678 96.1802C228.778 96.28 228.834 96.4153 228.835 96.5565Z" fill="#F2F2F2"/>
<path d="M227.253 99.238H215.36V99.7708H227.253V99.238Z" fill="#E6E6E6"/>
<path d="M227.237 107.078C223.258 108.725 219.235 108.744 215.167 107.078V103.324C219.083 102.008 223.321 102.008 227.237 103.324V107.078Z" fill="#E6E6E6"/>
<path d="M160.578 49.6883C169.461 49.6883 176.663 42.483 176.663 33.5947C176.663 24.7064 169.461 17.501 160.578 17.501C151.694 17.501 144.492 24.7064 144.492 33.5947C144.492 42.483 151.694 49.6883 160.578 49.6883Z" fill="#FEB8B8"/>
<path d="M175.602 19.7103C173.197 15.8031 169.432 12.924 165.033 11.6273L163.058 13.0691V11.1969C162.002 11.0351 160.932 10.9728 159.864 11.0108L158.16 12.5531V11.1389C155.638 11.4525 153.208 12.2857 151.023 13.5858C148.838 14.8859 146.947 16.6249 145.467 18.6929C141.767 24.0294 141.143 31.4537 144.782 36.8331C145.781 33.7615 146.993 30.8794 147.992 27.8081C148.777 27.9152 149.573 27.9191 150.359 27.8196L151.575 24.9823L151.914 27.6995C155.681 27.3713 161.269 26.6502 164.84 25.9897L164.493 23.905L166.57 25.6372C167.664 25.3853 168.314 25.1566 168.26 24.982C170.916 29.2661 174.167 32.0023 176.823 36.2864C177.832 30.2456 178.993 25.2227 175.602 19.7103Z" fill="#2F2E41"/>
<path d="M195.173 74.9801C194.62 71.6506 194.049 68.2573 192.503 65.258C191.486 63.2934 189.873 61.4213 187.697 61.0328C187.269 60.9946 186.848 60.8971 186.446 60.743C185.809 60.4359 177.244 55.5442 175.883 54.6923C174.714 53.9609 172.869 52.6066 171.939 52.6066C171.003 52.586 167.414 53.4217 153.407 52.3262C153.407 52.3262 149.559 53.8437 146.582 55.6838C146.536 55.654 132.043 63.4408 131.499 63.4203C130.468 63.3768 129.509 64.0374 128.918 64.8692C128.327 65.701 128.05 66.7308 127.76 67.7264C130.925 74.7796 133.821 81.8419 136.987 88.8951C137.135 89.1608 137.214 89.4596 137.216 89.7638C137.153 90.0796 137.018 90.3767 136.822 90.6325C135.27 93.1277 135.319 96.266 135.489 99.1986C135.659 102.131 135.868 105.229 134.559 107.857C134.202 108.579 133.739 109.24 133.4 109.961C132.606 111.596 132.32 116.823 132.783 118.58L190.855 120.244C189.607 116.81 195.173 74.9801 195.173 74.9801Z" fill="#CCCCCC"/>
<path d="M122.74 89.2079C122.624 90.0465 122.612 90.8962 122.705 91.7377L123.537 103.697C123.616 104.824 123.692 105.949 123.798 107.073C123.998 109.255 124.296 111.42 124.666 113.582C124.675 113.888 124.805 114.18 125.027 114.391C125.25 114.602 125.547 114.716 125.854 114.709C129.518 115.484 133.303 115.453 137.042 115.242C142.748 114.923 157.346 114.321 158.238 113.161C159.13 112.002 158.61 110.127 157.447 109.19C156.284 108.253 137.02 105.968 137.02 105.968C137.209 104.475 137.776 103.07 138.315 101.653C139.283 99.1397 140.186 96.544 140.204 93.8519C140.221 91.1597 139.207 88.3292 137.003 86.7869C135.19 85.5207 132.855 85.2858 130.646 85.3379C129.038 85.3842 126.261 84.9988 124.792 85.6277C123.63 86.1397 122.957 88.0695 122.74 89.2079Z" fill="#FBBEBE"/>
<path d="M127.592 67.941C127.31 68.2366 127.091 68.5867 126.949 68.9699C124.608 74.2489 123.225 79.9029 122.865 85.667C122.872 85.9481 122.807 86.2262 122.677 86.4755C122.549 86.6414 122.407 86.7956 122.251 86.9363C122.116 87.0968 122.014 87.2825 121.95 87.4827C121.886 87.6829 121.863 87.8937 121.88 88.103C121.898 88.3123 121.957 88.5161 122.053 88.7027C122.15 88.8893 122.282 89.0551 122.443 89.1905C122.469 89.2127 122.496 89.2341 122.524 89.2545C123.002 88.3548 124.145 88.0607 125.162 87.9825C130.031 87.5971 134.787 89.8633 139.67 89.6923C139.325 88.5012 138.83 87.3567 138.549 86.1513C137.306 80.7989 140.406 74.9716 138.506 69.8162C138.126 68.7846 137.492 67.7704 136.493 67.3183C136.079 67.1513 135.646 67.0367 135.204 66.977C133.97 66.7539 131.514 65.8005 130.321 66.183C129.88 66.3252 129.707 66.7393 129.342 66.9897C128.787 67.3441 128.052 67.4744 127.592 67.941Z" fill="#CCCCCC"/>
<path d="M195.208 85.6277C193.739 84.9988 190.962 85.3842 189.354 85.3379C187.145 85.2858 184.81 85.5207 182.997 86.7869C180.793 88.3292 179.779 91.1597 179.796 93.8519C179.814 96.544 180.717 99.1397 181.685 101.653C182.223 103.07 182.791 104.475 182.98 105.968C182.98 105.968 163.715 108.253 162.553 109.19C161.39 110.127 160.87 112.002 161.762 113.161C162.654 114.321 190.482 115.484 194.146 114.709C194.453 114.717 194.75 114.602 194.973 114.391C195.195 114.18 195.325 113.888 195.333 113.582C195.704 111.42 196.002 109.255 196.202 107.073C196.308 105.949 196.384 104.824 196.463 103.697L197.295 91.7378C197.388 90.8963 197.376 90.0465 197.26 89.2079C197.043 88.0695 196.37 86.1397 195.208 85.6277Z" fill="#FBBEBE"/>
<path d="M190.658 66.9897C190.293 66.7393 190.12 66.3251 189.679 66.183C188.486 65.8005 186.03 66.7539 184.796 66.977C184.354 67.0367 183.921 67.1513 183.507 67.3183C182.508 67.7703 181.874 68.7846 181.495 69.8162C179.594 74.9716 182.694 80.7989 181.451 86.1513C181.17 87.3567 180.675 88.5012 180.33 89.6923C185.213 89.8633 189.969 87.5971 194.838 87.9825C195.855 88.0606 196.999 88.3548 197.476 89.2545C197.504 89.2341 197.531 89.2127 197.557 89.1905C197.718 89.055 197.85 88.8893 197.947 88.7027C198.043 88.5161 198.102 88.3123 198.12 88.103C198.137 87.8937 198.114 87.6829 198.05 87.4827C197.987 87.2825 197.884 87.0968 197.749 86.9363C197.593 86.7956 197.451 86.6414 197.323 86.4755C197.193 86.2262 197.128 85.9481 197.135 85.667C196.775 79.9028 195.392 74.2489 193.051 68.9698C192.909 68.5867 192.69 68.2366 192.408 67.941C191.948 67.4744 191.213 67.3441 190.658 66.9897Z" fill="#CCCCCC"/>
<path d="M155.814 115.28C158.211 115.28 160.155 113.335 160.155 110.936C160.155 108.537 158.211 106.592 155.814 106.592C153.416 106.592 151.472 108.537 151.472 110.936C151.472 113.335 153.416 115.28 155.814 115.28Z" fill="#FBBEBE"/>
<path d="M165.427 115.28C167.825 115.28 169.768 113.335 169.768 110.936C169.768 108.537 167.825 106.592 165.427 106.592C163.029 106.592 161.085 108.537 161.085 110.936C161.085 113.335 163.029 115.28 165.427 115.28Z" fill="#FBBEBE"/>
<path d="M192.226 120.724H132.58C131.884 120.723 131.216 120.446 130.724 119.953C130.232 119.461 129.955 118.793 129.954 118.096V81.8925C129.955 81.1958 130.232 80.5278 130.724 80.0352C131.216 79.5425 131.884 79.2654 132.58 79.2646H192.226C192.922 79.2654 193.59 79.5425 194.082 80.0352C194.574 80.5278 194.851 81.1958 194.852 81.8925V118.096C194.851 118.793 194.574 119.461 194.082 119.953C193.59 120.446 192.922 120.723 192.226 120.724Z" fill="#3F3D56"/>
<path d="M162.258 101.733C163.218 101.733 163.996 100.955 163.996 99.9943C163.996 99.0341 163.218 98.2556 162.258 98.2556C161.299 98.2556 160.521 99.0341 160.521 99.9943C160.521 100.955 161.299 101.733 162.258 101.733Z" fill="white"/>
<path d="M260 113.422H60V119.571H71.8298V121H248.175V119.571H260V113.422Z" fill="#F1F1F1"/>
<path d="M145.786 39.5931C143.201 39.5931 141.106 37.3265 141.106 34.5305V31.9991C141.106 29.2031 143.201 26.9365 145.786 26.9365V39.5931H145.786Z" fill="#DDD510"/>
<path d="M175.656 26.9365C178.241 26.9365 180.336 29.2031 180.336 31.9991V34.5304C180.336 37.3265 178.241 39.5931 175.656 39.5931V26.9365Z" fill="#DDD510"/>
<path d="M178.108 32.3968H177.366C177.366 22.2099 169.705 13.9221 160.288 13.9221C150.871 13.9221 143.21 22.2099 143.21 32.3968H142.467C142.467 21.7669 150.462 13.1189 160.288 13.1189C170.114 13.1189 178.108 21.7669 178.108 32.3968Z" fill="#DDD510"/>
</svg>
