<svg width="292" height="131" viewBox="0 0 292 131" fill="none" xmlns="http://www.w3.org/2000/svg">
<path d="M0 20C0 8.9543 8.9543 0 20 0H292V111C292 122.046 283.046 131 272 131H0V20Z" fill="#519ED5"/>
<path d="M159 59C172.255 59 183 48.2548 183 35C183 21.7452 172.255 11 159 11C145.745 11 135 21.7452 135 35C135 48.2548 145.745 59 159 59Z" fill="white"/>
<path d="M159 113C172.255 113 183 102.255 183 89C183 75.7452 172.255 65 159 65C145.745 65 135 75.7452 135 89C135 102.255 145.745 113 159 113Z" fill="white"/>
<path d="M246.646 71.6011C252.588 71.6011 257.406 66.8005 257.406 60.8786C257.406 54.9567 252.588 50.156 246.646 50.156C240.704 50.156 235.886 54.9567 235.886 60.8786C235.886 66.8005 240.704 71.6011 246.646 71.6011Z" fill="#F2F2F2"/>
<path d="M246.646 63.7003C248.21 63.7003 249.477 62.437 249.477 60.8786C249.477 59.3202 248.21 58.0569 246.646 58.0569C245.082 58.0569 243.815 59.3202 243.815 60.8786C243.815 62.437 245.082 63.7003 246.646 63.7003Z" fill="#E6E6E6"/>
<path d="M246.129 60.9387C247.321 61.9084 247.685 63.4367 247.463 64.9123C247.19 66.5309 246.348 67.9997 245.086 69.0549C243.668 70.3112 241.938 71.1601 240.269 72.0294C238.735 72.8095 237.261 73.7012 235.859 74.6973C230.49 78.5859 226.434 84.1227 224.113 90.3014C221.795 96.4697 221.174 103.471 222.935 109.864C223.806 113.027 225.568 116.439 228.852 117.629C231.469 118.578 235.042 117.967 236.375 115.279C237.807 112.391 235.809 109.145 233.237 107.712C229.902 105.853 225.918 107.211 222.918 109.092C219.616 111.163 216.961 114.135 213.514 115.991C211.962 116.853 210.235 117.355 208.461 117.46C206.833 117.524 205.207 117.273 203.674 116.723C200.492 115.567 197.753 113.449 195.841 110.664C193.651 107.492 192.671 103.603 192.492 99.7931C192.092 91.2698 195.471 83.2959 198.182 75.3915C199.639 71.2754 200.73 67.0398 201.443 62.7334C202.122 58.4051 202.363 54.02 202.164 49.6438C201.985 45.7742 201.602 41.7277 199.888 38.1936C198.381 35.0859 195.627 32.5425 192.145 31.9012C190.575 31.5942 188.949 31.7804 187.49 32.4341C186.993 32.6599 187.425 33.3897 187.919 33.165C191 31.7641 194.642 33.1272 196.918 35.389C199.576 38.0303 200.552 41.9309 200.985 45.53C201.959 54.0595 201.192 62.6972 198.729 70.9235C196.366 78.9238 192.648 86.5901 191.791 94.9719C191.399 98.7967 191.6 102.751 192.827 106.418C193.879 109.685 195.853 112.581 198.512 114.761C201.016 116.778 204.096 118.152 207.338 118.305C210.978 118.477 214.169 116.86 216.993 114.709C220.017 112.405 222.8 109.563 226.464 108.271C228.134 107.682 230.036 107.407 231.751 107.974C233.222 108.475 234.47 109.475 235.277 110.799C236.021 112.033 236.296 113.576 235.617 114.902C234.977 116.149 233.73 116.87 232.38 117.117C230.95 117.369 229.477 117.119 228.211 116.411C226.732 115.569 225.649 114.156 224.891 112.663C223.379 109.686 222.871 106.143 222.794 102.839C222.726 99.6113 223.141 96.3918 224.025 93.2862C225.784 87.0039 229.333 81.365 234.244 77.0531C235.481 75.9792 236.804 75.0082 238.2 74.1498C239.724 73.2142 241.35 72.4665 242.903 71.5836C244.431 70.7149 245.937 69.6769 246.989 68.2474C247.886 67.0222 248.37 65.5453 248.373 64.0287C248.389 63.3312 248.25 62.6387 247.966 62.001C247.681 61.3633 247.259 60.7962 246.729 60.3401C246.309 59.9986 245.705 60.594 246.129 60.9387Z" fill="#CCCCCC"/>
<path d="M145.682 110.259C149.444 112.682 153.796 114.042 158.273 114.192C158.193 114.381 158.104 114.566 158.004 114.745C157.483 115.704 156.747 116.53 155.852 117.158C154.794 117.901 153.55 118.339 152.258 118.426C150.967 118.513 149.676 118.244 148.526 117.65C147.377 117.055 146.414 116.158 145.741 115.055C145.069 113.952 144.713 112.686 144.714 111.396V110.259H145.682Z" fill="#3F3D56"/>
<path d="M172.091 110.592V111.396C172.091 112.962 171.569 114.483 170.605 115.719C169.641 116.956 168.291 117.837 166.769 118.224C165.247 118.61 163.638 118.481 162.198 117.855C160.758 117.229 159.569 116.143 158.817 114.768C158.713 114.584 158.62 114.395 158.537 114.201C158.743 114.206 158.947 114.209 159.154 114.209C163.718 114.215 168.195 112.963 172.091 110.592Z" fill="#3F3D56"/>
<path d="M181.616 25.5505C181.404 25.5195 181.188 25.4997 180.973 25.4856C183.418 31.1017 183.588 37.4429 181.446 43.1807C181.661 43.1553 181.874 43.1214 182.086 43.0819C184.16 42.6815 186.023 41.5608 187.345 39.9192C188.667 38.2777 189.362 36.2218 189.306 34.1177C189.249 32.0135 188.445 29.9976 187.037 28.4288C185.629 26.8599 183.708 25.84 181.616 25.5505Z" fill="#3F3D56"/>
<path d="M137.335 25.4856C137.12 25.4997 136.904 25.5195 136.692 25.5505C134.6 25.84 132.679 26.8599 131.271 28.4288C129.862 29.9976 129.059 32.0135 129.002 34.1177C128.946 36.2219 129.64 38.2777 130.962 39.9192C132.285 41.5608 134.148 42.6815 136.222 43.0819C136.434 43.1214 136.647 43.1553 136.862 43.1807C134.72 37.4429 134.889 31.1017 137.335 25.4856Z" fill="#3F3D56"/>
<path d="M181.616 25.5507C179.283 19.9975 174.963 15.5066 169.493 12.9506C164.024 10.3946 157.796 9.95585 152.021 11.7197C146.245 13.4835 141.333 17.324 138.24 22.4949C135.147 27.6659 134.092 33.7981 135.282 39.7003C136.472 45.6025 139.821 50.8532 144.678 54.4323C149.536 58.0115 155.554 59.6635 161.566 59.0675C167.577 58.4714 173.151 55.6699 177.206 51.2071C181.26 46.7443 183.505 40.9389 183.504 34.9188C183.503 31.7023 182.861 28.518 181.616 25.5507ZM181.446 43.1808C179.375 48.7294 175.294 53.3045 170.008 56.0055C164.722 58.7065 158.613 59.3379 152.883 57.7753C147.153 56.2127 142.218 52.5693 139.048 47.5623C135.878 42.5553 134.704 36.5473 135.757 30.7208C136.809 24.8943 140.011 19.6713 144.734 16.0799C149.457 12.4885 155.357 10.7887 161.274 11.3152C167.191 11.8417 172.696 14.5562 176.705 18.9246C180.715 23.2929 182.938 28.9987 182.938 34.9188C182.937 37.7393 182.432 40.537 181.446 43.1808Z" fill="#3F3D56"/>
<path d="M171.612 29.4163H146.696C145.381 29.4163 144.121 29.9365 143.192 30.8626C142.263 31.7886 141.74 33.0446 141.74 34.3543C141.74 35.6639 142.263 36.9199 143.192 37.846C144.121 38.7721 145.381 39.2923 146.696 39.2923H171.612C172.927 39.2923 174.187 38.7721 175.116 37.846C176.045 36.9199 176.567 35.6639 176.567 34.3543C176.567 33.0446 176.045 31.7886 175.116 30.8626C174.187 29.9365 172.927 29.4163 171.612 29.4163Z" fill="#3F3D56"/>
<path d="M159.154 63.9824C152.497 63.9854 146.106 66.5842 141.347 71.2229C136.588 75.8616 133.84 82.1719 133.69 88.8041C133.54 95.4362 136 101.864 140.544 106.712C145.087 111.56 151.355 114.443 158.004 114.745C158.273 114.759 158.545 114.768 158.817 114.768C158.93 114.774 159.041 114.774 159.154 114.774C165.912 114.774 172.394 112.098 177.173 107.335C181.952 102.573 184.637 96.1133 184.637 89.378C184.637 82.6427 181.952 76.1832 177.173 71.4206C172.394 66.658 165.912 63.9824 159.154 63.9824ZM172.091 110.592C168.195 112.963 163.718 114.214 159.154 114.209C158.947 114.209 158.743 114.206 158.537 114.201C158.449 114.201 158.361 114.198 158.273 114.192C152.29 113.985 146.581 111.639 142.191 107.583C137.8 103.527 135.02 98.0315 134.36 92.1015C133.7 86.1715 135.203 80.2028 138.595 75.2861C141.986 70.3695 147.04 66.8334 152.833 65.3241C158.625 63.8147 164.769 64.433 170.141 67.0659C175.514 69.6987 179.756 74.1703 182.093 79.6634C184.43 85.1565 184.705 91.3042 182.869 96.983C181.032 102.662 177.207 107.492 172.091 110.592Z" fill="#3F3D56"/>
<path d="M177.039 83.1232H165.902C165.126 83.1232 164.382 82.816 163.833 82.2691C163.285 81.7223 162.976 80.9807 162.976 80.2073C162.976 79.434 163.285 78.6924 163.833 78.1455C164.382 77.5987 165.126 77.2915 165.902 77.2915H177.039C177.815 77.2915 178.56 77.5987 179.108 78.1455C179.657 78.6924 179.965 79.434 179.965 80.2073C179.965 80.9807 179.657 81.7223 179.108 82.2691C178.56 82.816 177.815 83.1232 177.039 83.1232Z" fill="#3F3D56"/>
<path d="M166.645 81.6874C167.465 81.6874 168.13 81.0249 168.13 80.2076C168.13 79.3903 167.465 78.7278 166.645 78.7278C165.825 78.7278 165.16 79.3903 165.16 80.2076C165.16 81.0249 165.825 81.6874 166.645 81.6874Z" fill="#F2F2F2"/>
<path d="M171.471 81.6874C172.291 81.6874 172.956 81.0249 172.956 80.2076C172.956 79.3903 172.291 78.7278 171.471 78.7278C170.651 78.7278 169.986 79.3903 169.986 80.2076C169.986 81.0249 170.651 81.6874 171.471 81.6874Z" fill="#F2F2F2"/>
<path d="M176.297 81.6874C177.117 81.6874 177.782 81.0249 177.782 80.2076C177.782 79.3903 177.117 78.7278 176.297 78.7278C175.477 78.7278 174.812 79.3903 174.812 80.2076C174.812 81.0249 175.477 81.6874 176.297 81.6874Z" fill="#519ED5"/>
<path d="M72.613 117.705C75.1592 115.561 76.7058 112.174 76.3002 108.876C75.8946 105.579 73.3825 102.547 70.1239 101.847C66.8652 101.147 63.1506 103.085 62.1609 106.258C61.6162 100.142 60.9885 93.7694 57.7257 88.5611C54.7712 83.8451 49.6541 80.4707 44.1083 79.867C38.5625 79.2633 32.7235 81.5434 29.2648 85.9055C25.8061 90.2677 24.9592 96.6095 27.3816 101.618C29.1661 105.307 32.4538 108.053 35.8984 110.286C46.8881 117.413 60.5207 119.82 73.4923 117.918L72.613 117.705Z" fill="#F2F2F2"/>
<path d="M34.7491 81.6696C39.3251 85.384 43.523 89.5383 47.2823 94.0723C51.0421 98.6017 54.3523 103.484 57.1662 108.65C58.7391 111.548 60.152 114.53 61.3987 117.581C61.6529 118.202 60.6414 118.472 60.3901 117.858C58.1819 112.479 55.4499 107.327 52.2333 102.478C49.0323 97.6471 45.3686 93.1367 41.2937 89.0105C38.9889 86.6779 36.5571 84.4733 34.0094 82.4067C33.4872 81.983 34.2312 81.2494 34.7491 81.6696Z" fill="white"/>
<path d="M71.7497 28.6234C76.5974 28.6234 80.527 24.7071 80.527 19.876C80.527 15.045 76.5974 11.1287 71.7497 11.1287C66.902 11.1287 62.9722 15.045 62.9722 19.876C62.9722 24.7071 66.902 28.6234 71.7497 28.6234Z" fill="#2F2E41"/>
<path d="M104.486 51.906C104.318 52.1581 104.113 52.3837 103.878 52.5755C103.539 52.8537 103.145 53.0575 102.722 53.1735C102.299 53.2895 101.856 53.3151 101.422 53.2485C100.988 53.182 100.574 53.0249 100.205 52.7874C99.8361 52.55 99.5221 52.2376 99.2831 51.8707C99.2281 51.7853 99.1771 51.6969 99.1311 51.6061L85.3001 50.2762C84.2081 50.1671 83.1811 49.7101 82.3701 48.9731C81.5601 48.236 81.0101 47.2582 80.8011 46.1848L80.0161 42.0602L85.4141 41.2234L86.3831 44.5272L99.8681 47.8284C99.9731 47.737 100.084 47.6531 100.2 47.5772C100.801 47.1882 101.519 47.0178 102.232 47.095C102.945 47.1722 103.61 47.4921 104.113 48.0008C104.617 48.5095 104.929 49.1758 104.997 49.8873C105.065 50.5987 104.885 51.3118 104.486 51.906Z" fill="#FFB8B8"/>
<path d="M86.7141 44.0284L80.6841 45.6517C80.3581 45.7391 80.0101 45.694 79.7181 45.5263C79.4251 45.3586 79.2111 45.0819 79.1221 44.757L77.0102 36.9657C76.7839 36.1311 76.8757 35.2426 77.2679 34.4715C77.6601 33.7004 78.3249 33.1013 79.1341 32.7898C79.9431 32.4782 80.8391 32.4763 81.6501 32.7843C82.4611 33.0923 83.1281 33.6884 83.5231 34.4578L87.5161 42.2236C87.6031 42.3919 87.6501 42.5774 87.6561 42.7666C87.6611 42.9557 87.6241 43.1436 87.5471 43.3166C87.4701 43.4896 87.3561 43.6433 87.2121 43.7664C87.0671 43.8896 86.8981 43.9791 86.7141 44.0284Z" fill="#2F2E41"/>
<path d="M83.2222 115.57H86.6932L88.3442 102.227H83.2212L83.2222 115.57Z" fill="#FFB8B8"/>
<path d="M93.3871 118.782L82.4781 118.783L82.4771 114.582H89.1721C90.2901 114.582 91.3621 115.024 92.1531 115.812C92.9431 116.6 93.3871 117.668 93.3871 118.782Z" fill="#2F2E41"/>
<path d="M52.2822 112.199L55.5299 113.421L61.805 101.519L57.0119 99.7158L52.2822 112.199Z" fill="#FFB8B8"/>
<path d="M60.6543 118.783L50.4478 114.942L51.9367 111.012L58.1998 113.369C59.2457 113.762 60.0918 114.554 60.5521 115.569C61.0124 116.584 61.0492 117.74 60.6543 118.783Z" fill="#2F2E41"/>
<path d="M83.112 112.471C82.843 112.471 82.581 112.386 82.363 112.228C82.146 112.07 81.984 111.847 81.901 111.592L73.0476 84.3443C73.0213 84.2635 72.9713 84.1925 72.9041 84.1404C72.8368 84.0883 72.7554 84.0576 72.6703 84.0522C72.5853 84.0468 72.5006 84.067 72.4273 84.1102C72.354 84.1534 72.2953 84.2176 72.259 84.2944L59.9891 110.311C59.8562 110.592 59.6244 110.815 59.3377 110.938C59.051 111.06 58.7291 111.074 58.4331 110.976L53.6007 109.37C53.2937 109.268 53.0374 109.053 52.8835 108.769C52.7296 108.485 52.6896 108.154 52.7717 107.842L60.2876 79.4699C61.0741 76.4646 61.6422 73.4067 61.9875 70.3199C62.5146 65.237 64.9058 60.5268 68.7028 57.0925C70.3607 55.5788 71.4384 53.5374 71.7511 51.3184L71.7714 51.1765L82.778 52.9084L89.75 109.605C89.786 109.908 89.712 110.215 89.541 110.468C89.369 110.721 89.113 110.905 88.817 110.985L83.444 112.427C83.336 112.456 83.224 112.471 83.112 112.471Z" fill="#2F2E41"/>
<path d="M75.2366 28.5816C79.0769 28.5816 82.1909 25.4788 82.1909 21.6512C82.1909 17.8236 79.0769 14.7207 75.2366 14.7207C71.3958 14.7207 68.2822 17.8236 68.2822 21.6512C68.2822 25.4788 71.3958 28.5816 75.2366 28.5816Z" fill="#FFB8B8"/>
<path d="M82.0939 54.1173C82.0729 54.1173 82.0509 54.1168 82.0289 54.1157L71.1174 53.572C70.8129 53.5583 70.5235 53.4356 70.3024 53.2265C70.0812 53.0174 69.9432 52.7358 69.9135 52.4334L68.4229 37.95C68.3138 36.8894 68.4666 35.8182 68.868 34.8299C69.2694 33.8416 69.9072 32.9661 70.7259 32.2797C71.5446 31.5933 72.5193 31.1169 73.5651 30.8919C74.6109 30.6669 75.696 30.7002 76.7259 30.9888H76.726C77.5793 31.2217 78.3744 31.6293 79.0609 32.1857C86.7359 38.4675 84.2609 49.8492 83.3199 53.1879C83.2459 53.4553 83.0859 53.6912 82.8649 53.8591C82.6429 54.0271 82.3729 54.1178 82.0939 54.1173Z" fill="#CCCCCC"/>
<path d="M72.6019 63.8425C72.2981 63.8426 71.996 63.7975 71.7056 63.7086C71.2855 63.5818 70.8971 63.3679 70.5658 63.081C70.2345 62.7941 69.9677 62.4407 69.783 62.0439C69.5983 61.6472 69.4998 61.216 69.494 60.7786C69.4882 60.3412 69.5752 59.9076 69.7493 59.5061C69.79 59.4128 69.8357 59.3217 69.8861 59.2333L63.3354 47.0205C62.8219 46.0543 62.6347 44.9488 62.8015 43.8682C62.9684 42.7876 63.4805 41.7894 64.2618 41.0218L67.2727 38.0857L70.962 42.1009L68.7384 44.7347L73.4506 57.7524C73.5847 57.7885 73.7162 57.8339 73.844 57.8883C74.5022 58.1719 75.0421 58.6731 75.3725 59.3074C75.703 59.9417 75.8037 60.6701 75.6578 61.3698C75.5118 62.0695 75.1281 62.6976 74.5714 63.1481C74.0146 63.5986 73.319 63.8439 72.6019 63.8425Z" fill="#FFB8B8"/>
<path d="M69.3388 44.7337L64.6425 40.6299C64.3888 40.4077 64.2338 40.0942 64.2117 39.7583C64.1896 39.4223 64.3021 39.0914 64.5245 38.838L69.8638 32.7699C70.4357 32.1199 71.2289 31.7039 72.0903 31.6022C72.9517 31.5005 73.8205 31.7202 74.529 32.219C75.2375 32.7178 75.7356 33.4603 75.9273 34.3034C76.1189 35.1466 75.9906 36.0305 75.5669 36.7849L71.2907 44.3992C71.198 44.5643 71.0695 44.7066 70.9145 44.8159C70.7595 44.9251 70.5819 44.9984 70.3948 45.0305C70.2077 45.0626 70.0158 45.0526 69.8331 45.0012C69.6504 44.9499 69.4815 44.8585 69.3388 44.7337Z" fill="#2F2E41"/>
<path d="M70.7614 28.3832C71.3959 28.6074 72.1738 28.8051 72.6731 28.3401C73.1605 27.8861 73.0717 27.0559 72.7846 26.4443C72.4974 25.8327 72.0521 25.2885 71.9156 24.6228C71.7199 23.6687 72.2258 22.6775 72.9481 22.0555C73.6704 21.4335 74.5795 21.1068 75.4671 20.7924L80.3349 19.0678C81.5399 18.6409 82.8389 18.1394 83.5129 17.016C84.4889 15.3906 83.5969 13.067 81.9959 12.1185C80.3959 11.17 78.3743 11.3467 76.6475 12.0136C75.6925 12.3825 74.784 12.8908 73.7963 13.1505C71.847 13.663 69.6307 13.2032 67.9178 14.2985C66.4267 15.2519 65.7351 17.1974 65.7853 19.0177C65.8355 20.8379 66.508 22.5715 67.2174 24.2362C67.6394 25.2266 68.0903 26.2284 68.8051 27.0162C69.52 27.8039 70.5529 28.355 71.5848 28.21L70.7614 28.3832Z" fill="#2F2E41"/>
<path d="M64.388 21.2869C67.5156 21.2869 70.0509 18.7603 70.0509 15.6435C70.0509 12.5267 67.5156 10 64.388 10C61.2605 10 58.7251 12.5267 58.7251 15.6435C58.7251 18.7603 61.2605 21.2869 64.388 21.2869Z" fill="#2F2E41"/>
<path d="M110.318 48.2204L110.217 48.2067L110.595 45.4632C110.654 45.042 110.541 44.6152 110.284 44.2764C110.026 43.9377 109.644 43.7149 109.221 43.657L103.388 42.858C102.966 42.8001 102.537 42.9118 102.198 43.1687C101.858 43.4255 101.634 43.8064 101.576 44.2276L99.4998 59.2788C99.4418 59.7 99.5538 60.1268 99.8118 60.4656C100.069 60.8043 100.452 61.0271 100.874 61.085L106.707 61.884C107.129 61.9419 107.558 61.8302 107.898 61.5733C108.238 61.3164 108.461 60.9355 108.519 60.5144L109.948 50.1595L110.048 50.1733L110.318 48.2204Z" fill="#3F3D56"/>
<path d="M109.038 44.4618L108.312 44.3623C108.334 44.4485 108.334 44.5388 108.313 44.6252C108.292 44.7116 108.25 44.7916 108.19 44.8579C108.131 44.9243 108.056 44.9751 107.972 45.0059C107.889 45.0366 107.799 45.0463 107.71 45.0342L104.523 44.5976C104.434 44.5855 104.35 44.5519 104.278 44.4998C104.206 44.4476 104.147 44.3786 104.108 44.2987C104.069 44.2188 104.05 44.1305 104.053 44.0416C104.056 43.9527 104.081 43.8659 104.126 43.7889L103.447 43.696C103.298 43.6755 103.147 43.6846 103.001 43.7226C102.856 43.7605 102.719 43.8267 102.599 43.9173C102.479 44.0079 102.379 44.1211 102.303 44.2506C102.227 44.38 102.177 44.523 102.156 44.6716L100.179 59.0071C100.138 59.3071 100.218 59.6112 100.401 59.8525C100.585 60.0938 100.857 60.2525 101.158 60.2937L106.748 61.0595C107.049 61.1008 107.354 61.0212 107.596 60.8382C107.839 60.6552 107.998 60.3839 108.039 60.0839L110.017 45.7483C110.058 45.4483 109.978 45.1443 109.795 44.903C109.611 44.6617 109.339 44.503 109.038 44.4618Z" fill="white"/>
<path d="M105.073 56.3638C106.793 56.3638 108.188 54.9741 108.188 53.2599C108.188 51.5457 106.793 50.156 105.073 50.156C103.353 50.156 101.958 51.5457 101.958 53.2599C101.958 54.9741 103.353 56.3638 105.073 56.3638Z" fill="#519ED5"/>
<path d="M104.764 54.4441C104.694 54.4442 104.626 54.4216 104.57 54.3798L104.566 54.3772L103.835 53.8187C103.8 53.7929 103.772 53.7606 103.75 53.7237C103.729 53.6869 103.715 53.6461 103.709 53.6038C103.703 53.5615 103.706 53.5185 103.717 53.4773C103.728 53.4361 103.747 53.3974 103.773 53.3635C103.799 53.3297 103.832 53.3013 103.869 53.2799C103.906 53.2586 103.947 53.2448 103.989 53.2393C104.032 53.2338 104.075 53.2367 104.116 53.2478C104.157 53.2589 104.196 53.2781 104.23 53.3042L104.704 53.6665L105.825 52.2104C105.851 52.1766 105.883 52.1482 105.92 52.1269C105.957 52.1057 105.998 52.0918 106.04 52.0863C106.082 52.0807 106.125 52.0835 106.167 52.0945C106.208 52.1055 106.247 52.1245 106.28 52.1504L106.274 52.1598L106.281 52.1505C106.349 52.2029 106.394 52.2801 106.405 52.3653C106.416 52.4505 106.393 52.5366 106.341 52.6049L105.023 54.3176C104.993 54.3571 104.953 54.389 104.908 54.411C104.864 54.4329 104.814 54.4442 104.764 54.4441Z" fill="white"/>
<path d="M265.663 119H28.0202C27.931 119 27.8455 118.964 27.7825 118.901C27.7195 118.838 27.6841 118.753 27.6841 118.664C27.6841 118.575 27.7195 118.49 27.7825 118.427C27.8455 118.364 27.931 118.328 28.0202 118.328H265.663C265.752 118.328 265.838 118.364 265.901 118.427C265.964 118.49 266 118.575 266 118.664C266 118.753 265.964 118.839 265.901 118.902C265.838 118.965 265.752 119 265.663 119Z" fill="#CCCCCC"/>
</svg>
