{
	"info": {
		"_postman_id": "0c4ecc60-28e3-4776-b3f6-c4b620b83ad4",
		"name": "tests-example",
		"schema": "https://schema.getpostman.com/json/collection/v2.1.0/collection.json",
		"_exporter_id": "18653498"
	},
	"item": [
		{
			"name": "Create product",
			"event": [
				{
					"listen": "test",
					"script": {
						"exec": [
							"pm.test('response must be valid and have json body', () => {\r",
							"    pm.response.to.be.ok;\r",
							"    pm.response.to.be.withBody;\r",
							"    pm.response.to.be.json;\r",
							"});\r",
							"\r",
							"pm.test('response body must be a json object', () => {\r",
							"    const body = pm.response.json();\r",
							"    pm.expect(body.id).to.be.a('number');\r",
							"    pm.expect(body.label).to.be.a('string');\r",
							"    pm.expect(body.price).to.be.a('number');\r",
							"    \r",
							"    pm.collectionVariables.set('objectUnderTest', body);\r",
							"});"
						],
						"type": "text/javascript"
					}
				}
			],
			"request": {
				"method": "POST",
				"header": [],
				"body": {
					"mode": "raw",
					"raw": "{\r\n    \"id\": 0,\r\n    \"label\": \"test\",\r\n    \"price\": 25.99\r\n}",
					"options": {
						"raw": {
							"language": "json"
						}
					}
				},
				"url": {
					"raw": "http://localhost:5000/products",
					"protocol": "http",
					"host": [
						"localhost"
					],
					"port": "5000",
					"path": [
						"products"
					]
				}
			},
			"response": []
		},
		{
			"name": "List products",
			"event": [
				{
					"listen": "test",
					"script": {
						"exec": [
							"pm.test('response must be valid and have json body', () => {\r",
							"    pm.response.to.be.ok;\r",
							"    pm.response.to.be.withBody;\r",
							"    pm.response.to.be.json;\r",
							"});\r",
							"\r",
							"const body = pm.response.json();\r",
							"\r",
							"pm.test('response body must be a json array', () => {\r",
							"    pm.expect(body).to.be.an('array');\r",
							"    pm.expect(body).to.have.lengthOf.above(0);\r",
							"});\r",
							"\r",
							"const out = pm.collectionVariables.get('objectUnderTest');\r",
							"\r",
							"if (!!out) {\r",
							"    pm.test('response body must contain created value', () => {\r",
							"        const elem = body.find(elem => elem.id === out.id);\r",
							"        pm.expect(elem.id).to.equal(out.id);\r",
							"        pm.expect(elem.label).to.equal(out.label);\r",
							"        pm.expect(elem.price).to.equal(out.price);\r",
							"    });\r",
							"}"
						],
						"type": "text/javascript"
					}
				}
			],
			"request": {
				"method": "GET",
				"header": [],
				"url": {
					"raw": "http://localhost:5000/products",
					"protocol": "http",
					"host": [
						"localhost"
					],
					"port": "5000",
					"path": [
						"products"
					]
				}
			},
			"response": []
		},
		{
			"name": "Get product",
			"event": [
				{
					"listen": "prerequest",
					"script": {
						"exec": [
							"const out = pm.collectionVariables.get('objectUnderTest');\r",
							"\r",
							"if (!!out) {\r",
							"    pm.variables.set(\"id\", out.id);\r",
							"} else {\r",
							"    pm.variables.set(\"id\", 0);\r",
							"}"
						],
						"type": "text/javascript"
					}
				},
				{
					"listen": "test",
					"script": {
						"exec": [
							"pm.test('response must be valid and have json body', () => {\r",
							"    pm.response.to.be.ok;\r",
							"    pm.response.to.be.withBody;\r",
							"    pm.response.to.be.json;\r",
							"});\r",
							"\r",
							"const body = pm.response.json();\r",
							"\r",
							"pm.test('response body must be a json object', () => {\r",
							"    pm.expect(body.id).to.be.a('number');\r",
							"    pm.expect(body.label).to.be.a('string');\r",
							"    pm.expect(body.price).to.be.a('number');\r",
							"});\r",
							"\r",
							"const out = pm.collectionVariables.get('objectUnderTest');\r",
							"\r",
							"if (!!out) {\r",
							"    pm.test('response body must contain updated value', () => {\r",
							"        pm.expect(body.id).to.equal(out.id);\r",
							"        pm.expect(body.label).to.equal(out.label);\r",
							"        pm.expect(body.price).to.equal(out.price);\r",
							"    });\r",
							"\r",
							"    pm.collectionVariables.set('objectUnderTest', body);\r",
							"}"
						],
						"type": "text/javascript"
					}
				}
			],
			"request": {
				"method": "GET",
				"header": [],
				"url": {
					"raw": "http://localhost:5000/products/:id",
					"protocol": "http",
					"host": [
						"localhost"
					],
					"port": "5000",
					"path": [
						"products",
						":id"
					],
					"variable": [
						{
							"key": "id",
							"value": "{{id}}"
						}
					]
				}
			},
			"response": []
		},
		{
			"name": "Delete product",
			"event": [
				{
					"listen": "test",
					"script": {
						"exec": [
							"pm.test('response must be valid and have json body', () => {\r",
							"    pm.response.to.be.ok;\r",
							"    pm.response.to.be.withBody;\r",
							"    pm.response.to.be.json;\r",
							"\r",
							"    pm.collectionVariables.unset('objectUnderTest');\r",
							"});"
						],
						"type": "text/javascript"
					}
				},
				{
					"listen": "prerequest",
					"script": {
						"exec": [
							"const out = pm.collectionVariables.get('objectUnderTest');\r",
							"\r",
							"if (!!out) {\r",
							"    pm.variables.set(\"id\", out.id);\r",
							"} else {\r",
							"    pm.variables.set(\"id\", 0);\r",
							"}"
						],
						"type": "text/javascript"
					}
				}
			],
			"request": {
				"method": "DELETE",
				"header": [],
				"url": {
					"raw": "http://localhost:5000/products/:id",
					"protocol": "http",
					"host": [
						"localhost"
					],
					"port": "5000",
					"path": [
						"products",
						":id"
					],
					"variable": [
						{
							"key": "id",
							"value": "{{id}}"
						}
					]
				}
			},
			"response": []
		}
	],
	"event": [
		{
			"listen": "prerequest",
			"script": {
				"type": "text/javascript",
				"exec": [
					""
				]
			}
		},
		{
			"listen": "test",
			"script": {
				"type": "text/javascript",
				"exec": [
					""
				]
			}
		}
	]
}