<!-- Generated by IcoMoon.io -->
<svg version="1.1" xmlns="http://www.w3.org/2000/svg" width="1024" height="1024" viewBox="0 0 1024 1024">
<title></title>
<g id="icomoon-ignore">
</g>
<path fill="#000" d="M787.149 997.069c35.738-35.738 35.738-93.491 0-129.331l-355.84-355.84 355.84-355.738c35.738-35.738 35.738-93.491 0-129.331-35.738-35.738-93.491-35.738-129.331 0l-420.966 420.966c-35.738 35.738-35.738 93.491 0 129.331l420.966 420.966c34.816 34.816 93.491 34.816 129.331-0.922z"></path>
</svg>
