<!-- Generated by IcoMoon.io -->
<svg version="1.1" xmlns="http://www.w3.org/2000/svg" width="1024" height="1024" viewBox="0 0 1024 1024">
<title></title>
<g id="icomoon-ignore">
</g>
<path fill="#000" d="M196.096 978.842c9.626 7.578 22.118 10.547 34.099 8.192 14.848-3.277 28.877-9.83 40.96-19.149l240.64-172.032 240.23 172.032c12.083 9.318 26.112 15.77 40.96 19.149 12.083 2.355 24.576-0.614 34.202-8.192 9.728-6.963 16.384-17.51 18.227-29.389 1.843-14.746 0-29.594-5.53-43.418l-94.618-274.022 242.176-168.755c12.698-8.294 23.45-19.354 31.232-32.358 5.939-10.547 6.963-23.040 2.765-34.406-3.789-11.366-12.083-20.787-23.040-25.805-14.029-6.246-29.286-9.011-44.544-8.090l-296.96 1.946-90.214-276.48c-4.403-14.438-12.083-27.75-22.426-38.707-8.602-8.704-20.378-13.414-32.563-13.21-12.083-0.205-23.654 4.608-32.154 13.21-10.24 11.059-17.818 24.371-22.016 38.81l-90.112 276.48-296.96-1.946c-15.258-0.922-30.515 1.946-44.544 8.090-11.059 4.915-19.456 14.234-23.347 25.702-4.198 11.264-3.174 23.859 2.662 34.304 7.782 13.005 18.534 24.064 31.232 32.358l242.278 168.858-95.027 274.534c-5.427 13.824-7.373 28.672-5.53 43.418 1.946 11.571 8.397 22.016 17.92 28.877z"></path>
</svg>
