<!-- Generated by IcoMoon.io -->
<svg version="1.1" xmlns="http://www.w3.org/2000/svg" width="1024" height="1024" viewBox="0 0 1024 1024">
<title></title>
<g id="icomoon-ignore">
</g>
<path fill="#000" d="M1004.749 354.611l-480.051-207.974c-8.090-3.482-17.306-3.482-25.395 0l-480.051 207.974c-16.179 7.066-23.654 25.907-16.589 42.189 3.277 7.373 9.114 13.312 16.589 16.589l480.051 207.974c8.090 3.482 17.306 3.482 25.395 0l339.354-147.046v340.787c-0.205 17.306 13.21 31.744 30.515 32.87 17.613 0.819 32.666-12.8 33.485-30.413 0-0.512 0-1.024 0-1.536v-353.28c0-5.018-3.686-9.318-8.704-9.933l-411.443-53.043c-17.51-2.253-29.901-18.33-27.648-35.84 2.15-16.589 16.794-28.774 33.485-27.853 1.536 0 457.523 58.982 457.216 58.982 8.294 1.024 15.462 6.349 18.944 13.926 2.253 5.12 8.192 7.475 13.312 5.222 0 0 0.102 0 0.205 0 16.589-6.349 24.883-24.883 18.534-41.472-3.072-8.090-9.216-14.541-17.101-17.92v0zM473.805 680.038l-267.776-116.019c-5.12-2.15-10.957 0.102-13.107 5.222-0.512 1.229-0.819 2.56-0.819 3.994v114.893c0 107.622 140.595 192 320 192s320-84.378 320-192v-114.893c0-5.53-4.506-10.035-10.035-10.035-1.331 0-2.765 0.307-3.994 0.819l-267.878 116.019c-24.371 10.547-52.019 10.547-76.39 0z"></path>
</svg>
