<svg width="16" height="16" viewBox="0 0 16 16" fill="none" xmlns="http://www.w3.org/2000/svg">
<g id="Group 895760">
<g id="Group 8368" opacity="0.01">
<path id="Rectangle 5757" d="M16 0H0V16H16V0Z" fill="#1278ED"/>
</g>
<g id="Group 8369">
<path id="Path 10106" d="M16 7.99938L14.225 5.93437L14.472 3.20538L11.847 2.59938L10.473 0.234375L8 1.31437L5.527 0.234375L4.153 2.59337L1.528 3.19338L1.775 5.92938L0 7.99938L1.775 10.0624L1.528 12.7984L4.153 13.4044L5.528 15.7634L8 14.6784L10.473 15.7584L11.848 13.3994L14.473 12.7934L14.226 10.0644L16 7.99938ZM6.611 11.4904L3.847 8.67237L4.924 7.57837L6.611 9.30138L10.866 4.96037L11.942 6.05438L6.611 11.4904Z" fill="#1278ED"/>
</g>
</g>
</svg>
