^C:\USERS\MUSTAFA\DESKTOP\CODE\WIN32\ANIMATION PART3\BITMAP.CPP|C:\USERS\MUSTAFA\DESKTOP\CODE\WIN32\ANIMATION PART3\MAIN.CPP
C:\USERS\MUSTAFA\DESKTOP\CODE\WIN32\ANIMATION PART3\DEBUG\VC141.PDB
C:\USERS\MUSTAFA\DESKTOP\CODE\WIN32\ANIMATION PART3\DEBUG\VC141.IDB
C:\USERS\MUSTAFA\DESKTOP\CODE\WIN32\ANIMATION PART3\DEBUG\MAIN.OBJ
C:\USERS\MUSTAFA\DESKTOP\CODE\WIN32\ANIMATION PART3\DEBUG\BITMAP.OBJ
^C:\USERS\MUSTAFA\DESKTOP\CODE\WIN32\ANIMATION PART3\BITMAP.CPP|C:\USERS\MUSTAFA\DESKTOP\CODE\WIN32\ANIMATION PART3\MAIN.CPP|C:\USERS\MUSTAFA\DESKTOP\CODE\WIN32\ANIMATION PART3\SPRITE.CPP
C:\USERS\MUSTAFA\DESKTOP\CODE\WIN32\ANIMATION PART3\DEBUG\VC141.PDB
C:\USERS\MUSTAFA\DESKTOP\CODE\WIN32\ANIMATION PART3\DEBUG\VC141.IDB
C:\USERS\MUSTAFA\DESKTOP\CODE\WIN32\ANIMATION PART3\DEBUG\SPRITE.OBJ
C:\USERS\MUSTAFA\DESKTOP\CODE\WIN32\ANIMATION PART3\DEBUG\MAIN.OBJ
C:\USERS\MUSTAFA\DESKTOP\CODE\WIN32\ANIMATION PART3\DEBUG\BITMAP.OBJ
^C:\USERS\MUSTAFA\DESKTOP\CODE\WIN32\ANIMATION PART3\BITMAP.CPP
C:\USERS\MUSTAFA\DESKTOP\CODE\WIN32\ANIMATION PART3\DEBUG\VC141.PDB
^C:\USERS\MUSTAFA\DESKTOP\CODE\WIN32\ANIMATION PART3\MAIN.CPP|C:\USERS\MUSTAFA\DESKTOP\CODE\WIN32\ANIMATION PART3\SPRITE.CPP
C:\USERS\MUSTAFA\DESKTOP\CODE\WIN32\ANIMATION PART3\DEBUG\VC141.PDB
C:\USERS\MUSTAFA\DESKTOP\CODE\WIN32\ANIMATION PART3\DEBUG\VC141.IDB
C:\USERS\MUSTAFA\DESKTOP\CODE\WIN32\ANIMATION PART3\DEBUG\SPRITE.OBJ
C:\USERS\MUSTAFA\DESKTOP\CODE\WIN32\ANIMATION PART3\DEBUG\MAIN.OBJ
^C:\USERS\MUSTAFA\DESKTOP\CODE\WIN32\ANIMATION PART3\SPRITE.CPP
C:\USERS\MUSTAFA\DESKTOP\CODE\WIN32\ANIMATION PART3\DEBUG\VC141.PDB
C:\USERS\MUSTAFA\DESKTOP\CODE\WIN32\ANIMATION PART3\DEBUG\VC141.IDB
C:\USERS\MUSTAFA\DESKTOP\CODE\WIN32\ANIMATION PART3\DEBUG\SPRITE.OBJ
^C:\USERS\MUSTAFA\DESKTOP\CODE\WIN32\ANIMATION PART3\MAIN.CPP
C:\USERS\MUSTAFA\DESKTOP\CODE\WIN32\ANIMATION PART3\DEBUG\VC141.PDB
C:\USERS\MUSTAFA\DESKTOP\CODE\WIN32\ANIMATION PART3\DEBUG\VC141.IDB
C:\USERS\MUSTAFA\DESKTOP\CODE\WIN32\ANIMATION PART3\DEBUG\MAIN.OBJ
