^C:\USERS\MUSTAFA\DESKTOP\CODE\WIN32\ANIMATION PART3\BITMAP.CPP
/c /ZI /nologo /W3 /WX- /diagnostics:classic /Od /Oy- /D WIN32 /D _DEBUG /D _WINDOWS /D _VC80_UPGRADE=0x0710 /D _MBCS /Gm- /EHsc /RTC1 /MTd /GS /fp:precise /Zc:wchar_t /Zc:forScope /Zc:inline /Fo".\DEBUG/" /Fd".\DEBUG/VC141.PDB" /Gd /TP /analyze- /FC C:\USERS\MUSTAFA\DESKTOP\CODE\WIN32\ANIMATION PART3\BITMAP.CPP
^C:\USERS\MUSTAFA\DESKTOP\CODE\WIN32\ANIMATION PART3\SPRITE.CPP
/c /ZI /nologo /W3 /WX- /diagnostics:classic /Od /Oy- /D WIN32 /D _DEBUG /D _WINDOWS /D _VC80_UPGRADE=0x0710 /D _MBCS /Gm- /EHsc /RTC1 /MTd /GS /fp:precise /Zc:wchar_t /Zc:forScope /Zc:inline /Fo".\DEBUG/" /Fd".\DEBUG/VC141.PDB" /Gd /TP /analyze- /FC C:\USERS\MUSTAFA\DESKTOP\CODE\WIN32\ANIMATION PART3\SPRITE.CPP
^C:\USERS\MUSTAFA\DESKTOP\CODE\WIN32\ANIMATION PART3\MAIN.CPP
/c /ZI /nologo /W3 /WX- /diagnostics:classic /Od /Oy- /D WIN32 /D _DEBUG /D _WINDOWS /D _VC80_UPGRADE=0x0710 /D _MBCS /Gm- /EHsc /RTC1 /MTd /GS /fp:precise /Zc:wchar_t /Zc:forScope /Zc:inline /Fo".\DEBUG/" /Fd".\DEBUG/VC141.PDB" /Gd /TP /analyze- /FC C:\USERS\MUSTAFA\DESKTOP\CODE\WIN32\ANIMATION PART3\MAIN.CPP
