^C:\USERS\MUSTAFA\SOURCE\REPOS\OPENGL\OPENGL\MAIN.CPP|C:\USERS\MUSTAFA\SOURCE\REPOS\OPENGL\OPENGL\MAIN2.CPP
C:\USERS\MUSTAFA\SOURCE\REPOS\OPENGL\OPENGL\DEBUG\VC141.PDB
C:\USERS\MUSTAFA\SOURCE\REPOS\OPENGL\OPENGL\DEBUG\VC141.IDB
C:\USERS\MUSTAFA\SOURCE\REPOS\OPENGL\OPENGL\DEBUG\MAIN2.OBJ
C:\USERS\MUSTAFA\SOURCE\REPOS\OPENGL\OPENGL\DEBUG\MAIN.OBJ
^C:\USERS\MUSTAFA\SOURCE\REPOS\OPENGL\OPENGL\MAIN2.CPP
C:\USERS\MUSTAFA\SOURCE\REPOS\OPENGL\OPENGL\DEBUG\VC141.PDB
^C:\USERS\MUSTAFA\DOWNLOADS\TEXTURE LOADER FILES\TEXTURE.CPP|C:\USERS\MUSTAFA\SOURCE\REPOS\OPENGL\OPENGL\MAIN.CPP
C:\USERS\MUSTAFA\SOURCE\REPOS\OPENGL\OPENGL\DEBUG\VC141.PDB
C:\USERS\MUSTAFA\SOURCE\REPOS\OPENGL\OPENGL\DEBUG\VC141.IDB
C:\USERS\MUSTAFA\SOURCE\REPOS\OPENGL\OPENGL\DEBUG\MAIN.OBJ
^C:\USERS\MUSTAFA\SOURCE\REPOS\OPENGL\OPENGL\MAIN.CPP|C:\USERS\MUSTAFA\SOURCE\REPOS\OPENGL\OPENGL\PENGUIN.CPP
C:\USERS\MUSTAFA\SOURCE\REPOS\OPENGL\OPENGL\DEBUG\VC141.PDB
C:\USERS\MUSTAFA\SOURCE\REPOS\OPENGL\OPENGL\DEBUG\VC141.IDB
C:\USERS\MUSTAFA\SOURCE\REPOS\OPENGL\OPENGL\DEBUG\PENGUIN.OBJ
C:\USERS\MUSTAFA\SOURCE\REPOS\OPENGL\OPENGL\DEBUG\MAIN.OBJ
^C:\USERS\MUSTAFA\SOURCE\REPOS\OPENGL\OPENGL\PENGUIN.CPP
C:\USERS\MUSTAFA\SOURCE\REPOS\OPENGL\OPENGL\DEBUG\VC141.PDB
^C:\USERS\MUSTAFA\SOURCE\REPOS\OPENGL\OPENGL\MAIN.CPP
C:\USERS\MUSTAFA\SOURCE\REPOS\OPENGL\OPENGL\DEBUG\VC141.PDB
C:\USERS\MUSTAFA\SOURCE\REPOS\OPENGL\OPENGL\DEBUG\VC141.IDB
C:\USERS\MUSTAFA\SOURCE\REPOS\OPENGL\OPENGL\DEBUG\MAIN.OBJ
^C:\USERS\MUSTAFA\DESKTOP\MUSTAFA_DZANIC_ZAVRSNIPROJEKAT\OPENGL\OPENGL\MAIN.CPP|C:\USERS\MUSTAFA\DESKTOP\MUSTAFA_DZANIC_ZAVRSNIPROJEKAT\OPENGL\OPENGL\PENGUIN.CPP
C:\USERS\MUSTAFA\DESKTOP\MUSTAFA_DZANIC_ZAVRSNIPROJEKAT\OPENGL\OPENGL\DEBUG\VC141.PDB
C:\USERS\MUSTAFA\DESKTOP\MUSTAFA_DZANIC_ZAVRSNIPROJEKAT\OPENGL\OPENGL\DEBUG\VC141.IDB
C:\USERS\MUSTAFA\DESKTOP\MUSTAFA_DZANIC_ZAVRSNIPROJEKAT\OPENGL\OPENGL\DEBUG\PENGUIN.OBJ
^C:\USERS\MUSTAFA\DESKTOP\MUSTAFA_DZANIC_ZAVRSNIPROJEKAT\OPENGL\OPENGL\PENGUIN.CPP
C:\USERS\MUSTAFA\DESKTOP\MUSTAFA_DZANIC_ZAVRSNIPROJEKAT\OPENGL\OPENGL\DEBUG\PENGUIN.OBJ
