{
    "apps": {
        "name": "musicoin-site",
        "script": "./musicoin.org/src/server.js",
        "watch": false,
        "exec_mode": "cluster_mode",
        "instances": 10,
        //"cron_restart": "*/1 * * * *",
        "env": {
          "PORT":"3000",
           "NODE_ENV": "production",
           "AUTH_CALLBACK_ENDPOINT":"https://musicoin.org",
           "PUBLIC_PAGES_ENABLED":"true",
           "SESSION_DOMAIN":".musicoin.org",
           "MONGO_ENDPOINT":"",
           "MUSICOIN_CLIENT_ID":"",
           "MUSICOIN_API_ENDPOINT":"",
           "REDIS_ENDPOINT":"redis://localhost:6379",
           "SENDGRID_API_KEY":"",
           "GOOGLE_CLIENT_ID":"",
           "GOOGLE_SECRET":"",
           "CAPTCHA_SECRET":"",
           "TWITTER_CLIENT_ID":"",
           "TWITTER_SECRET":"",
           "FACEBOOK_CLIENT_ID":"",
           "FACEBOOK_SECRET":"",
           "CORS":"['https://musicoin.org', 'https://t1.musicoin.org', 'https://www.musicoin.org', 'https://www.twitter.com', 'https://twitter.com', 'https://staging.musicoin.org', 'https://forum.musicoin.org', 'https://englandistillbelieve.com', 'http://educationalgaming.org/', 'http://www.alentagus.com', 'http://alentagus.com', 'http://djlethalskillz.com', 'https://a.musicoin.org']"
         }
    }
}
