<svg width="100%" height="100%" viewBox="0 0 13 20" fill="none" xmlns="http://www.w3.org/2000/svg">
<path d="M9.97632 0C10.5235 0 11.0497 0.210471 11.4707 0.610366C12.2915 1.4312 12.2915 2.77822 11.4707 3.59905L5.0934 9.99737L11.4917 16.3957C12.3125 17.2165 12.3125 18.5635 11.4917 19.3844C10.6709 20.2052 9.32386 20.2052 8.50303 19.3844L0.610366 11.4917C0.210471 11.0918 0 10.5656 0 9.99737C0 9.4291 0.231518 8.90292 0.610366 8.50303L8.48198 0.610366C8.90292 0.210471 9.45014 0 9.97632 0Z" fill="currentColor"/>
</svg>
