<svg width="26" height="24" viewBox="0 0 26 24" fill="none" xmlns="http://www.w3.org/2000/svg">
<path d="M17.0499 2C15.3989 2 13.8156 2.63214 12.6482 3.75736C11.4807 4.88258 10.8249 6.4087 10.8249 8C10.8249 8.26522 10.9342 8.51957 11.1288 8.70711C11.3233 8.89464 11.5872 9 11.8624 9C12.1376 9 12.4015 8.89464 12.596 8.70711C12.7906 8.51957 12.8999 8.26522 12.8999 8C12.8999 7.20887 13.1433 6.43552 13.5993 5.77772C14.0553 5.11992 14.7035 4.60723 15.4618 4.30448C16.2201 4.00173 17.0545 3.92252 17.8595 4.07686C18.6645 4.2312 19.404 4.61216 19.9844 5.17157C20.5648 5.73098 20.96 6.44371 21.1202 7.21964C21.2803 7.99556 21.1981 8.79983 20.884 9.53073C20.5699 10.2616 20.038 10.8864 19.3555 11.3259C18.6731 11.7654 17.8707 12 17.0499 12C16.7747 12 16.5108 12.1054 16.3163 12.2929C16.1217 12.4804 16.0124 12.7348 16.0124 13C16.0124 13.2652 16.1217 13.5196 16.3163 13.7071C16.5108 13.8946 16.7747 14 17.0499 14C18.7009 14 20.2842 13.3679 21.4516 12.2426C22.6191 11.1174 23.2749 9.5913 23.2749 8C23.2749 6.4087 22.6191 4.88258 21.4516 3.75736C20.2842 2.63214 18.7009 2 17.0499 2Z" fill="#898B8F"/>
<path d="M2.5249 16C2.5249 17.5913 3.18075 19.1174 4.34816 20.2426C5.51558 21.3679 7.09893 22 8.7499 22C10.4009 22 11.9842 21.3679 13.1516 20.2426C14.3191 19.1174 14.9749 17.5913 14.9749 16C14.9749 15.7348 14.8656 15.4804 14.671 15.2929C14.4765 15.1054 14.2126 15 13.9374 15C13.6622 15 13.3983 15.1054 13.2038 15.2929C13.0092 15.4804 12.8999 15.7348 12.8999 16C12.8999 16.7911 12.6565 17.5645 12.2005 18.2223C11.7445 18.8801 11.0964 19.3928 10.338 19.6955C9.57973 19.9983 8.7453 20.0775 7.94028 19.9231C7.13526 19.7688 6.3958 19.3878 5.81541 18.8284C5.23502 18.269 4.83977 17.5563 4.67964 16.7804C4.51951 16.0044 4.6017 15.2002 4.9158 14.4693C5.22991 13.7384 5.76182 13.1136 6.44429 12.6741C7.12675 12.2346 7.92911 12 8.7499 12C9.02506 12 9.28896 11.8946 9.48353 11.7071C9.67809 11.5196 9.7874 11.2652 9.7874 11C9.7874 10.7348 9.67809 10.4804 9.48353 10.2929C9.28896 10.1054 9.02506 10 8.7499 10C7.09893 10 5.51558 10.6321 4.34816 11.7574C3.18075 12.8826 2.5249 14.4087 2.5249 16Z" fill="#898B8F"/>
<path d="M8.74471 17.0008C8.47062 17.0008 8.20767 16.8963 8.01328 16.71C7.82004 16.5227 7.71158 16.2692 7.71158 16.005C7.71158 15.7408 7.82004 15.4874 8.01328 15.3L16.3133 7.30003C16.5118 7.1362 16.7671 7.05059 17.0282 7.06032C17.2893 7.07004 17.537 7.17437 17.7217 7.35246C17.9065 7.53056 18.0148 7.7693 18.0249 8.02097C18.0349 8.27265 17.9461 8.51873 17.7762 8.71003L9.47615 16.71C9.28176 16.8963 9.01881 17.0008 8.74471 17.0008Z" fill="#898B8F"/>
</svg>
