<svg width="26" height="24" viewBox="0 0 26 24" fill="none" xmlns="http://www.w3.org/2000/svg">
<path d="M12.5988 1C7.03494 1 2.5249 5.25954 2.5249 10.6224C2.5249 15.0745 6.23786 19.3667 8.47109 23L10.6505 20.2258C11.281 20.3448 11.9321 20.4141 12.5988 20.4141C18.1627 20.4141 22.6728 16.0697 22.6728 10.7071C22.6728 5.34423 18.1627 1 12.5988 1ZM12.5988 15.2981C9.9697 15.2981 7.83888 13.2439 7.83888 10.7099C7.83888 8.17648 9.9697 6.12234 12.5988 6.12234C15.2276 6.12234 17.3588 8.17648 17.3588 10.7099C17.3588 13.2439 15.2276 15.2981 12.5988 15.2981Z" fill="#898B8F"/>
</svg>
