{ 
    "SITE_TITLE" : "Beyond Theories",
    "SS3_LINK": "http://localhost:3000/",
    "PAGE_SIZE":20,
    "PAGINATION_SIZE":5,
    "MY_NAMESPACE":"1b671a64-40d5-491e-99b0-da01ff1f3341",
    "DB_CONNECTION" : {
    "HOST": "localhost",
    "USER": "root",
    "PASSWORD": "mysql",
    "SECURE":false,
    "DB": "beyondtheory",
    "DIALECT": "mysql",
    "POOL": {
      "MAX": 5,
      "MIN": 0,
      "ACQUIRE": 30000,
      "IDLE": 10000
    }
  }
}
  
  
