[api-updater (non-obsolete-error-filter)] 23/06/2021 13:16:18 : Starting C:/Program Files/Unity/Hub/Editor/2020.3.0f1/Editor/Data/Tools/ScriptUpdater/APIUpdater.NonObsoleteApiUpdaterDetector.exe
[api-updater (non-obsolete-error-filter)] 
----------------------------------
jit/startup time      : 1424,9872ms
moved types parse time: 89ms
candidates parse time : 1ms
C# parse time         : 1514ms
candidates check time : 28ms
console write time    : 5ms

[api-updater (non-obsolete-error-filter)] 23/06/2021 13:19:59 : Starting C:/Program Files/Unity/Hub/Editor/2020.3.0f1/Editor/Data/Tools/ScriptUpdater/APIUpdater.NonObsoleteApiUpdaterDetector.exe
[api-updater (non-obsolete-error-filter)] 
----------------------------------
jit/startup time      : 86,7952ms
moved types parse time: 52ms
candidates parse time : 1ms
C# parse time         : 233ms
candidates check time : 36ms
console write time    : 0ms

[api-updater (non-obsolete-error-filter)] 23/06/2021 13:21:00 : Starting C:/Program Files/Unity/Hub/Editor/2020.3.0f1/Editor/Data/Tools/ScriptUpdater/APIUpdater.NonObsoleteApiUpdaterDetector.exe
[api-updater (non-obsolete-error-filter)] 
----------------------------------
jit/startup time      : 79,3299ms
moved types parse time: 61ms
candidates parse time : 1ms
C# parse time         : 232ms
candidates check time : 31ms
console write time    : 0ms

[api-updater (non-obsolete-error-filter)] 23/06/2021 13:21:27 : Starting C:/Program Files/Unity/Hub/Editor/2020.3.0f1/Editor/Data/Tools/ScriptUpdater/APIUpdater.NonObsoleteApiUpdaterDetector.exe
[api-updater (non-obsolete-error-filter)] 
----------------------------------
jit/startup time      : 85,5547ms
moved types parse time: 54ms
candidates parse time : 1ms
C# parse time         : 226ms
candidates check time : 29ms
console write time    : 0ms

[api-updater (non-obsolete-error-filter)] 23/06/2021 13:23:35 : Starting C:/Program Files/Unity/Hub/Editor/2020.3.0f1/Editor/Data/Tools/ScriptUpdater/APIUpdater.NonObsoleteApiUpdaterDetector.exe
[api-updater (non-obsolete-error-filter)] 
----------------------------------
jit/startup time      : 91,7827ms
moved types parse time: 51ms
candidates parse time : 1ms
C# parse time         : 221ms
candidates check time : 37ms
console write time    : 0ms

[api-updater (non-obsolete-error-filter)] 23/06/2021 13:23:50 : Starting C:/Program Files/Unity/Hub/Editor/2020.3.0f1/Editor/Data/Tools/ScriptUpdater/APIUpdater.NonObsoleteApiUpdaterDetector.exe
[api-updater (non-obsolete-error-filter)] 
----------------------------------
jit/startup time      : 80,2945ms
moved types parse time: 56ms
candidates parse time : 1ms
C# parse time         : 241ms
candidates check time : 43ms
console write time    : 0ms

[api-updater (non-obsolete-error-filter)] 23/06/2021 18:32:21 : Starting C:/Program Files/Unity/Hub/Editor/2020.3.0f1/Editor/Data/Tools/ScriptUpdater/APIUpdater.NonObsoleteApiUpdaterDetector.exe
[api-updater (non-obsolete-error-filter)] 
----------------------------------
jit/startup time      : 440,4806ms
moved types parse time: 50ms
candidates parse time : 1ms
C# parse time         : 208ms
candidates check time : 31ms
console write time    : 0ms

[api-updater (non-obsolete-error-filter)] 23/06/2021 18:33:34 : Starting C:/Program Files/Unity/Hub/Editor/2020.3.0f1/Editor/Data/Tools/ScriptUpdater/APIUpdater.NonObsoleteApiUpdaterDetector.exe
[api-updater (non-obsolete-error-filter)] 
----------------------------------
jit/startup time      : 98,2472ms
moved types parse time: 56ms
candidates parse time : 1ms
C# parse time         : 215ms
candidates check time : 38ms
console write time    : 0ms

[api-updater (non-obsolete-error-filter)] 23/06/2021 18:59:36 : Starting C:/Program Files/Unity/Hub/Editor/2020.3.0f1/Editor/Data/Tools/ScriptUpdater/APIUpdater.NonObsoleteApiUpdaterDetector.exe
[api-updater (non-obsolete-error-filter)] 
----------------------------------
jit/startup time      : 82,7795ms
moved types parse time: 60ms
candidates parse time : 1ms
C# parse time         : 225ms
candidates check time : 33ms
console write time    : 0ms

[api-updater (non-obsolete-error-filter)] 23/06/2021 19:16:37 : Starting C:/Program Files/Unity/Hub/Editor/2020.3.0f1/Editor/Data/Tools/ScriptUpdater/APIUpdater.NonObsoleteApiUpdaterDetector.exe
[api-updater (non-obsolete-error-filter)] 
----------------------------------
jit/startup time      : 82,7789ms
moved types parse time: 49ms
candidates parse time : 1ms
C# parse time         : 226ms
candidates check time : 30ms
console write time    : 0ms

[api-updater (non-obsolete-error-filter)] 23/06/2021 20:24:16 : Starting C:/Program Files/Unity/Hub/Editor/2020.3.0f1/Editor/Data/Tools/ScriptUpdater/APIUpdater.NonObsoleteApiUpdaterDetector.exe
[api-updater (non-obsolete-error-filter)] 
----------------------------------
jit/startup time      : 120,7104ms
moved types parse time: 49ms
candidates parse time : 1ms
C# parse time         : 236ms
candidates check time : 29ms
console write time    : 0ms

[api-updater (non-obsolete-error-filter)] 23/06/2021 20:33:19 : Starting C:/Program Files/Unity/Hub/Editor/2020.3.0f1/Editor/Data/Tools/ScriptUpdater/APIUpdater.NonObsoleteApiUpdaterDetector.exe
[api-updater (non-obsolete-error-filter)] 
----------------------------------
jit/startup time      : 294,1492ms
moved types parse time: 49ms
candidates parse time : 1ms
C# parse time         : 234ms
candidates check time : 40ms
console write time    : 0ms

[api-updater (non-obsolete-error-filter)] 23/06/2021 22:39:02 : Starting C:/Program Files/Unity/Hub/Editor/2020.3.0f1/Editor/Data/Tools/ScriptUpdater/APIUpdater.NonObsoleteApiUpdaterDetector.exe
[api-updater (non-obsolete-error-filter)] 
----------------------------------
jit/startup time      : 294,9838ms
moved types parse time: 53ms
candidates parse time : 1ms
C# parse time         : 210ms
candidates check time : 28ms
console write time    : 0ms

[api-updater (non-obsolete-error-filter)] 23/06/2021 23:07:46 : Starting C:/Program Files/Unity/Hub/Editor/2020.3.0f1/Editor/Data/Tools/ScriptUpdater/APIUpdater.NonObsoleteApiUpdaterDetector.exe
[api-updater (non-obsolete-error-filter)] 
----------------------------------
jit/startup time      : 102,725ms
moved types parse time: 55ms
candidates parse time : 1ms
C# parse time         : 230ms
candidates check time : 33ms
console write time    : 0ms

[api-updater (non-obsolete-error-filter)] 23/06/2021 23:26:42 : Starting C:/Program Files/Unity/Hub/Editor/2020.3.0f1/Editor/Data/Tools/ScriptUpdater/APIUpdater.NonObsoleteApiUpdaterDetector.exe
[api-updater (non-obsolete-error-filter)] 
----------------------------------
jit/startup time      : 84,772ms
moved types parse time: 56ms
candidates parse time : 1ms
C# parse time         : 206ms
candidates check time : 76ms
console write time    : 0ms

[api-updater (non-obsolete-error-filter)] 23/06/2021 23:26:43 : Starting C:/Program Files/Unity/Hub/Editor/2020.3.0f1/Editor/Data/Tools/ScriptUpdater/APIUpdater.NonObsoleteApiUpdaterDetector.exe
[api-updater (non-obsolete-error-filter)] 
----------------------------------
jit/startup time      : 92,7497ms
moved types parse time: 50ms
candidates parse time : 2ms
C# parse time         : 176ms
candidates check time : 40ms
console write time    : 0ms

[api-updater (non-obsolete-error-filter)] 23/06/2021 23:28:28 : Starting C:/Program Files/Unity/Hub/Editor/2020.3.0f1/Editor/Data/Tools/ScriptUpdater/APIUpdater.NonObsoleteApiUpdaterDetector.exe
[api-updater (non-obsolete-error-filter)] 
----------------------------------
jit/startup time      : 79,7854ms
moved types parse time: 50ms
candidates parse time : 1ms
C# parse time         : 182ms
candidates check time : 42ms
console write time    : 0ms

[api-updater (non-obsolete-error-filter)] 23/06/2021 23:28:28 : Starting C:/Program Files/Unity/Hub/Editor/2020.3.0f1/Editor/Data/Tools/ScriptUpdater/APIUpdater.NonObsoleteApiUpdaterDetector.exe
[api-updater (non-obsolete-error-filter)] 
----------------------------------
jit/startup time      : 88,7892ms
moved types parse time: 50ms
candidates parse time : 1ms
C# parse time         : 184ms
candidates check time : 41ms
console write time    : 0ms

[api-updater (non-obsolete-error-filter)] 23/06/2021 23:30:02 : Starting C:/Program Files/Unity/Hub/Editor/2020.3.0f1/Editor/Data/Tools/ScriptUpdater/APIUpdater.NonObsoleteApiUpdaterDetector.exe
[api-updater (non-obsolete-error-filter)] 
----------------------------------
jit/startup time      : 438,1347ms
moved types parse time: 53ms
candidates parse time : 1ms
C# parse time         : 168ms
candidates check time : 28ms
console write time    : 0ms

[api-updater (non-obsolete-error-filter)] 23/06/2021 23:30:27 : Starting C:/Program Files/Unity/Hub/Editor/2020.3.0f1/Editor/Data/Tools/ScriptUpdater/APIUpdater.NonObsoleteApiUpdaterDetector.exe
[api-updater (non-obsolete-error-filter)] 
----------------------------------
jit/startup time      : 75,919ms
moved types parse time: 49ms
candidates parse time : 1ms
C# parse time         : 163ms
candidates check time : 27ms
console write time    : 0ms

[api-updater (non-obsolete-error-filter)] 23/06/2021 23:30:28 : Starting C:/Program Files/Unity/Hub/Editor/2020.3.0f1/Editor/Data/Tools/ScriptUpdater/APIUpdater.NonObsoleteApiUpdaterDetector.exe
[api-updater (non-obsolete-error-filter)] 
----------------------------------
jit/startup time      : 85,7706ms
moved types parse time: 48ms
candidates parse time : 1ms
C# parse time         : 159ms
candidates check time : 23ms
console write time    : 0ms

[api-updater (non-obsolete-error-filter)] 23/06/2021 23:31:06 : Starting C:/Program Files/Unity/Hub/Editor/2020.3.0f1/Editor/Data/Tools/ScriptUpdater/APIUpdater.NonObsoleteApiUpdaterDetector.exe
[api-updater (non-obsolete-error-filter)] 
----------------------------------
jit/startup time      : 76,7928ms
moved types parse time: 48ms
candidates parse time : 1ms
C# parse time         : 303ms
candidates check time : 26ms
console write time    : 0ms

[api-updater (non-obsolete-error-filter)] 23/06/2021 23:31:06 : Starting C:/Program Files/Unity/Hub/Editor/2020.3.0f1/Editor/Data/Tools/ScriptUpdater/APIUpdater.NonObsoleteApiUpdaterDetector.exe
[api-updater (non-obsolete-error-filter)] 
----------------------------------
jit/startup time      : 83,0608ms
moved types parse time: 49ms
candidates parse time : 1ms
C# parse time         : 180ms
candidates check time : 26ms
console write time    : 0ms

