<svg xmlns="http://www.w3.org/2000/svg" width="20" height="20" fill="none" viewBox="0 0 20 20">
    <path fill="#000" d="M10 0C4.477 0 0 4.402 0 9.831a9.7 9.7 0 0 0 2.522 6.527L1.472 20l3.843-1.481A10.09 10.09 0 0 0 10 19.663c5.523 0 10-4.402 10-9.832C20 4.401 15.523 0 10 0zm4.09 15.624c-1.156.042-3.428-.228-6.326-2.9-2.754-2.649-2.994-5.083-2.95-6.22.042-1.137 1.542-2.022 1.542-2.022l1.329.084s.728 2.023.985 2.528c.257.506.086.717.086.717s-.771.885-.943 1.011c-.171.127-.129.262-.086.337.427.742 1.255 1.632 1.62 2.008.383.359 1.288 1.173 2.042 1.592.077.043.215.084.343-.084.129-.168 1.029-.927 1.029-.927s.214-.168.728.084c.515.253 2.572.97 2.572.97l.085 1.306s-.9 1.474-2.057 1.516z"/>
</svg>
