<svg xmlns="http://www.w3.org/2000/svg" width="20" height="20" fill="none" viewBox="0 0 20 20">
    <path fill="none" d="M0 0h20v20H0z"/>
    <path fill="#000" d="M10 4.798c-2.823 0-5.161 2.299-5.161 5.162A5.146 5.146 0 0 0 10 15.12c2.863 0 5.161-2.338 5.161-5.16 0-2.823-2.338-5.162-5.161-5.162zm0 8.468A3.321 3.321 0 0 1 6.694 9.96 3.321 3.321 0 0 1 10 6.653a3.321 3.321 0 0 1 3.306 3.307A3.321 3.321 0 0 1 10 13.266zM15.363 5.847a1.17 1.17 0 1 0 0-2.339 1.17 1.17 0 0 0 0 2.339z"/>
    <path fill="#000" d="M18.387 1.653C17.34.565 15.847 0 14.153 0H5.847C2.339 0 0 2.339 0 5.847v8.266c0 1.734.565 3.226 1.694 4.314C2.782 19.476 4.234 20 5.887 20h8.226c1.734 0 3.185-.564 4.234-1.573C19.435 17.38 20 15.887 20 14.153V5.847c0-1.694-.564-3.145-1.613-4.194zm-.161 12.5c0 1.25-.444 2.258-1.17 2.944-.725.685-1.733 1.048-2.943 1.048H5.887c-1.21 0-2.218-.363-2.943-1.048-.726-.726-1.09-1.734-1.09-2.984V5.847c0-1.21.364-2.218 1.09-2.944.685-.685 1.733-1.048 2.943-1.048h8.306c1.21 0 2.218.363 2.944 1.089.686.725 1.089 1.733 1.089 2.903v8.306z"/>
</svg>
