<svg xmlns="http://www.w3.org/2000/svg" width="20" height="19" fill="none" viewBox="0 0 20 19">
    <path fill="#000" d="M9.5 0C4.253 0 0 4.254 0 9.5 0 14.747 4.253 19 9.5 19S19 14.747 19 9.5C19 4.254 14.748 0 9.5 0zm2.515 9.46H10.37v5.867H7.93V9.462h-1.16V7.389h1.16V6.047c0-.96.456-2.46 2.461-2.46l1.806.007v2.012h-1.311c-.214 0-.517.107-.517.563v1.22h1.859l-.214 2.072z"/>
</svg>
